zephyr/master: daily build zephyr-kernel-1.6.99-170127-a45dd12 Failure


donotreply@...
 

zephyr/master: daily build zephyr-kernel-1.6.99-170127-a45dd12 Failure



job zephyr-sanity build number 408 failed
see: https://jenkins.zephyrproject.org/job/zephyr-sanity/408/

***** BOOTING ZEPHYR OS v1.6.99 - BUILD: Jan 28 2017 00:31:32 *****
Running test suite test_mpool_api
tc_start() - test_mpool_alloc_free_thread
===================================================================
PASS - test_mpool_alloc_free_thread.
tc_start() - test_mpool_alloc_free_isr
ASSERTION FAIL [!(_kernel.nested != 0)] @ /w/workspace/zephyr-sanity/kernel/include/ksched.h:237:
---------------sanity-out/qemu_x86/tests/kernel/mem_pool/test_mpool_api/test/qemu.log---------------
qemu_nios2 tests/kernel/mem_pool/test_mpool_api/test FAILED: timeout
--------------sanity-out/qemu_nios2/tests/kernel/mem_pool/test_mpool_api/test/qemu.log--------------
***** BOOTING ZEPHYR OS v1.6.99 - BUILD: Jan 28 2017 00:31:38 *****
Running test suite test_mpool_api
tc_start() - test_mpool_alloc_free_thread
===================================================================
PASS - test_mpool_alloc_free_thread.
tc_start() - test_mpool_alloc_free_isr
ASSERTION FAIL [!(_kernel.nested != 0)] @ /w/workspace/zephyr-sanity/kernel/include/ksched.h:237:
--------------sanity-out/qemu_nios2/tests/kernel/mem_pool/test_mpool_api/test/qemu.log--------------
qemu_x86_iamcu tests/kernel/timer/timer_api/test FAILED: timeout
----------------sanity-out/qemu_x86_iamcu/tests/kernel/timer/timer_api/test/qemu.log----------------
Running test suite test_timer_api
tc_start() - test_timer_duration_period
ASSERTION FAIL [!(_kernel.nested != 0)] @ /w/workspace/zephyr-sanity/kernel/timer.c:134:
----------------sanity-out/qemu_x86_iamcu/tests/kernel/timer/timer_api/test/qemu.log----------------
0 of 43 tests passed with 0 warnings in 171 seconds
Extra environment setting:
CONFIG_ASSERT=y
CONFIG_DEBUG=y
Build step 'Execute shell' marked build as failure


job zephyr-sanity build number 407 failed
see: https://jenkins.zephyrproject.org/job/zephyr-sanity/407/

CC ext/lib/crypto/mbedtls/library/x509_crl.o
CC ext/lib/crypto/mbedtls/library/x509_crt.o
CC ext/lib/crypto/mbedtls/library/x509_csr.o
CC ext/lib/crypto/mbedtls/library/x509write_crt.o
CC ext/lib/crypto/mbedtls/library/x509write_csr.o
CC ext/lib/crypto/mbedtls/library/xtea.o
make[7]: Target `__build' not remade because of errors.
make[6]: *** [ext/lib/crypto/mbedtls] Error 2
make[6]: Target `__build' not remade because of errors.
make[5]: *** [ext/lib/crypto] Error 2
make[5]: Target `__build' not remade because of errors.
make[4]: *** [ext/lib] Error 2
make[4]: Target `__build' not remade because of errors.
make[3]: *** [ext] Error 2
make[3]: Target `all' not remade because of errors.
make[3]: Leaving directory `/w/workspace/zephyr-sanity/sanity-out/qemu_x86/tests/crypto/test_mbedtls/test'
make[2]: *** [sub-make] Error 2
make[2]: Target `all' not remade because of errors.
make[2]: Leaving directory `/w/workspace/zephyr-sanity'
make[1]: *** [all] Error 2
make[1]: Leaving directory `/w/workspace/zephyr-sanity/tests/crypto/test_mbedtls'
Generating LALR tables
Platform 'zedboard_pulpino' not specified in any arch .ini file and will not be tested
Platform 'qemu_riscv32' not specified in any arch .ini file and will not be tested
--------------------sanity-out/qemu_x86/tests/crypto/test_mbedtls/test/build.log--------------------
0 of 31 tests passed with 0 warnings in 59 seconds
Extra environment setting:
CONFIG_DEBUG=y
Build step 'Execute shell' marked build as failure


job zephyr-sanity build number 406 failed
see: https://jenkins.zephyrproject.org/job/zephyr-sanity/406/

qemu_cortex_m3 tests/kernel/timer/timer_api/test FAILED: timeout
----------------sanity-out/qemu_cortex_m3/tests/kernel/timer/timer_api/test/qemu.log----------------
Running test suite test_timer_api
tc_start() - test_timer_duration_period
ASSERTION FAIL [!_IsInIsr()] @ /w/workspace/zephyr-sanity/kernel/timer.c:134:
----------------sanity-out/qemu_cortex_m3/tests/kernel/timer/timer_api/test/qemu.log----------------
qemu_nios2 tests/kernel/pipe/test_pipe_api/test FAILED: timeout
----------------sanity-out/qemu_nios2/tests/kernel/pipe/test_pipe_api/test/qemu.log-----------------
Running test suite test_pipe_api
tc_start() - test_pipe_thread2thread
===================================================================
PASS - test_pipe_thread2thread.
tc_start() - test_pipe_thread2isr
ASSERTION FAIL [!(_kernel.nested != 0)] @ /w/workspace/zephyr-sanity/kernel/include/ksched.h:237:
----------------sanity-out/qemu_nios2/tests/kernel/pipe/test_pipe_api/test/qemu.log-----------------
qemu_cortex_m3 tests/kernel/mem_pool/test_mpool_api/test FAILED: timeout
------------sanity-out/qemu_cortex_m3/tests/kernel/mem_pool/test_mpool_api/test/qemu.log------------
***** BOOTING ZEPHYR OS v1.6.99 - BUILD: Jan 28 2017 00:40:03 *****
Running test suite test_mpool_api
tc_start() - test_mpool_alloc_free_thread
===================================================================
PASS - test_mpool_alloc_free_thread.
tc_start() - test_mpool_alloc_free_isr
ASSERTION FAIL [!_IsInIsr()] @ /w/workspace/zephyr-sanity/kernel/include/ksched.h:237:
------------sanity-out/qemu_cortex_m3/tests/kernel/mem_pool/test_mpool_api/test/qemu.log------------
0 of 12 tests passed with 0 warnings in 78 seconds
Extra environment setting:
CONFIG_ASSERT=y
Build step 'Execute shell' marked build as failure

Join builds@lists.zephyrproject.org to automatically receive all group messages.