zephyr/master: daily build zephyr-kernel-1.6.99-170205-fd74c0c Failure


donotreply@...
 

zephyr/master: daily build zephyr-kernel-1.6.99-170205-fd74c0c Failure



job zephyr-sanity build number 444 failed
see: https://jenkins.zephyrproject.org/job/zephyr-sanity/444/

===================================================================
PASS - test_mpool_alloc_free_thread.
tc_start() - test_mpool_alloc_free_isr
ASSERTION FAIL [!(_kernel.nested != 0)] @ /w/workspace/zephyr-sanity/kernel/include/ksched.h:237:
------------sanity-out/qemu_x86_iamcu/tests/kernel/mem_pool/test_mpool_api/test/qemu.log------------
qemu_nios2 tests/kernel/pipe/test_pipe_api/test FAILED: timeout
----------------sanity-out/qemu_nios2/tests/kernel/pipe/test_pipe_api/test/qemu.log-----------------
Running test suite test_pipe_api
tc_start() - test_pipe_thread2thread
===================================================================
PASS - test_pipe_thread2thread.
tc_start() - test_pipe_thread2isr
ASSERTION FAIL [!(_kernel.nested != 0)] @ /w/workspace/zephyr-sanity/kernel/include/ksched.h:237:
----------------sanity-out/qemu_nios2/tests/kernel/pipe/test_pipe_api/test/qemu.log-----------------
qemu_riscv32 tests/kernel/mem_pool/test_mpool_api/test FAILED: timeout
-------------sanity-out/qemu_riscv32/tests/kernel/mem_pool/test_mpool_api/test/qemu.log-------------
***** BOOTING ZEPHYR OS v1.6.99 - BUILD: Feb 6 2017 01:30:37 *****
Running test suite test_mpool_api
tc_start() - test_mpool_alloc_free_thread
===================================================================
PASS - test_mpool_alloc_free_thread.
tc_start() - test_mpool_alloc_free_isr
ASSERTION FAIL [!(_kernel.nested != 0)] @ /w/workspace/zephyr-sanity/kernel/include/ksched.h:237:
-------------sanity-out/qemu_riscv32/tests/kernel/mem_pool/test_mpool_api/test/qemu.log-------------
0 of 133 tests passed with 0 warnings in 197 seconds
Extra environment setting:
CONFIG_ASSERT=y
CONFIG_DEBUG=y
Build step 'Execute shell' marked build as failure


job zephyr-sanity build number 443 failed
see: https://jenkins.zephyrproject.org/job/zephyr-sanity/443/

XMM00=00000000000000000000000000000000 XMM01=00000000000000000000000000000000
XMM02=00000000000000000000000000000000 XMM03=00000000000000000000000000000000
XMM04=00000000000000000000000000000000 XMM05=00000000000000000000000000000000
XMM06=00000000000000000000000000000000 XMM07=00000000000000000000000000000000
make[3]: *** [run] Aborted (core dumped)
make[3]: Target `qemu' not remade because of errors.
make[3]: Leaving directory `/w/workspace/zephyr-sanity/sanity-out/qemu_x86/tests/legacy/kernel/test_sema/nanokernel/test'
make[2]: *** [sub-make] Error 2
make[2]: Target `qemu' not remade because of errors.
make[2]: Leaving directory `/w/workspace/zephyr-sanity'
make[1]: *** [qemu] Error 2
make[1]: Leaving directory `/w/workspace/zephyr-sanity/tests/legacy/kernel/test_sema/nanokernel'
-------------sanity-out/qemu_x86/tests/legacy/kernel/test_sema/nanokernel/test/run.log--------------
qemu_x86 tests/net/udp/test FAILED: timeout
--------------------------sanity-out/qemu_x86/tests/net/udp/test/qemu.log---------------------------
***** BOOTING ZEPHYR OS v1.6.99 - BUILD: Feb 6 2017 01:23:04 *****
***** CPU exception 13
***** Exception code: 0xd65c
Current thread ID = 0x0010fb80
Faulting segment:address = 0x8:0x10fbac
eax: 0x1102c8, ebx: 0x10d606, ecx: 0x10d66c, edx: 0xffffff7f
esi: 0x0, edi: 0x0, ebp: 0fffffff5, esp: 0x10fb64
eflags: 0x282
Fatal fault in thread 0x0010fb80! Aborting.
--------------------------sanity-out/qemu_x86/tests/net/udp/test/qemu.log---------------------------
0 of 123 tests passed with 0 warnings in 124 seconds
Extra environment setting:
CONFIG_DEBUG=y
Build step 'Execute shell' marked build as failure


job zephyr-sanity build number 442 failed
see: https://jenkins.zephyrproject.org/job/zephyr-sanity/442/

===================================================================
PASS - test_pipe_thread2thread.
tc_start() - test_pipe_thread2isr
ASSERTION FAIL [!_IsInIsr()] @ /w/workspace/zephyr-sanity/kernel/include/ksched.h:237:
--------------sanity-out/qemu_cortex_m3/tests/kernel/pipe/test_pipe_api/test/qemu.log---------------
qemu_riscv32 tests/kernel/mem_pool/test_mpool_api/test FAILED: timeout
-------------sanity-out/qemu_riscv32/tests/kernel/mem_pool/test_mpool_api/test/qemu.log-------------
***** BOOTING ZEPHYR OS v1.6.99 - BUILD: Feb 6 2017 01:37:02 *****
Running test suite test_mpool_api
tc_start() - test_mpool_alloc_free_thread
===================================================================
PASS - test_mpool_alloc_free_thread.
tc_start() - test_mpool_alloc_free_isr
ASSERTION FAIL [!(_kernel.nested != 0)] @ /w/workspace/zephyr-sanity/kernel/include/ksched.h:237:
-------------sanity-out/qemu_riscv32/tests/kernel/mem_pool/test_mpool_api/test/qemu.log-------------
qemu_cortex_m3 tests/kernel/mem_pool/test_mpool_api/test FAILED: timeout
------------sanity-out/qemu_cortex_m3/tests/kernel/mem_pool/test_mpool_api/test/qemu.log------------
***** BOOTING ZEPHYR OS v1.6.99 - BUILD: Feb 6 2017 01:37:06 *****
Running test suite test_mpool_api
tc_start() - test_mpool_alloc_free_thread
===================================================================
PASS - test_mpool_alloc_free_thread.
tc_start() - test_mpool_alloc_free_isr
ASSERTION FAIL [!_IsInIsr()] @ /w/workspace/zephyr-sanity/kernel/include/ksched.h:237:
------------sanity-out/qemu_cortex_m3/tests/kernel/mem_pool/test_mpool_api/test/qemu.log------------
0 of 100 tests passed with 0 warnings in 170 seconds
Extra environment setting:
CONFIG_ASSERT=y
Build step 'Execute shell' marked build as failure


job zephyr-sanity build number 441 failed
see: https://jenkins.zephyrproject.org/job/zephyr-sanity/441/

/w/workspace/zephyr-sanity/drivers/timer/riscv_machine_timer.c: In function ‘_sys_clock_driver_init’:
/w/workspace/zephyr-sanity/drivers/timer/riscv_machine_timer.c:78:18: error: ‘RISCV_MACHINE_TIMER_IRQ’ undeclared (first use in this function)
IRQ_CONNECT(RISCV_MACHINE_TIMER_IRQ, 0,
^~~~~~~~~~~~~~~~~~~~~~~
/w/workspace/zephyr-sanity/drivers/timer/riscv_machine_timer.c:78:18: note: each undeclared identifier is reported only once for each function it appears in
CC kernel/sys_clock.o
make[5]: *** [drivers/timer/riscv_machine_timer.o] Error 1
make[5]: Target `__build' not remade because of errors.
make[4]: *** [drivers/timer] Error 2
make[4]: Target `__build' not remade because of errors.
make[3]: *** [drivers] Error 2
CC kernel/system_work_q.o
CC kernel/thread.o
CC kernel/thread_abort.o
CC kernel/timer.o
CC kernel/work_q.o
LD kernel/built-in.o
AR kernel/lib.a
make[3]: Target `all' not remade because of errors.
make[3]: Leaving directory `/w/workspace/zephyr-sanity/sanity-out/zedboard_pulpino/tests/kernel/timer/timer_api/test'
make[2]: *** [sub-make] Error 2
make[2]: Target `all' not remade because of errors.
make[2]: Leaving directory `/w/workspace/zephyr-sanity'
make[1]: *** [all] Error 2
make[1]: Leaving directory `/w/workspace/zephyr-sanity/tests/kernel/timer/timer_api'
Generating LALR tables
--------------sanity-out/zedboard_pulpino/tests/kernel/timer/timer_api/test/build.log---------------
0 of 90 tests passed with 0 warnings in 68 seconds
Build step 'Execute shell' marked build as failure

Join builds@lists.zephyrproject.org to automatically receive all group messages.