zephyr/master: daily build zephyr-kernel-1.7.99-170313-70772ad Failure


donotreply@...
 

zephyr/master: daily build zephyr-kernel-1.7.99-170313-70772ad Failure



job zephyr-sanity build number 588 failed
see: https://jenkins.zephyrproject.org/job/zephyr-sanity/588/

make[2]: Target `all' not remade because of errors.
make[2]: Leaving directory `/w/workspace/zephyr-sanity'
make[1]: *** [all] Error 2
make[1]: Leaving directory `/w/workspace/zephyr-sanity/samples/bluetooth/central_hr'
------------------sanity-out/qemu_x86/samples/bluetooth/central_hr/test/build.log-------------------
qemu_x86 tests/net/utils/test FAILED: timeout
-------------------------sanity-out/qemu_x86/tests/net/utils/test/qemu.log--------------------------
***** BOOTING ZEPHYR OS v1.7.99 - BUILD: Mar 14 2017 05:37:53 *****
ASSERTION FAIL [num_events > 0] @ /w/workspace/zephyr-sanity/kernel/poll.c:177:
zero events
Generating LALR tables
-------------------------sanity-out/qemu_x86/tests/net/utils/test/qemu.log--------------------------
qemu_x86 tests/net/trickle/test FAILED: timeout
------------------------sanity-out/qemu_x86/tests/net/trickle/test/qemu.log-------------------------
***** BOOTING ZEPHYR OS v1.7.99 - BUILD: Mar 14 2017 05:38:17 *****
ASSERTION FAIL [num_events > 0] @ /w/workspace/zephyr-sanity/kernel/poll.c:177:
zero events
------------------------sanity-out/qemu_x86/tests/net/trickle/test/qemu.log-------------------------
qemu_x86 tests/net/lib/dns_packet/test FAILED: timeout
---------------------sanity-out/qemu_x86/tests/net/lib/dns_packet/test/qemu.log---------------------
***** BOOTING ZEPHYR OS v1.7.99 - BUILD: Mar 14 2017 05:35:59 *****
ASSERTION FAIL [num_events > 0] @ /w/workspace/zephyr-sanity/kernel/poll.c:177:
zero events
---------------------sanity-out/qemu_x86/tests/net/lib/dns_packet/test/qemu.log---------------------
0 of 144 tests passed with 0 warnings in 10843 seconds
Extra environment setting:
CONFIG_ASSERT=y
CONFIG_DEBUG=y
Build step 'Execute shell' marked build as failure


job zephyr-sanity build number 587 failed
see: https://jenkins.zephyrproject.org/job/zephyr-sanity/587/

[PASS] Test #2: ECC KeyGen - NIST-p256
[PASS] Test #3: PubKeyVerify - NIST-p256-SHA2-256
Shared secrets are not identical!
Shared secret 1 = 23979b62 ac36cd17 de6c7831 4b2e0b56 2d473374 92b50d41 aad0f19c 361e23b1
Shared secret 2 = 1690efb0 523e7951 396f9030 8b5f0c4a aab19cb9 85bbcbe1 6192883a 5c85bc9a
Private key 1 = 00000000 00000000 00000000 00000000 00000000 00000000 00000000 00000000
Private key 2 = 608367dc 0fb7b247 c6eea071 be476814 9fb7188e 54ffde2a db2eb5e5 b1059304
[FAIL] Test #4: Monte Carlo (Randomized EC-DH key-exchange) - NIST-p256
===================================================================
FAIL - main.
===================================================================
PROJECT EXECUTION FAILED
------------------sanity-out/qemu_cortex_m3/tests/crypto/test_ecc_dh/test/qemu.log------------------
qemu_x86 tests/net/udp/test FAILED: timeout
--------------------------sanity-out/qemu_x86/tests/net/udp/test/qemu.log---------------------------
***** BOOTING ZEPHYR OS v1.7.99 - BUILD: Mar 14 2017 01:51:16 *****
***** CPU exception 13
***** Exception code: 0x2b18
Current thread ID = 0x00110e80
Faulting segment:address = 0x8:0x10f001
eax: 0x0, ebx: 0x0, ecx: 0x110e80, edx: 0x10ed8c
esi: 0x0, edi: 0x1, ebp: 00, esp: 0x11126c
eflags: 0x216
Fatal fault in essential thread! Spinning...
--------------------------sanity-out/qemu_x86/tests/net/udp/test/qemu.log---------------------------
0 of 33 tests passed with 0 warnings in 80 seconds
Extra environment setting:
CONFIG_DEBUG=y
Build step 'Execute shell' marked build as failure


job zephyr-sanity build number 586 failed
see: https://jenkins.zephyrproject.org/job/zephyr-sanity/586/

make[2]: *** [sub-make] Error 2
make[2]: Target `all' not remade because of errors.
make[2]: Leaving directory `/w/workspace/zephyr-sanity'
make[1]: *** [all] Error 2
make[1]: Leaving directory `/w/workspace/zephyr-sanity/tests/bluetooth/init'
------------------sanity-out/qemu_cortex_m3/tests/bluetooth/init/test_10/build.log------------------
qemu_x86 tests/net/neighbor/test FAILED: timeout
------------------------sanity-out/qemu_x86/tests/net/neighbor/test/qemu.log------------------------
***** BOOTING ZEPHYR OS v1.7.99 - BUILD: Mar 14 2017 06:31:44 *****
ASSERTION FAIL [num_events > 0] @ /w/workspace/zephyr-sanity/kernel/poll.c:177:
zero events
Generating LALR tables
------------------------sanity-out/qemu_x86/tests/net/neighbor/test/qemu.log------------------------
qemu_x86 tests/net/nbuf/test FAILED: timeout
--------------------------sanity-out/qemu_x86/tests/net/nbuf/test/qemu.log--------------------------
***** BOOTING ZEPHYR OS v1.7.99 - BUILD: Mar 14 2017 06:31:59 *****
ASSERTION FAIL [num_events > 0] @ /w/workspace/zephyr-sanity/kernel/poll.c:177:
zero events
--------------------------sanity-out/qemu_x86/tests/net/nbuf/test/qemu.log--------------------------
qemu_x86 tests/net/lib/dns_packet/test FAILED: timeout
---------------------sanity-out/qemu_x86/tests/net/lib/dns_packet/test/qemu.log---------------------
***** BOOTING ZEPHYR OS v1.7.99 - BUILD: Mar 14 2017 06:30:55 *****
ASSERTION FAIL [num_events > 0] @ /w/workspace/zephyr-sanity/kernel/poll.c:177:
zero events
---------------------sanity-out/qemu_x86/tests/net/lib/dns_packet/test/qemu.log---------------------
0 of 119 tests passed with 0 warnings in 10867 seconds
Extra environment setting:
CONFIG_ASSERT=y
Build step 'Execute shell' marked build as failure


job zephyr-sanity build number 585 failed
see: https://jenkins.zephyrproject.org/job/zephyr-sanity/585/

zero=00000000 at=00000000 r2=00000001 r3=00201000
r4=00000000 r5=0000000a r6=00423630 r7=004017bc
r8=004016c4 r9=00000001 r10=00000001 r11=00000000
r12=00000040 r13=00000011 r14=0040162c r15=00000000
r16=00000000 r17=00000000 r18=00000000 r19=00000000
r20=00000000 r21=00000000 r22=00000000 r23=00000000
et=00000001 bt=00000000 gp=00408680 sp=004018d4
fp=00000000 ea=00421764 ba=00000000 ra=00000000
status=00000001 estatus=00000001 bstatus=00000000 ienable=00000004
ipending=00000000 cpuid=00000000 reserved=00000000 exception=00000008
pteaddr=00000000 tlbacc=00000000 tlbmisc=00000000 reserved=00000000
badaddr=00000000 config=00000000 mpubase=00000000 mpuacc=00000000
reserved=00000000 reserved=00000000 reserved=00000000 reserved=00000000
reserved=00000000 reserved=00000000 reserved=00000000 reserved=00000000
reserved=00000000 reserved=00000000 reserved=00000000 reserved=00000000
reserved=00000000 reserved=00000000 reserved=00000000 reserved=00000000
rpc=00000000 mmu write: VPN=00000 PID 00 TLBACC 00000000


make[3]: *** [run] Aborted (core dumped)
make[3]: Leaving directory `/w/workspace/zephyr-sanity/sanity-out/qemu_nios2/tests/crypto/test_ecc_dh/test'
make[2]: *** [sub-make] Error 2
make[2]: Target `run' not remade because of errors.
make[2]: Leaving directory `/w/workspace/zephyr-sanity'
make[1]: *** [run] Error 2
make[1]: Leaving directory `/w/workspace/zephyr-sanity/tests/crypto/test_ecc_dh'
--------------------sanity-out/qemu_nios2/tests/crypto/test_ecc_dh/test/run.log---------------------
0 of 1 tests passed with 0 warnings in 4 seconds
Build step 'Execute shell' marked build as failure

Join builds@lists.zephyrproject.org to automatically receive all group messages.