zephyr/master: daily build zephyr-kernel-1.6.99-170207-e67828b Failure


donotreply@...
 

zephyr/master: daily build zephyr-kernel-1.6.99-170207-e67828b Failure



job zephyr-sanity build number 452 failed
see: https://jenkins.zephyrproject.org/job/zephyr-sanity/452/

eflags: 0x2
Fatal fault in thread 0x001106a0! Aborting.
***** CPU exception 7
Current thread ID = 0x001106a0
Faulting segment:address = 0x8:0x10e17c
eax: 0x10e17c, ebx: 0x1106a0, ecx: 0x3f8, edx: 0x3f8
esi: 0x6, edi: 0x2, ebp: 0110110, esp: 0x110104
eflags: 0x2
Fatal fault in thread 0x001106a0! Aborting.
***** CPU exception 7
Current thread ID = 0x001106a0
Faulting segment:address = 0x8:0x10e17c
eax: 0x10e17c, ebx: 0x1106a0, ecx: 0x3f8, edx: 0x3f8
esi: 0x6, edi: 0x2, ebp: 010fff8, esp: 0x10ffec
eflags: 0x2
Fatal fault in thread 0x001106a0! Aborting.
***** CPU exception 7
Current thread ID = 0x001106a0
Faulting segment:address = 0x8:0x10e17c
eax: 0x10e17c, ebx: 0x1106a0, ecx: 0x3f8, edx: 0x3f8
esi: 0x6, edi: 0x2, ebp: 010fee0, esp: 0x10fed4
eflags: 0x2
Fatal fault in ISR! Spinning...
--------------------------sanity-out/qemu_x86/tests/net/udp/test/qemu.log---------------------------
0 of 134 tests passed with 0 warnings in 197 seconds
Extra environment setting:
CONFIG_ASSERT=y
CONFIG_DEBUG=y
Build step 'Execute shell' marked build as failure


job zephyr-sanity build number 451 failed
see: https://jenkins.zephyrproject.org/job/zephyr-sanity/451/

XMM00=00000000000000000000000000000000 XMM01=00000000000000000000000000000000
XMM02=00000000000000000000000000000000 XMM03=00000000000000000000000000000000
XMM04=00000000000000000000000000000000 XMM05=00000000000000000000000000000000
XMM06=00000000000000000000000000000000 XMM07=00000000000000000000000000000000
make[3]: *** [run] Aborted (core dumped)
make[3]: Target `qemu' not remade because of errors.
make[3]: Leaving directory `/w/workspace/zephyr-sanity/sanity-out/qemu_x86/tests/legacy/kernel/test_context/test'
make[2]: *** [sub-make] Error 2
make[2]: Target `qemu' not remade because of errors.
make[2]: Leaving directory `/w/workspace/zephyr-sanity'
make[1]: *** [qemu] Error 2
make[1]: Leaving directory `/w/workspace/zephyr-sanity/tests/legacy/kernel/test_context'
-----------------sanity-out/qemu_x86/tests/legacy/kernel/test_context/test/run.log------------------
qemu_x86 tests/net/udp/test FAILED: timeout
--------------------------sanity-out/qemu_x86/tests/net/udp/test/qemu.log---------------------------
***** BOOTING ZEPHYR OS v1.6.99 - BUILD: Feb 8 2017 01:11:04 *****
***** CPU exception 13
***** Exception code: 0xd65c
Current thread ID = 0x0010fb80
Faulting segment:address = 0x8:0x10fbac
eax: 0x1102c8, ebx: 0x10d606, ecx: 0x10d66c, edx: 0xffffff7f
esi: 0x0, edi: 0x0, ebp: 0fffffff5, esp: 0x10fb64
eflags: 0x282
Fatal fault in thread 0x0010fb80! Aborting.
--------------------------sanity-out/qemu_x86/tests/net/udp/test/qemu.log---------------------------
1 of 124 tests passed with 0 warnings in 116 seconds
Extra environment setting:
CONFIG_DEBUG=y
Build step 'Execute shell' marked build as failure


job zephyr-sanity build number 450 failed
see: https://jenkins.zephyrproject.org/job/zephyr-sanity/450/

tc_start() - test_mpool_alloc_free_thread
===================================================================
PASS - test_mpool_alloc_free_thread.
tc_start() - test_mpool_alloc_free_isr
ASSERTION FAIL [!_IsInIsr()] @ /w/workspace/zephyr-sanity/kernel/include/ksched.h:237:
------------sanity-out/qemu_cortex_m3/tests/kernel/mem_pool/test_mpool_api/test/qemu.log------------
qemu_riscv32 tests/kernel/pipe/test_pipe_api/test FAILED: timeout
---------------sanity-out/qemu_riscv32/tests/kernel/pipe/test_pipe_api/test/qemu.log----------------
***** BOOTING ZEPHYR OS v1.6.99 *****
Running test suite test_pipe_api
tc_start() - test_pipe_thread2thread
===================================================================
PASS - test_pipe_thread2thread.
tc_start() - test_pipe_thread2isr
ASSERTION FAIL [!(_kernel.nested != 0)] @ /w/workspace/zephyr-sanity/kernel/include/ksched.h:237:
---------------sanity-out/qemu_riscv32/tests/kernel/pipe/test_pipe_api/test/qemu.log----------------
qemu_cortex_m3 tests/kernel/pipe/test_pipe_api/test FAILED: timeout
--------------sanity-out/qemu_cortex_m3/tests/kernel/pipe/test_pipe_api/test/qemu.log---------------
Running test suite test_pipe_api
tc_start() - test_pipe_thread2thread
===================================================================
PASS - test_pipe_thread2thread.
tc_start() - test_pipe_thread2isr
ASSERTION FAIL [!_IsInIsr()] @ /w/workspace/zephyr-sanity/kernel/include/ksched.h:237:
--------------sanity-out/qemu_cortex_m3/tests/kernel/pipe/test_pipe_api/test/qemu.log---------------
0 of 100 tests passed with 0 warnings in 158 seconds
Extra environment setting:
CONFIG_ASSERT=y
Build step 'Execute shell' marked build as failure


job zephyr-sanity build number 449 failed
see: https://jenkins.zephyrproject.org/job/zephyr-sanity/449/

CC kernel/legacy_offload.o
CC kernel/lifo.o
CC kernel/mailbox.o
CC kernel/mem_pool.o
CC kernel/mem_slab.o
CC kernel/msg_q.o
CC kernel/mutex.o
CC kernel/pipes.o
CC kernel/sched.o
CC kernel/sem.o
CC kernel/stack.o
CC kernel/sys_clock.o
CC kernel/system_work_q.o
CC kernel/thread.o
CC kernel/thread_abort.o
CC kernel/timer.o
CC kernel/work_q.o
LD kernel/built-in.o
AR kernel/lib.a
make[3]: Target `all' not remade because of errors.
make[3]: Leaving directory `/w/workspace/zephyr-sanity/sanity-out/zedboard_pulpino/tests/kernel/mem_pool/test_mpool_options/test_mpool_defrag_split'
make[2]: *** [sub-make] Error 2
make[2]: Target `all' not remade because of errors.
make[2]: Leaving directory `/w/workspace/zephyr-sanity'
make[1]: *** [all] Error 2
make[1]: Leaving directory `/w/workspace/zephyr-sanity/tests/kernel/mem_pool/test_mpool_options'
sanity-out/zedboard_pulpino/tests/kernel/mem_pool/test_mpool_options/test_mpool_defrag_split/build.log
0 of 90 tests passed with 0 warnings in 59 seconds
Build step 'Execute shell' marked build as failure

Join builds@lists.zephyrproject.org to automatically receive all group messages.