zephyr/master: daily build zephyr-kernel-1.6.99-170208-d81e033 Failure


donotreply@...
 

zephyr/master: daily build zephyr-kernel-1.6.99-170208-d81e033 Failure



job zephyr-sanity build number 456 failed
see: https://jenkins.zephyrproject.org/job/zephyr-sanity/456/

qemu_x86 tests/net/udp/test FAILED: timeout
--------------------------sanity-out/qemu_x86/tests/net/udp/test/qemu.log---------------------------
***** BOOTING ZEPHYR OS v1.6.99 - BUILD: Feb 9 2017 01:40:23 *****
Timeout, packet not received
ASSERTION FAIL [_is_prio_higher(thread->base.prio, 15) || ((thread->base.prio == 15) && (thread == _idle_thread))] @ /w/workspace/zephyr-sanity/kernel/include/ksched.h:388:
--------------------------sanity-out/qemu_x86/tests/net/udp/test/qemu.log---------------------------
qemu_cortex_m3 tests/kernel/pipe/test_pipe_api/test FAILED: timeout
--------------sanity-out/qemu_cortex_m3/tests/kernel/pipe/test_pipe_api/test/qemu.log---------------
Running test suite test_pipe_api
tc_start() - test_pipe_thread2thread
===================================================================
PASS - test_pipe_thread2thread.
tc_start() - test_pipe_thread2isr
ASSERTION FAIL [!_IsInIsr()] @ /w/workspace/zephyr-sanity/kernel/include/ksched.h:237:
--------------sanity-out/qemu_cortex_m3/tests/kernel/pipe/test_pipe_api/test/qemu.log---------------
qemu_x86_iamcu tests/kernel/pipe/test_pipe_api/test FAILED: timeout
--------------sanity-out/qemu_x86_iamcu/tests/kernel/pipe/test_pipe_api/test/qemu.log---------------
Running test suite test_pipe_api
tc_start() - test_pipe_thread2thread
===================================================================
PASS - test_pipe_thread2thread.
tc_start() - test_pipe_thread2isr
ASSERTION FAIL [!(_kernel.nested != 0)] @ /w/workspace/zephyr-sanity/kernel/include/ksched.h:237:
--------------sanity-out/qemu_x86_iamcu/tests/kernel/pipe/test_pipe_api/test/qemu.log---------------
0 of 131 tests passed with 0 warnings in 199 seconds
Extra environment setting:
CONFIG_ASSERT=y
CONFIG_DEBUG=y
Build step 'Execute shell' marked build as failure


job zephyr-sanity build number 455 failed
see: https://jenkins.zephyrproject.org/job/zephyr-sanity/455/

make[5]: *** [drivers/timer/riscv_machine_timer.o] Error 1
make[5]: Target `__build' not remade because of errors.
make[4]: *** [drivers/timer] Error 2
make[4]: Target `__build' not remade because of errors.
make[3]: *** [drivers] Error 2
CC kernel/sched.o
CC kernel/sem.o
CC kernel/stack.o
CC kernel/sys_clock.o
CC kernel/system_work_q.o
CC kernel/thread.o
CC kernel/thread_abort.o
CC kernel/timer.o
CC kernel/work_q.o
LD kernel/built-in.o
AR kernel/lib.a
make[3]: Target `all' not remade because of errors.
make[3]: Leaving directory `/w/workspace/zephyr-sanity/sanity-out/zedboard_pulpino/tests/legacy/kernel/test_fifo_priv/test'
make[2]: *** [sub-make] Error 2
make[2]: Target `all' not remade because of errors.
make[2]: Leaving directory `/w/workspace/zephyr-sanity'
make[1]: *** [all] Error 2
make[1]: Leaving directory `/w/workspace/zephyr-sanity/tests/legacy/kernel/test_fifo_priv'
Generating LALR tables
-----------sanity-out/zedboard_pulpino/tests/legacy/kernel/test_fifo_priv/test/build.log------------
1 of 121 tests passed with 0 warnings in 91 seconds
Extra environment setting:
CONFIG_DEBUG=y
Build step 'Execute shell' marked build as failure


job zephyr-sanity build number 454 failed
see: https://jenkins.zephyrproject.org/job/zephyr-sanity/454/

tc_start() - test_mpool_alloc_free_thread
===================================================================
PASS - test_mpool_alloc_free_thread.
tc_start() - test_mpool_alloc_free_isr
ASSERTION FAIL [!(_kernel.nested != 0)] @ /w/workspace/zephyr-sanity/kernel/include/ksched.h:237:
---------------sanity-out/qemu_x86/tests/kernel/mem_pool/test_mpool_api/test/qemu.log---------------
qemu_cortex_m3 tests/kernel/pipe/test_pipe_api/test FAILED: timeout
--------------sanity-out/qemu_cortex_m3/tests/kernel/pipe/test_pipe_api/test/qemu.log---------------
Running test suite test_pipe_api
tc_start() - test_pipe_thread2thread
===================================================================
PASS - test_pipe_thread2thread.
tc_start() - test_pipe_thread2isr
ASSERTION FAIL [!_IsInIsr()] @ /w/workspace/zephyr-sanity/kernel/include/ksched.h:237:
--------------sanity-out/qemu_cortex_m3/tests/kernel/pipe/test_pipe_api/test/qemu.log---------------
qemu_nios2 tests/kernel/mem_pool/test_mpool_api/test FAILED: timeout
--------------sanity-out/qemu_nios2/tests/kernel/mem_pool/test_mpool_api/test/qemu.log--------------
***** BOOTING ZEPHYR OS v1.6.99 - BUILD: Feb 9 2017 01:55:15 *****
Running test suite test_mpool_api
tc_start() - test_mpool_alloc_free_thread
===================================================================
PASS - test_mpool_alloc_free_thread.
tc_start() - test_mpool_alloc_free_isr
ASSERTION FAIL [!(_kernel.nested != 0)] @ /w/workspace/zephyr-sanity/kernel/include/ksched.h:237:
--------------sanity-out/qemu_nios2/tests/kernel/mem_pool/test_mpool_api/test/qemu.log--------------
0 of 100 tests passed with 0 warnings in 173 seconds
Extra environment setting:
CONFIG_ASSERT=y
Build step 'Execute shell' marked build as failure

Join builds@lists.zephyrproject.org to automatically receive all group messages.