zephyr/master: daily build zephyr-kernel-1.6.99-170209-98d4836 Failure


donotreply@...
 

zephyr/master: daily build zephyr-kernel-1.6.99-170209-98d4836 Failure



job zephyr-sanity build number 460 failed
see: https://jenkins.zephyrproject.org/job/zephyr-sanity/460/

===================================================================
PASS - test_mpool_alloc_free_thread.
tc_start() - test_mpool_alloc_free_isr
ASSERTION FAIL [!(_kernel.nested != 0)] @ /w/workspace/zephyr-sanity/kernel/include/ksched.h:237:
-------------sanity-out/qemu_riscv32/tests/kernel/mem_pool/test_mpool_api/test/qemu.log-------------
qemu_cortex_m3 tests/kernel/pipe/test_pipe_api/test FAILED: timeout
--------------sanity-out/qemu_cortex_m3/tests/kernel/pipe/test_pipe_api/test/qemu.log---------------
Running test suite test_pipe_api
tc_start() - test_pipe_thread2thread
===================================================================
PASS - test_pipe_thread2thread.
tc_start() - test_pipe_thread2isr
ASSERTION FAIL [!_IsInIsr()] @ /w/workspace/zephyr-sanity/kernel/include/ksched.h:237:
--------------sanity-out/qemu_cortex_m3/tests/kernel/pipe/test_pipe_api/test/qemu.log---------------
qemu_x86_iamcu tests/kernel/mem_pool/test_mpool_api/test FAILED: timeout
------------sanity-out/qemu_x86_iamcu/tests/kernel/mem_pool/test_mpool_api/test/qemu.log------------
***** BOOTING ZEPHYR OS v1.6.99 - BUILD: Feb 10 2017 01:29:05 *****
Running test suite test_mpool_api
tc_start() - test_mpool_alloc_free_thread
===================================================================
PASS - test_mpool_alloc_free_thread.
tc_start() - test_mpool_alloc_free_isr
ASSERTION FAIL [!(_kernel.nested != 0)] @ /w/workspace/zephyr-sanity/kernel/include/ksched.h:237:
------------sanity-out/qemu_x86_iamcu/tests/kernel/mem_pool/test_mpool_api/test/qemu.log------------
0 of 46 tests passed with 0 warnings in 132 seconds
Extra environment setting:
CONFIG_ASSERT=y
CONFIG_DEBUG=y
Build step 'Execute shell' marked build as failure


job zephyr-sanity build number 459 failed
see: https://jenkins.zephyrproject.org/job/zephyr-sanity/459/

GDT= 00100070 00000017
IDT= 00102d10 000007ff
CR0=0000003f CR2=00000000 CR3=00000000 CR4=00000000
DR0=00000000 DR1=00000000 DR2=00000000 DR3=00000000
DR6=ffff0ff0 DR7=00000400
CCS=0000000a CCD=0000003c CCO=CLR
EFER=0000000000000000
FCW=037f FSW=0000 [ST=0] FTW=00 MXCSR=00001f80
FPR0=0000000000000000 0000 FPR1=0000000000000000 0000
FPR2=0000000000000000 0000 FPR3=0000000000000000 0000
FPR4=0000000000000000 0000 FPR5=0000000000000000 0000
FPR6=0000000000000000 0000 FPR7=0000000000000000 0000
XMM00=00000000000000000000000000000000 XMM01=00000000000000000000000000000000
XMM02=00000000000000000000000000000000 XMM03=00000000000000000000000000000000
XMM04=00000000000000000000000000000000 XMM05=00000000000000000000000000000000
XMM06=00000000000000000000000000000000 XMM07=00000000000000000000000000000000
make[3]: *** [run] Aborted (core dumped)
make[3]: Target `qemu' not remade because of errors.
make[3]: Leaving directory `/w/workspace/zephyr-sanity/sanity-out/qemu_x86/tests/legacy/kernel/test_sleep/test'
make[2]: *** [sub-make] Error 2
make[2]: Target `qemu' not remade because of errors.
make[2]: Leaving directory `/w/workspace/zephyr-sanity'
make[1]: *** [qemu] Error 2
make[1]: Leaving directory `/w/workspace/zephyr-sanity/tests/legacy/kernel/test_sleep'
------------------sanity-out/qemu_x86/tests/legacy/kernel/test_sleep/test/run.log-------------------
0 of 36 tests passed with 0 warnings in 31 seconds
Extra environment setting:
CONFIG_DEBUG=y
Build step 'Execute shell' marked build as failure


job zephyr-sanity build number 458 failed
see: https://jenkins.zephyrproject.org/job/zephyr-sanity/458/

===================================================================
PASS - test_pipe_thread2thread.
tc_start() - test_pipe_thread2isr
ASSERTION FAIL [!(_kernel.nested != 0)] @ /w/workspace/zephyr-sanity/kernel/include/ksched.h:237:
--------------sanity-out/qemu_x86_iamcu/tests/kernel/pipe/test_pipe_api/test/qemu.log---------------
qemu_x86_iamcu tests/kernel/mem_pool/test_mpool_api/test FAILED: timeout
------------sanity-out/qemu_x86_iamcu/tests/kernel/mem_pool/test_mpool_api/test/qemu.log------------
***** BOOTING ZEPHYR OS v1.6.99 - BUILD: Feb 10 2017 01:20:53 *****
Running test suite test_mpool_api
tc_start() - test_mpool_alloc_free_thread
===================================================================
PASS - test_mpool_alloc_free_thread.
tc_start() - test_mpool_alloc_free_isr
ASSERTION FAIL [!(_kernel.nested != 0)] @ /w/workspace/zephyr-sanity/kernel/include/ksched.h:237:
------------sanity-out/qemu_x86_iamcu/tests/kernel/mem_pool/test_mpool_api/test/qemu.log------------
qemu_x86 tests/kernel/mem_pool/test_mpool_api/test FAILED: timeout
---------------sanity-out/qemu_x86/tests/kernel/mem_pool/test_mpool_api/test/qemu.log---------------
***** BOOTING ZEPHYR OS v1.6.99 - BUILD: Feb 10 2017 01:20:54 *****
Running test suite test_mpool_api
tc_start() - test_mpool_alloc_free_thread
===================================================================
PASS - test_mpool_alloc_free_thread.
tc_start() - test_mpool_alloc_free_isr
ASSERTION FAIL [!(_kernel.nested != 0)] @ /w/workspace/zephyr-sanity/kernel/include/ksched.h:237:
---------------sanity-out/qemu_x86/tests/kernel/mem_pool/test_mpool_api/test/qemu.log---------------
0 of 16 tests passed with 0 warnings in 70 seconds
Extra environment setting:
CONFIG_ASSERT=y
Build step 'Execute shell' marked build as failure


job zephyr-sanity build number 457 failed
see: https://jenkins.zephyrproject.org/job/zephyr-sanity/457/

/w/workspace/zephyr-sanity/kernel/init.c:223: undefined reference to `__data_rom_start'
/w/workspace/zephyr-sanity/kernel/init.c:223: undefined reference to `__data_ram_start'
collect2: error: ld returned 1 exit status
make[3]: *** [zephyr_prebuilt.elf] Error 1
make[3]: Target `all' not remade because of errors.
make[3]: Leaving directory `/w/workspace/zephyr-sanity/sanity-out/zedboard_pulpino/tests/kernel/xip/test'
make[2]: *** [sub-make] Error 2
make[2]: Target `all' not remade because of errors.
make[2]: Leaving directory `/w/workspace/zephyr-sanity'
make[1]: *** [all] Error 2
make[1]: Leaving directory `/w/workspace/zephyr-sanity/tests/kernel/xip'
Generating LALR tables
Platform 'panther' not specified in any arch .ini file and will not be tested
Platform 'panther_ss' not specified in any arch .ini file and will not be tested
--------------------sanity-out/zedboard_pulpino/tests/kernel/xip/test/build.log---------------------
qemu_riscv32 tests/crypto/test_ecc_dh/test FAILED: failed
-------------------sanity-out/qemu_riscv32/tests/crypto/test_ecc_dh/test/qemu.log-------------------
***** BOOTING ZEPHYR OS v1.6.99 - BUILD: Feb 10 2017 01:45:00 *****
tc_start() - TinyCrypt ECC DH tests

Vector #00 check Z - FAILURE
[FAIL] Test #1: ECDH - NIST-p256
===================================================================
FAIL - main.
===================================================================
PROJECT EXECUTION FAILED
-------------------sanity-out/qemu_riscv32/tests/crypto/test_ecc_dh/test/qemu.log-------------------
0 of 6 tests passed with 0 warnings in 5 seconds
Build step 'Execute shell' marked build as failure

Join builds@lists.zephyrproject.org to automatically receive all group messages.