zephyr/master: daily build zephyr-kernel-1.6.99-170210-b4b3958 Failure


donotreply@...
 

zephyr/master: daily build zephyr-kernel-1.6.99-170210-b4b3958 Failure



job zephyr-sanity build number 464 failed
see: https://jenkins.zephyrproject.org/job/zephyr-sanity/464/

ASSERTION FAIL [!(_kernel.nested != 0)] @ /w/workspace/zephyr-sanity/kernel/include/ksched.h:237:
--------------sanity-out/qemu_x86_iamcu/tests/kernel/pipe/test_pipe_api/test/qemu.log---------------
qemu_cortex_m3 tests/kernel/pipe/test_pipe_api/test FAILED: timeout
--------------sanity-out/qemu_cortex_m3/tests/kernel/pipe/test_pipe_api/test/qemu.log---------------
Running test suite test_pipe_api
tc_start() - test_pipe_thread2thread
===================================================================
PASS - test_pipe_thread2thread.
tc_start() - test_pipe_thread2isr
ASSERTION FAIL [!_IsInIsr()] @ /w/workspace/zephyr-sanity/kernel/include/ksched.h:237:
Generating LALR tables
Platform 'panther' not specified in any arch .ini file and will not be tested
Platform 'panther_ss' not specified in any arch .ini file and will not be tested
--------------sanity-out/qemu_cortex_m3/tests/kernel/pipe/test_pipe_api/test/qemu.log---------------
qemu_x86 tests/kernel/mem_pool/test_mpool_api/test FAILED: timeout
---------------sanity-out/qemu_x86/tests/kernel/mem_pool/test_mpool_api/test/qemu.log---------------
***** BOOTING ZEPHYR OS v1.6.99 - BUILD: Feb 11 2017 02:01:18 *****
Running test suite test_mpool_api
tc_start() - test_mpool_alloc_free_thread
===================================================================
PASS - test_mpool_alloc_free_thread.
tc_start() - test_mpool_alloc_free_isr
ASSERTION FAIL [!(_kernel.nested != 0)] @ /w/workspace/zephyr-sanity/kernel/include/ksched.h:237:
---------------sanity-out/qemu_x86/tests/kernel/mem_pool/test_mpool_api/test/qemu.log---------------
0 of 136 tests passed with 0 warnings in 231 seconds
Extra environment setting:
CONFIG_ASSERT=y
CONFIG_DEBUG=y
Build step 'Execute shell' marked build as failure


job zephyr-sanity build number 463 failed
see: https://jenkins.zephyrproject.org/job/zephyr-sanity/463/

CC kernel/work_q.o
LD kernel/built-in.o
AR kernel/lib.a
make[3]: Target `all' not remade because of errors.
make[3]: Leaving directory `/w/workspace/zephyr-sanity/sanity-out/stm3210c_eval/tests/crypto/test_mbedtls/test'
make[2]: *** [sub-make] Error 2
make[2]: Target `all' not remade because of errors.
make[2]: Leaving directory `/w/workspace/zephyr-sanity'
make[1]: *** [all] Error 2
make[1]: Leaving directory `/w/workspace/zephyr-sanity/tests/crypto/test_mbedtls'
Generating LALR tables
Platform 'panther' not specified in any arch .ini file and will not be tested
Platform 'panther_ss' not specified in any arch .ini file and will not be tested
-----------------sanity-out/stm3210c_eval/tests/crypto/test_mbedtls/test/build.log------------------
qemu_x86 tests/net/udp/test FAILED: timeout
--------------------------sanity-out/qemu_x86/tests/net/udp/test/qemu.log---------------------------
***** BOOTING ZEPHYR OS v1.6.99 - BUILD: Feb 11 2017 01:17:32 *****
Timeout, packet not received
Timeout, packet not received
Timeout, packet not received
Timeout, packet not received
Cannot recv buf 0xff53f000, ret -78
Timeout, packet not received
Timeout, packet not received
--------------------------sanity-out/qemu_x86/tests/net/udp/test/qemu.log---------------------------
0 of 126 tests passed with 0 warnings in 140 seconds
Extra environment setting:
CONFIG_DEBUG=y
Build step 'Execute shell' marked build as failure


job zephyr-sanity build number 462 failed
see: https://jenkins.zephyrproject.org/job/zephyr-sanity/462/

ASSERTION FAIL [!(_kernel.nested != 0)] @ /w/workspace/zephyr-sanity/kernel/include/ksched.h:237:
--------------sanity-out/qemu_x86_iamcu/tests/kernel/pipe/test_pipe_api/test/qemu.log---------------
qemu_x86_iamcu tests/kernel/mem_pool/test_mpool_api/test FAILED: timeout
------------sanity-out/qemu_x86_iamcu/tests/kernel/mem_pool/test_mpool_api/test/qemu.log------------
Generating LALR tables
Platform 'panther' not specified in any arch .ini file and will not be tested
Platform 'panther_ss' not specified in any arch .ini file and will not be tested
***** BOOTING ZEPHYR OS v1.6.99 - BUILD: Feb 11 2017 02:49:13 *****
Running test suite test_mpool_api
tc_start() - test_mpool_alloc_free_thread
===================================================================
PASS - test_mpool_alloc_free_thread.
tc_start() - test_mpool_alloc_free_isr
ASSERTION FAIL [!(_kernel.nested != 0)] @ /w/workspace/zephyr-sanity/kernel/include/ksched.h:237:
------------sanity-out/qemu_x86_iamcu/tests/kernel/mem_pool/test_mpool_api/test/qemu.log------------
qemu_nios2 tests/kernel/mem_pool/test_mpool_api/test FAILED: timeout
--------------sanity-out/qemu_nios2/tests/kernel/mem_pool/test_mpool_api/test/qemu.log--------------
***** BOOTING ZEPHYR OS v1.6.99 - BUILD: Feb 11 2017 02:49:26 *****
Running test suite test_mpool_api
tc_start() - test_mpool_alloc_free_thread
===================================================================
PASS - test_mpool_alloc_free_thread.
tc_start() - test_mpool_alloc_free_isr
ASSERTION FAIL [!(_kernel.nested != 0)] @ /w/workspace/zephyr-sanity/kernel/include/ksched.h:237:
--------------sanity-out/qemu_nios2/tests/kernel/mem_pool/test_mpool_api/test/qemu.log--------------
0 of 112 tests passed with 0 warnings in 193 seconds
Extra environment setting:
CONFIG_ASSERT=y
Build step 'Execute shell' marked build as failure

Join builds@lists.zephyrproject.org to automatically receive all group messages.