zephyr/master: daily build zephyr-kernel-1.7.99-170324-7942eae Failure


donotreply@...
 

zephyr/master: daily build zephyr-kernel-1.7.99-170324-7942eae Failure



job zephyr-sanity build number 632 failed
see: https://jenkins.zephyrproject.org/job/zephyr-sanity/632/

--------------------------sanity-out/qemu_x86/tests/net/nbuf/test/qemu.log--------------------------
qemu_x86 tests/net/icmpv6/test FAILED: timeout
-------------------------sanity-out/qemu_x86/tests/net/icmpv6/test/qemu.log-------------------------
***** BOOTING ZEPHYR OS v1.7.99 - BUILD: Mar 25 2017 05:25:20 *****
ASSERTION FAIL [num_events > 0] @ /w/workspace/zephyr-sanity/kernel/poll.c:177:
zero events
-------------------------sanity-out/qemu_x86/tests/net/icmpv6/test/qemu.log-------------------------
qemu_x86 tests/net/udp/test FAILED: timeout
--------------------------sanity-out/qemu_x86/tests/net/udp/test/qemu.log---------------------------
***** BOOTING ZEPHYR OS v1.7.99 - BUILD: Mar 25 2017 05:25:34 *****
***** CPU exception 6
Current thread ID = 0x00112240
Faulting segment:address = 0x8:0x1104cc
eax: 0xd5, ebx: 0x0, ecx: 0x112240, edx: 0x1101e0
esi: 0x0, edi: 0x0, ebp: 00, esp: 0x11262c
eflags: 0x213
Fatal fault in essential thread! Spinning...
--------------------------sanity-out/qemu_x86/tests/net/udp/test/qemu.log---------------------------
qemu_x86 tests/net/lib/dns_packet/test FAILED: timeout
---------------------sanity-out/qemu_x86/tests/net/lib/dns_packet/test/qemu.log---------------------
***** BOOTING ZEPHYR OS v1.7.99 - BUILD: Mar 25 2017 05:24:28 *****
ASSERTION FAIL [num_events > 0] @ /w/workspace/zephyr-sanity/kernel/poll.c:177:
zero events
---------------------sanity-out/qemu_x86/tests/net/lib/dns_packet/test/qemu.log---------------------
1 of 145 tests passed with 0 warnings in 10897 seconds
Extra environment setting:
CONFIG_ASSERT=y
CONFIG_DEBUG=y
Build step 'Execute shell' marked build as failure


job zephyr-sanity build number 631 failed
see: https://jenkins.zephyrproject.org/job/zephyr-sanity/631/

[PASS] Test #1: ECDH - NIST-p256
[PASS] Test #2: ECC KeyGen - NIST-p256
[PASS] Test #3: PubKeyVerify - NIST-p256-SHA2-256
Shared secrets are not identical!
Shared secret 1 = 977bd76f 52111b06 a2826eca c3399722 b0ff82c4 117e9fac 6531a1f2 1475b215
Shared secret 2 = 70332d1e 8b3930e3 0164cbbd 7eeac796 05440b03 6a6c9126 68052a1b 0f3c2fbf
Private key 1 = 00000000 00000000 00000000 00000000 00000000 00000000 00000000 00000000
Private key 2 = 5ea52b7e 066085e3 bf75afed b6ce778e 9a1c646c 54ffde2e dd0cf20d b2e3cee9
[FAIL] Test #4: Monte Carlo (Randomized EC-DH key-exchange) - NIST-p256
===================================================================
FAIL - main.
===================================================================
PROJECT EXECUTION FAILED
------------------sanity-out/qemu_cortex_m3/tests/crypto/test_ecc_dh/test/qemu.log------------------
qemu_x86 tests/net/udp/test FAILED: timeout
--------------------------sanity-out/qemu_x86/tests/net/udp/test/qemu.log---------------------------
***** BOOTING ZEPHYR OS v1.7.99 - BUILD: Mar 25 2017 01:01:19 *****
***** CPU exception 7
Current thread ID = 0x00111180
Faulting segment:address = 0x8:0x10f3e9
eax: 0x80, ebx: 0x0, ecx: 0x111180, edx: 0x10f024
esi: 0x0, edi: 0x1, ebp: 00, esp: 0x11156c
eflags: 0x282
Fatal fault in essential thread! Spinning...
--------------------------sanity-out/qemu_x86/tests/net/udp/test/qemu.log---------------------------
0 of 33 tests passed with 0 warnings in 90 seconds
Extra environment setting:
CONFIG_DEBUG=y
Build step 'Execute shell' marked build as failure


job zephyr-sanity build number 630 failed
see: https://jenkins.zephyrproject.org/job/zephyr-sanity/630/

------------------------sanity-out/qemu_x86/tests/net/trickle/test/qemu.log-------------------------
qemu_x86 tests/net/lib/http_header_fields/test FAILED: timeout
-----------------sanity-out/qemu_x86/tests/net/lib/http_header_fields/test/qemu.log-----------------
***** BOOTING ZEPHYR OS v1.7.99 - BUILD: Mar 25 2017 05:23:46 *****
ASSERTION FAIL [num_events > 0] @ /w/workspace/zephyr-sanity/kernel/poll.c:177:
zero events
-----------------sanity-out/qemu_x86/tests/net/lib/http_header_fields/test/qemu.log-----------------
qemu_x86 tests/net/utils/test FAILED: timeout
-------------------------sanity-out/qemu_x86/tests/net/utils/test/qemu.log--------------------------
***** BOOTING ZEPHYR OS v1.7.99 - BUILD: Mar 25 2017 05:23:59 *****
ASSERTION FAIL [num_events > 0] @ /w/workspace/zephyr-sanity/kernel/poll.c:177:
zero events
-------------------------sanity-out/qemu_x86/tests/net/utils/test/qemu.log--------------------------
qemu_x86 tests/net/lib/mqtt_packet/test FAILED: timeout
--------------------sanity-out/qemu_x86/tests/net/lib/mqtt_packet/test/qemu.log---------------------
***** BOOTING ZEPHYR OS v1.7.99 - BUILD: Mar 25 2017 05:24:10 *****
ASSERTION FAIL [num_events > 0] @ /w/workspace/zephyr-sanity/kernel/poll.c:177:
zero events
--------------------sanity-out/qemu_x86/tests/net/lib/mqtt_packet/test/qemu.log---------------------
qemu_x86 tests/net/lib/dns_packet/test FAILED: timeout
---------------------sanity-out/qemu_x86/tests/net/lib/dns_packet/test/qemu.log---------------------
***** BOOTING ZEPHYR OS v1.7.99 - BUILD: Mar 25 2017 05:22:39 *****
ASSERTION FAIL [num_events > 0] @ /w/workspace/zephyr-sanity/kernel/poll.c:177:
zero events
---------------------sanity-out/qemu_x86/tests/net/lib/dns_packet/test/qemu.log---------------------
0 of 119 tests passed with 0 warnings in 10825 seconds
Extra environment setting:
CONFIG_ASSERT=y
Build step 'Execute shell' marked build as failure


job zephyr-sanity build number 629 failed
see: https://jenkins.zephyrproject.org/job/zephyr-sanity/629/

zero=00000000 at=00000000 r2=00000001 r3=00201000
r4=00000000 r5=0000000a r6=00423630 r7=004017bc
r8=004016c4 r9=00000001 r10=00000001 r11=00000000
r12=00000040 r13=00000011 r14=0040162c r15=00000000
r16=00000000 r17=00000000 r18=00000000 r19=00000000
r20=00000000 r21=00000000 r22=00000000 r23=00000000
et=00000001 bt=00000000 gp=00408680 sp=004018d4
fp=00000000 ea=00420c6c ba=00000000 ra=00000000
status=00000001 estatus=00000001 bstatus=00000000 ienable=00000004
ipending=00000000 cpuid=00000000 reserved=00000000 exception=00000008
pteaddr=00000000 tlbacc=00000000 tlbmisc=00000000 reserved=00000000
badaddr=00000000 config=00000000 mpubase=00000000 mpuacc=00000000
reserved=00000000 reserved=00000000 reserved=00000000 reserved=00000000
reserved=00000000 reserved=00000000 reserved=00000000 reserved=00000000
reserved=00000000 reserved=00000000 reserved=00000000 reserved=00000000
reserved=00000000 reserved=00000000 reserved=00000000 reserved=00000000
rpc=00000000 mmu write: VPN=00000 PID 00 TLBACC 00000000


make[3]: *** [run] Aborted (core dumped)
make[3]: Leaving directory `/w/workspace/zephyr-sanity/sanity-out/qemu_nios2/tests/crypto/test_ecc_dh/test'
make[2]: *** [sub-make] Error 2
make[2]: Target `run' not remade because of errors.
make[2]: Leaving directory `/w/workspace/zephyr-sanity'
make[1]: *** [run] Error 2
make[1]: Leaving directory `/w/workspace/zephyr-sanity/tests/crypto/test_ecc_dh'
--------------------sanity-out/qemu_nios2/tests/crypto/test_ecc_dh/test/run.log---------------------
0 of 1 tests passed with 0 warnings in 4 seconds
Build step 'Execute shell' marked build as failure

Join builds@lists.zephyrproject.org to automatically receive all group messages.