zephyr/master: daily build zephyr-kernel-1.7.99-170407-de38141 Failure


donotreply@...
 

zephyr/master: daily build zephyr-kernel-1.7.99-170407-de38141 Failure



job zephyr-sanity build number 688 failed
see: https://jenkins.zephyrproject.org/job/zephyr-sanity/688/

AR kernel/lib.a
make[3]: Target `all' not remade because of errors.
make[3]: Leaving directory `/w/workspace/zephyr-sanity/sanity-out/qemu_x86/samples/bluetooth/peripheral_dis/test'
make[2]: *** [sub-make] Error 2
make[2]: Target `all' not remade because of errors.
make[2]: Leaving directory `/w/workspace/zephyr-sanity'
make[1]: *** [all] Error 2
make[1]: Leaving directory `/w/workspace/zephyr-sanity/samples/bluetooth/peripheral_dis'
Generating LALR tables
Platform 'arduino_101_mcuboot' not specified in any arch .ini file and will not be tested
Platform 'nrf52_blenano2' not specified in any arch .ini file and will not be tested
----------------sanity-out/qemu_x86/samples/bluetooth/peripheral_dis/test/build.log-----------------
qemu_x86 tests/net/utils/test FAILED: timeout
-------------------------sanity-out/qemu_x86/tests/net/utils/test/qemu.log--------------------------
***** BOOTING ZEPHYR OS v1.7.99 - BUILD: Apr 8 2017 09:20:44 *****
ASSERTION FAIL [num_events > 0] @ /w/workspace/zephyr-sanity/kernel/poll.c:177:
zero events
-------------------------sanity-out/qemu_x86/tests/net/utils/test/qemu.log--------------------------
qemu_x86 tests/net/lib/dns_packet/test FAILED: timeout
---------------------sanity-out/qemu_x86/tests/net/lib/dns_packet/test/qemu.log---------------------
***** BOOTING ZEPHYR OS v1.7.99 - BUILD: Apr 8 2017 09:20:06 *****
ASSERTION FAIL [num_events > 0] @ /w/workspace/zephyr-sanity/kernel/poll.c:177:
zero events
---------------------sanity-out/qemu_x86/tests/net/lib/dns_packet/test/qemu.log---------------------
0 of 144 tests passed with 0 warnings in 11156 seconds
Extra environment setting:
CONFIG_ASSERT=y
CONFIG_DEBUG=y
Build step 'Execute shell' marked build as failure


job zephyr-sanity build number 687 failed
see: https://jenkins.zephyrproject.org/job/zephyr-sanity/687/

| 16| 16| 5692| 6065| 5934| 2810| 2638| 2696|
| 32| 32| 5962| 6859| 6000| 5367| 4665| 5333|
| 64| 64| 6469| 6440| 6231| 9893| 9937| 10271|
| 128| 128| 7399| 7089| 7225| 17299| 18056| 17716|
| 256| 256| 8541| 8712| 8490| 29973| 29384| 30153|
| 512| 512| 8224| 11168| 11341| 62256| 45845| 45145|
| 1024| 1024| 16583| 19378| 16560| 61749| 52843| 61835|
| 2048| 2048| 28154| 28664| 27626| 72742| 71448| 74133|
| 4096| 4096| 51000| 51288| 51822| 80313| 79862| 79039|
|-----------------------------------------------------------------------------|
| non-matching sizes (1_TO_N) to higher priority |
|-----------------------------------------------------------------------------|
| size(B) | time/packet (nsec) | KB/sec |
|-----------------------------------------------------------------------------|
| put | get | no buf | small buf| big buf | no buf | small buf| big buf |
|-----------------------------------------------------------------------------|
| 8| 4096| 2068| 1738| 1820| 3868| 4602| 4395|
| 16| 2048| 1794| 1749| 1749| 8918| 9148| 9148|
| 32| 1024| 1798| 2094| 2101| 17797| 15281| 15230|
| 64| 512| 2952| 3258| 3110| 21680| 19643| 20578|
| 128| 256| 5447| 5504| 5342| 23499| 23255| 23961|
| 256| 128| 41655| 14550| 12013| 6145| 17594| 21310|
| 512| 64| 52291| 34130| 31927| 9791| 15001| 16036|
| 1024| 32| 53355| 99882| 77847| 19192| 10252| 13154|
-------------sanity-out/qemu_x86_iamcu/tests/legacy/benchmark/app_kernel/test/qemu.log--------------
0 of 31 tests passed with 0 warnings in 198 seconds
Extra environment setting:
CONFIG_DEBUG=y
Build step 'Execute shell' marked build as failure


job zephyr-sanity build number 686 failed
see: https://jenkins.zephyrproject.org/job/zephyr-sanity/686/

|-----------------------------------------------------------------------------|
| non-matching sizes (1_TO_N) to higher priority |
|-----------------------------------------------------------------------------|
| size(B) | time/packet (nsec) | KB/sec |
|-----------------------------------------------------------------------------|
| put | get | no buf | small buf| big buf | no buf | small buf| big buf |
|-----------------------------------------------------------------------------|
| 8| 4096| 2120| 1769| 2577| 3773| 4522| 3104|
| 16| 2048| 1463| 1267| 1376| 10936| 12628| 11627|
| 32| 1024| 1643| 3382| 1866| 19476| 9461| 17148|
| 64| 512| 4502| 2263| 2136| 14215| 28281| 29962|
| 128| 256| 3920| 5771| 3942| 32653| 22179| 32470|
| 256| 128| 43818| 9926| 10706| 5842| 25790| 23911|
| 512| 64| 48340| 30182| 19881| 10591| 16963| 25753|
| 1024| 32| 68257| 68277| 58250| 15002| 14997| 17579|
----------------sanity-out/qemu_x86/tests/legacy/benchmark/app_kernel/test/qemu.log-----------------
qemu_x86 tests/net/lib/dns_packet/test FAILED: timeout
---------------------sanity-out/qemu_x86/tests/net/lib/dns_packet/test/qemu.log---------------------
***** BOOTING ZEPHYR OS v1.7.99 - BUILD: Apr 8 2017 05:07:10 *****
ASSERTION FAIL [num_events > 0] @ /w/workspace/zephyr-sanity/kernel/poll.c:177:
zero events
---------------------sanity-out/qemu_x86/tests/net/lib/dns_packet/test/qemu.log---------------------
Generating LALR tables
Platform 'arduino_101_mcuboot' not specified in any arch .ini file and will not be tested
Platform 'nrf52_blenano2' not specified in any arch .ini file and will not be tested
0 of 121 tests passed with 0 warnings in 10902 seconds
Extra environment setting:
CONFIG_ASSERT=y
Build step 'Execute shell' marked build as failure


job zephyr-sanity build number 685 failed
see: https://jenkins.zephyrproject.org/job/zephyr-sanity/685/

| 32| 32| 3679| 3588| 3561| 8698| 8918| 8986|
| 64| 64| 3915| 4275| 3783| 16347| 14970| 16917|
| 128| 128| 4503| 6482| 4418| 28425| 19746| 28972|
| 256| 256| 5734| 5981| 5845| 44645| 42802| 43798|
| 512| 512| 7521| 7740| 8473| 68076| 66149| 60427|
| 1024| 1024| 12055| 11888| 21959| 84944| 86137| 46632|
| 2048| 2048| 20155| 30389| 20075| 101612| 67392| 102017|
| 4096| 4096| 53623| 38588| 70299| 76385| 106146| 58265|
|-----------------------------------------------------------------------------|
| non-matching sizes (1_TO_N) to higher priority |
|-----------------------------------------------------------------------------|
| size(B) | time/packet (nsec) | KB/sec |
|-----------------------------------------------------------------------------|
| put | get | no buf | small buf| big buf | no buf | small buf| big buf |
|-----------------------------------------------------------------------------|
| 8| 4096| 1474| 1331| 1449| 5427| 6010| 5521|
| 16| 2048| 2526| 1316| 1722| 6334| 12158| 9291|
| 32| 1024| 1810| 2671| 1608| 17679| 11980| 19900|
| 64| 512| 2249| 4246| 2556| 28457| 15073| 25039|
| 128| 256| 3769| 4275| 3971| 33961| 29941| 32233|
| 256| 128| 35499| 11403| 10830| 7211| 22450| 23638|
| 512| 64| 31842| 48571| 19553| 16079| 10541| 26185|
| 1024| 32| 106675| 110620| 51107| 9599| 9256| 20036|
Generating LALR tables
Platform 'arduino_101_mcuboot' not specified in any arch .ini file and will not be tested
Platform 'nrf52_blenano2' not specified in any arch .ini file and will not be tested
----------------sanity-out/qemu_x86/tests/legacy/benchmark/app_kernel/test/qemu.log-----------------
0 of 3 tests passed with 0 warnings in 185 seconds
Build step 'Execute shell' marked build as failure

Join builds@lists.zephyrproject.org to automatically receive all group messages.