zephyr/master: daily build zephyr-kernel-1.6.99-170213-f1260fb Failure


donotreply@...
 

zephyr/master: daily build zephyr-kernel-1.6.99-170213-f1260fb Failure



job zephyr-sanity build number 476 failed
see: https://jenkins.zephyrproject.org/job/zephyr-sanity/476/

CC kernel/work_q.o
LD kernel/built-in.o
AR kernel/lib.a
make[3]: Target `all' not remade because of errors.
make[3]: Leaving directory `/w/workspace/zephyr-sanity/sanity-out/stm32_mini_a15/tests/crypto/test_mbedtls/test'
make[2]: *** [sub-make] Error 2
make[2]: Target `all' not remade because of errors.
make[2]: Leaving directory `/w/workspace/zephyr-sanity'
make[1]: *** [all] Error 2
make[1]: Leaving directory `/w/workspace/zephyr-sanity/tests/crypto/test_mbedtls'
Generating LALR tables
Platform 'panther' not specified in any arch .ini file and will not be tested
Platform 'panther_ss' not specified in any arch .ini file and will not be tested
-----------------sanity-out/stm32_mini_a15/tests/crypto/test_mbedtls/test/build.log-----------------
qemu_x86 tests/net/udp/test FAILED: failed
--------------------------sanity-out/qemu_x86/tests/net/udp/test/qemu.log---------------------------
***** BOOTING ZEPHYR OS v1.6.99 - BUILD: Feb 14 2017 02:05:28 *****
Timeout, packet not received
Timeout, packet not received
IPv4 wrong user data 0x0010eae8 returned, expected 0x0010ead4
507: UDP test "&any_addr4-&any_addr4-1234-4242" fail
===================================================================
PROJECT EXECUTION FAILED
--------------------------sanity-out/qemu_x86/tests/net/udp/test/qemu.log---------------------------
0 of 26 tests passed with 0 warnings in 28 seconds
Extra environment setting:
CONFIG_ASSERT=y
CONFIG_DEBUG=y
Build step 'Execute shell' marked build as failure


job zephyr-sanity build number 475 failed
see: https://jenkins.zephyrproject.org/job/zephyr-sanity/475/

CC kernel/msg_q.o
CC kernel/mutex.o
CC kernel/pipes.o
CC kernel/sched.o
CC kernel/sem.o
CC kernel/stack.o
CC kernel/sys_clock.o
CC kernel/system_work_q.o
CC kernel/thread.o
CC kernel/thread_abort.o
CC kernel/timer.o
CC kernel/work_q.o
LD kernel/built-in.o
AR kernel/lib.a
make[3]: Target `all' not remade because of errors.
make[3]: Leaving directory `/w/workspace/zephyr-sanity/sanity-out/stm32373c_eval/tests/crypto/test_mbedtls/test'
make[2]: *** [sub-make] Error 2
make[2]: Target `all' not remade because of errors.
make[2]: Leaving directory `/w/workspace/zephyr-sanity'
make[1]: *** [all] Error 2
make[1]: Leaving directory `/w/workspace/zephyr-sanity/tests/crypto/test_mbedtls'
Generating LALR tables
Platform 'panther' not specified in any arch .ini file and will not be tested
Platform 'panther_ss' not specified in any arch .ini file and will not be tested
-----------------sanity-out/stm32373c_eval/tests/crypto/test_mbedtls/test/build.log-----------------
0 of 26 tests passed with 0 warnings in 41 seconds
Extra environment setting:
CONFIG_DEBUG=y
Build step 'Execute shell' marked build as failure

Join builds@lists.zephyrproject.org to automatically receive all group messages.