zephyr/master: daily build zephyr-kernel-1.6.99-170128-a45dd12 Failure


donotreply@...
 

zephyr/master: daily build zephyr-kernel-1.6.99-170128-a45dd12 Failure



job zephyr-sanity build number 412 failed
see: https://jenkins.zephyrproject.org/job/zephyr-sanity/412/

------------sanity-out/qemu_cortex_m3/tests/kernel/mem_pool/test_mpool_api/test/qemu.log------------
***** BOOTING ZEPHYR OS v1.6.99 - BUILD: Jan 29 2017 00:19:17 *****
Running test suite test_mpool_api
tc_start() - test_mpool_alloc_free_thread
===================================================================
PASS - test_mpool_alloc_free_thread.
tc_start() - test_mpool_alloc_free_isr
ASSERTION FAIL [!_IsInIsr()] @ /w/workspace/zephyr-sanity/kernel/include/ksched.h:237:
------------sanity-out/qemu_cortex_m3/tests/kernel/mem_pool/test_mpool_api/test/qemu.log------------
qemu_nios2 tests/kernel/pipe/test_pipe_api/test FAILED: timeout
----------------sanity-out/qemu_nios2/tests/kernel/pipe/test_pipe_api/test/qemu.log-----------------
Running test suite test_pipe_api
tc_start() - test_pipe_thread2thread
===================================================================
PASS - test_pipe_thread2thread.
tc_start() - test_pipe_thread2isr
ASSERTION FAIL [!(_kernel.nested != 0)] @ /w/workspace/zephyr-sanity/kernel/include/ksched.h:237:
----------------sanity-out/qemu_nios2/tests/kernel/pipe/test_pipe_api/test/qemu.log-----------------
qemu_cortex_m3 tests/kernel/timer/timer_api/test FAILED: timeout
----------------sanity-out/qemu_cortex_m3/tests/kernel/timer/timer_api/test/qemu.log----------------
Running test suite test_timer_api
tc_start() - test_timer_duration_period
ASSERTION FAIL [!_IsInIsr()] @ /w/workspace/zephyr-sanity/kernel/timer.c:134:
----------------sanity-out/qemu_cortex_m3/tests/kernel/timer/timer_api/test/qemu.log----------------
0 of 43 tests passed with 0 warnings in 171 seconds
Extra environment setting:
CONFIG_ASSERT=y
CONFIG_DEBUG=y
Build step 'Execute shell' marked build as failure


job zephyr-sanity build number 411 failed
see: https://jenkins.zephyrproject.org/job/zephyr-sanity/411/

GDT= 00100070 00000017
IDT= 00104ab0 000007ff
CR0=0000003f CR2=00000000 CR3=00000000 CR4=00000000
DR0=00000000 DR1=00000000 DR2=00000000 DR3=00000000
DR6=ffff0ff0 DR7=00000400
CCS=00000000 CCD=00000030 CCO=ADDB
EFER=0000000000000000
FCW=037f FSW=0000 [ST=0] FTW=00 MXCSR=00001f80
FPR0=0000000000000000 0000 FPR1=0000000000000000 0000
FPR2=0000000000000000 0000 FPR3=0000000000000000 0000
FPR4=0000000000000000 0000 FPR5=0000000000000000 0000
FPR6=0000000000000000 0000 FPR7=0000000000000000 0000
XMM00=00000000000000000000000000000000 XMM01=00000000000000000000000000000000
XMM02=00000000000000000000000000000000 XMM03=00000000000000000000000000000000
XMM04=00000000000000000000000000000000 XMM05=00000000000000000000000000000000
XMM06=00000000000000000000000000000000 XMM07=00000000000000000000000000000000
make[3]: *** [run] Aborted (core dumped)
make[3]: Target `qemu' not remade because of errors.
make[3]: Leaving directory `/w/workspace/zephyr-sanity/sanity-out/qemu_x86/tests/legacy/kernel/test_sema/nanokernel/test'
make[2]: *** [sub-make] Error 2
make[2]: Target `qemu' not remade because of errors.
make[2]: Leaving directory `/w/workspace/zephyr-sanity'
make[1]: *** [qemu] Error 2
make[1]: Leaving directory `/w/workspace/zephyr-sanity/tests/legacy/kernel/test_sema/nanokernel'
-------------sanity-out/qemu_x86/tests/legacy/kernel/test_sema/nanokernel/test/run.log--------------
0 of 31 tests passed with 0 warnings in 55 seconds
Extra environment setting:
CONFIG_DEBUG=y
Build step 'Execute shell' marked build as failure


job zephyr-sanity build number 410 failed
see: https://jenkins.zephyrproject.org/job/zephyr-sanity/410/

qemu_cortex_m3 tests/kernel/mem_pool/test_mpool_api/test FAILED: timeout
------------sanity-out/qemu_cortex_m3/tests/kernel/mem_pool/test_mpool_api/test/qemu.log------------
***** BOOTING ZEPHYR OS v1.6.99 - BUILD: Jan 29 2017 00:20:13 *****
Running test suite test_mpool_api
tc_start() - test_mpool_alloc_free_thread
===================================================================
PASS - test_mpool_alloc_free_thread.
tc_start() - test_mpool_alloc_free_isr
ASSERTION FAIL [!_IsInIsr()] @ /w/workspace/zephyr-sanity/kernel/include/ksched.h:237:
------------sanity-out/qemu_cortex_m3/tests/kernel/mem_pool/test_mpool_api/test/qemu.log------------
qemu_cortex_m3 tests/kernel/pipe/test_pipe_api/test FAILED: timeout
--------------sanity-out/qemu_cortex_m3/tests/kernel/pipe/test_pipe_api/test/qemu.log---------------
Running test suite test_pipe_api
tc_start() - test_pipe_thread2thread
===================================================================
PASS - test_pipe_thread2thread.
tc_start() - test_pipe_thread2isr
ASSERTION FAIL [!_IsInIsr()] @ /w/workspace/zephyr-sanity/kernel/include/ksched.h:237:
--------------sanity-out/qemu_cortex_m3/tests/kernel/pipe/test_pipe_api/test/qemu.log---------------
qemu_x86 tests/kernel/timer/timer_api/test FAILED: timeout
-------------------sanity-out/qemu_x86/tests/kernel/timer/timer_api/test/qemu.log-------------------
Running test suite test_timer_api
tc_start() - test_timer_duration_period
ASSERTION FAIL [!(_kernel.nested != 0)] @ /w/workspace/zephyr-sanity/kernel/timer.c:134:
-------------------sanity-out/qemu_x86/tests/kernel/timer/timer_api/test/qemu.log-------------------
0 of 12 tests passed with 0 warnings in 80 seconds
Extra environment setting:
CONFIG_ASSERT=y
Build step 'Execute shell' marked build as failure

Join builds@lists.zephyrproject.org to automatically receive all group messages.