zephyr/master: daily build zephyr-kernel-1.6.99-170129-f086a19 Failure


donotreply@...
 

zephyr/master: daily build zephyr-kernel-1.6.99-170129-f086a19 Failure



job zephyr-sanity build number 416 failed
see: https://jenkins.zephyrproject.org/job/zephyr-sanity/416/

***** BOOTING ZEPHYR OS v1.6.99 - BUILD: Jan 30 2017 00:15:07 *****
Running test suite test_mpool_api
tc_start() - test_mpool_alloc_free_thread
===================================================================
PASS - test_mpool_alloc_free_thread.
tc_start() - test_mpool_alloc_free_isr
ASSERTION FAIL [!(_kernel.nested != 0)] @ /w/workspace/zephyr-sanity/kernel/include/ksched.h:237:
---------------sanity-out/qemu_x86/tests/kernel/mem_pool/test_mpool_api/test/qemu.log---------------
qemu_nios2 tests/kernel/timer/timer_api/test FAILED: timeout
------------------sanity-out/qemu_nios2/tests/kernel/timer/timer_api/test/qemu.log------------------
Running test suite test_timer_api
tc_start() - test_timer_duration_period
ASSERTION FAIL [!(_kernel.nested != 0)] @ /w/workspace/zephyr-sanity/kernel/timer.c:134:
------------------sanity-out/qemu_nios2/tests/kernel/timer/timer_api/test/qemu.log------------------
qemu_x86_iamcu tests/kernel/mem_pool/test_mpool_api/test FAILED: timeout
------------sanity-out/qemu_x86_iamcu/tests/kernel/mem_pool/test_mpool_api/test/qemu.log------------
***** BOOTING ZEPHYR OS v1.6.99 - BUILD: Jan 30 2017 00:15:31 *****
Running test suite test_mpool_api
tc_start() - test_mpool_alloc_free_thread
===================================================================
PASS - test_mpool_alloc_free_thread.
tc_start() - test_mpool_alloc_free_isr
ASSERTION FAIL [!(_kernel.nested != 0)] @ /w/workspace/zephyr-sanity/kernel/include/ksched.h:237:
------------sanity-out/qemu_x86_iamcu/tests/kernel/mem_pool/test_mpool_api/test/qemu.log------------
0 of 43 tests passed with 0 warnings in 178 seconds
Extra environment setting:
CONFIG_ASSERT=y
CONFIG_DEBUG=y
Build step 'Execute shell' marked build as failure


job zephyr-sanity build number 415 failed
see: https://jenkins.zephyrproject.org/job/zephyr-sanity/415/

AS arch/arm/core/cortex_m/reset.o
AS arch/arm/core/cortex_m/nmi_on_reset.o
CC arch/arm/core/cortex_m/prep_c.o
CC arch/arm/core/cortex_m/scs.o
CC arch/arm/core/cortex_m/scb.o
CC arch/arm/core/cortex_m/nmi.o
CC arch/arm/core/cortex_m/exc_manage.o
CC arch/arm/core/cortex_m/irq_vector_table.o
AS arch/arm/core/cortex_m/sw_isr_table.o
LD arch/arm/core/cortex_m/built-in.o
LD arch/arm/core/built-in.o
AR kernel/lib.a
LD arch/arm/built-in.o
LD arch/built-in.o
make[3]: Target `all' not remade because of errors.
make[3]: Leaving directory `/w/workspace/zephyr-sanity/sanity-out/mps2_an385/tests/crypto/test_mbedtls/test'
make[2]: *** [sub-make] Error 2
make[2]: Target `all' not remade because of errors.
make[2]: Leaving directory `/w/workspace/zephyr-sanity'
make[1]: *** [all] Error 2
make[1]: Leaving directory `/w/workspace/zephyr-sanity/tests/crypto/test_mbedtls'
Generating LALR tables
Platform 'zedboard_pulpino' not specified in any arch .ini file and will not be tested
Platform 'qemu_riscv32' not specified in any arch .ini file and will not be tested
-------------------sanity-out/mps2_an385/tests/crypto/test_mbedtls/test/build.log-------------------
0 of 31 tests passed with 0 warnings in 50 seconds
Extra environment setting:
CONFIG_DEBUG=y
Build step 'Execute shell' marked build as failure


job zephyr-sanity build number 414 failed
see: https://jenkins.zephyrproject.org/job/zephyr-sanity/414/

-------------------sanity-out/qemu_x86/tests/kernel/timer/timer_api/test/qemu.log-------------------
qemu_x86_iamcu tests/kernel/pipe/test_pipe_api/test FAILED: timeout
--------------sanity-out/qemu_x86_iamcu/tests/kernel/pipe/test_pipe_api/test/qemu.log---------------
Running test suite test_pipe_api
tc_start() - test_pipe_thread2thread
===================================================================
PASS - test_pipe_thread2thread.
tc_start() - test_pipe_thread2isr
ASSERTION FAIL [!(_kernel.nested != 0)] @ /w/workspace/zephyr-sanity/kernel/include/ksched.h:237:
--------------sanity-out/qemu_x86_iamcu/tests/kernel/pipe/test_pipe_api/test/qemu.log---------------
qemu_cortex_m3 tests/kernel/timer/timer_api/test FAILED: timeout
----------------sanity-out/qemu_cortex_m3/tests/kernel/timer/timer_api/test/qemu.log----------------
Running test suite test_timer_api
tc_start() - test_timer_duration_period
ASSERTION FAIL [!_IsInIsr()] @ /w/workspace/zephyr-sanity/kernel/timer.c:134:
----------------sanity-out/qemu_cortex_m3/tests/kernel/timer/timer_api/test/qemu.log----------------
qemu_cortex_m3 tests/kernel/pipe/test_pipe_api/test FAILED: timeout
--------------sanity-out/qemu_cortex_m3/tests/kernel/pipe/test_pipe_api/test/qemu.log---------------
Running test suite test_pipe_api
tc_start() - test_pipe_thread2thread
===================================================================
PASS - test_pipe_thread2thread.
tc_start() - test_pipe_thread2isr
ASSERTION FAIL [!_IsInIsr()] @ /w/workspace/zephyr-sanity/kernel/include/ksched.h:237:
--------------sanity-out/qemu_cortex_m3/tests/kernel/pipe/test_pipe_api/test/qemu.log---------------
0 of 12 tests passed with 0 warnings in 79 seconds
Extra environment setting:
CONFIG_ASSERT=y
Build step 'Execute shell' marked build as failure

Join builds@lists.zephyrproject.org to automatically receive all group messages.