zephyr/master: daily build zephyr-kernel-1.7.99-170221-15b8ed1 Failure


donotreply@...
 

zephyr/master: daily build zephyr-kernel-1.7.99-170221-15b8ed1 Failure



job zephyr-sanity build number 508 failed
see: https://jenkins.zephyrproject.org/job/zephyr-sanity/508/

FPR0=0000000000000000 0000 FPR1=0000000000000000 0000
FPR2=0000000000000000 0000 FPR3=0000000000000000 0000
FPR4=0000000000000000 0000 FPR5=0000000000000000 0000
FPR6=0000000000000000 0000 FPR7=0000000000000000 0000
XMM00=00000000000000000000000000000000 XMM01=00000000000000000000000000000000
XMM02=00000000000000000000000000000000 XMM03=00000000000000000000000000000000
XMM04=00000000000000000000000000000000 XMM05=00000000000000000000000000000000
XMM06=00000000000000000000000000000000 XMM07=00000000000000000000000000000000
make[3]: *** [run] Aborted (core dumped)
make[3]: Leaving directory `/w/workspace/zephyr-sanity/sanity-out/qemu_x86/tests/legacy/kernel/test_sleep/test'
make[2]: *** [sub-make] Error 2
make[2]: Target `run' not remade because of errors.
make[2]: Leaving directory `/w/workspace/zephyr-sanity'
make[1]: *** [run] Error 2
make[1]: Leaving directory `/w/workspace/zephyr-sanity/tests/legacy/kernel/test_sleep'
Generating LALR tables
------------------sanity-out/qemu_x86/tests/legacy/kernel/test_sleep/test/run.log-------------------
qemu_x86 tests/net/udp/test FAILED: timeout
--------------------------sanity-out/qemu_x86/tests/net/udp/test/qemu.log---------------------------
***** BOOTING ZEPHYR OS v1.7.99 - BUILD: Feb 22 2017 02:14:36 *****
Timeout, packet not received
Timeout, packet not received
ASSERTION FAIL [_is_prio_higher(thread->base.prio, 15) || ((thread->base.prio == 15) && (thread == _idle_thread))] @ /w/workspace/zephyr-sanity/kernel/include/ksched.h:397:
--------------------------sanity-out/qemu_x86/tests/net/udp/test/qemu.log---------------------------
0 of 30 tests passed with 0 warnings in 86 seconds
Extra environment setting:
CONFIG_ASSERT=y
CONFIG_DEBUG=y
Build step 'Execute shell' marked build as failure


job zephyr-sanity build number 507 failed
see: https://jenkins.zephyrproject.org/job/zephyr-sanity/507/

make[5]: *** [ext/lib/crypto] Error 2
make[5]: Target `__build' not remade because of errors.
make[4]: *** [ext/lib] Error 2
make[4]: Target `__build' not remade because of errors.
make[3]: *** [ext] Error 2
make[3]: Target `all' not remade because of errors.
make[3]: Leaving directory `/w/workspace/zephyr-sanity/sanity-out/qemu_nios2/tests/crypto/test_mbedtls/test_nios'
make[2]: *** [sub-make] Error 2
make[2]: Target `all' not remade because of errors.
make[2]: Leaving directory `/w/workspace/zephyr-sanity'
make[1]: *** [all] Error 2
make[1]: Leaving directory `/w/workspace/zephyr-sanity/tests/crypto/test_mbedtls'
Generating LALR tables
----------------sanity-out/qemu_nios2/tests/crypto/test_mbedtls/test_nios/build.log-----------------
qemu_x86 tests/net/udp/test FAILED: failed
--------------------------sanity-out/qemu_x86/tests/net/udp/test/qemu.log---------------------------
***** BOOTING ZEPHYR OS v1.7.99 - BUILD: Feb 22 2017 02:05:24 *****
Timeout, packet not received
Timeout, packet not received
Timeout, packet not received
IPv4 wrong user data 0x0010df08 returned, expected 0x0010def4
508: UDP test "&any_addr4-&any_addr4-1234-4242" fail
===================================================================
PROJECT EXECUTION FAILED
--------------------------sanity-out/qemu_x86/tests/net/udp/test/qemu.log---------------------------
0 of 30 tests passed with 0 warnings in 37 seconds
Extra environment setting:
CONFIG_DEBUG=y
Build step 'Execute shell' marked build as failure


job zephyr-sanity build number 506 failed
see: https://jenkins.zephyrproject.org/job/zephyr-sanity/506/

CC ext/lib/crypto/mbedtls/library/x509_crl.o
CC ext/lib/crypto/mbedtls/library/x509_crt.o
CC ext/lib/crypto/mbedtls/library/x509_csr.o
CC ext/lib/crypto/mbedtls/library/x509write_crt.o
CC ext/lib/crypto/mbedtls/library/x509write_csr.o
CC ext/lib/crypto/mbedtls/library/xtea.o
LD ext/lib/crypto/mbedtls/built-in.o
LD ext/lib/crypto/built-in.o
LD ext/lib/built-in.o
LD ext/built-in.o
AR libzephyr.a
LINK zephyr.lnk
/opt/zephyr-sdk-0.9/sysroots/x86_64-pokysdk-linux/usr/libexec/i586-zephyr-elf/gcc/i586-zephyr-elf/6.2.0/real-ld: zephyr_prebuilt.elf section `noinit' will not fit in region `RAM'
/opt/zephyr-sdk-0.9/sysroots/x86_64-pokysdk-linux/usr/libexec/i586-zephyr-elf/gcc/i586-zephyr-elf/6.2.0/real-ld: region `RAM' overflowed by 2080 bytes
collect2: error: ld returned 1 exit status
make[3]: *** [zephyr_prebuilt.elf] Error 1
make[3]: Target `all' not remade because of errors.
make[3]: Leaving directory `/w/workspace/zephyr-sanity/sanity-out/qemu_x86/samples/net/http_server/test'
make[2]: *** [sub-make] Error 2
make[2]: Target `all' not remade because of errors.
make[2]: Leaving directory `/w/workspace/zephyr-sanity'
make[1]: *** [all] Error 2
make[1]: Leaving directory `/w/workspace/zephyr-sanity/samples/net/http_server'
Generating LALR tables
---------------------sanity-out/qemu_x86/samples/net/http_server/test/build.log---------------------
0 of 1 tests passed with 0 warnings in 6 seconds
Extra environment setting:
CONFIG_ASSERT=y
Build step 'Execute shell' marked build as failure

Join builds@lists.zephyrproject.org to automatically receive all group messages.