zephyr/master: daily build zephyr-kernel-1.7.99-170304-4172b26 Failure


donotreply@...
 

zephyr/master: daily build zephyr-kernel-1.7.99-170304-4172b26 Failure



job zephyr-sanity build number 552 failed
see: https://jenkins.zephyrproject.org/job/zephyr-sanity/552/

CC kernel/work_q.o
AR kernel/lib.a
AR libzephyr.a
LINK zephyr.lnk
/opt/zephyr-sdk-0.9/sysroots/x86_64-pokysdk-linux/usr/libexec/i586-zephyr-elf/gcc/i586-zephyr-elf/6.2.0/real-ld: zephyr_prebuilt.elf section `bss' will not fit in region `RAM'
/opt/zephyr-sdk-0.9/sysroots/x86_64-pokysdk-linux/usr/libexec/i586-zephyr-elf/gcc/i586-zephyr-elf/6.2.0/real-ld: region `RAM' overflowed by 33600 bytes
collect2: error: ld returned 1 exit status
make[3]: *** [zephyr_prebuilt.elf] Error 1
make[3]: Target `all' not remade because of errors.
make[3]: Leaving directory `/w/workspace/zephyr-sanity/sanity-out/qemu_x86/samples/net/http_server/test'
make[2]: *** [sub-make] Error 2
make[2]: Target `all' not remade because of errors.
make[2]: Leaving directory `/w/workspace/zephyr-sanity'
make[1]: *** [all] Error 2
make[1]: Leaving directory `/w/workspace/zephyr-sanity/samples/net/http_server'
Generating LALR tables
---------------------sanity-out/qemu_x86/samples/net/http_server/test/build.log---------------------
qemu_riscv32 tests/kernel/timer/timer_monotonic/test PASSED
qemu_x86 tests/net/udp/test FAILED: timeout
--------------------------sanity-out/qemu_x86/tests/net/udp/test/qemu.log---------------------------
***** BOOTING ZEPHYR OS v1.7.99 - BUILD: Mar 5 2017 02:28:48 *****
Timeout, packet not received
ASSERTION FAIL [_is_prio_higher(thread->base.prio, 15) || ((thread->base.prio == 15) && (thread == _idle_thread))] @ /w/workspace/zephyr-sanity/kernel/include/ksched.h:397:
--------------------------sanity-out/qemu_x86/tests/net/udp/test/qemu.log---------------------------
1 of 31 tests passed with 0 warnings in 91 seconds
Extra environment setting:
CONFIG_ASSERT=y
CONFIG_DEBUG=y
Build step 'Execute shell' marked build as failure


job zephyr-sanity build number 551 failed
see: https://jenkins.zephyrproject.org/job/zephyr-sanity/551/

AR libzephyr.a
LINK zephyr.lnk
/opt/zephyr-sdk-0.9/sysroots/x86_64-pokysdk-linux/usr/bin/riscv32-zephyr-elf/../../libexec/riscv32-zephyr-elf/gcc/riscv32-zephyr-elf/6.1.0/real-ld: zephyr_prebuilt.elf section `text' will not fit in region `INSTRRAM'
/opt/zephyr-sdk-0.9/sysroots/x86_64-pokysdk-linux/usr/bin/riscv32-zephyr-elf/../../libexec/riscv32-zephyr-elf/gcc/riscv32-zephyr-elf/6.1.0/real-ld: region `INSTRRAM' overflowed by 2152 bytes
collect2: error: ld returned 1 exit status
make[3]: *** [zephyr_prebuilt.elf] Error 1
make[3]: Target `all' not remade because of errors.
make[3]: Leaving directory `/w/workspace/zephyr-sanity/sanity-out/zedboard_pulpino/tests/kernel/common/test'
make[2]: *** [sub-make] Error 2
make[2]: Target `all' not remade because of errors.
make[2]: Leaving directory `/w/workspace/zephyr-sanity'
make[1]: *** [all] Error 2
make[1]: Leaving directory `/w/workspace/zephyr-sanity/tests/kernel/common'
-------------------sanity-out/zedboard_pulpino/tests/kernel/common/test/build.log-------------------
qemu_x86 tests/net/udp/test FAILED: failed
--------------------------sanity-out/qemu_x86/tests/net/udp/test/qemu.log---------------------------
***** BOOTING ZEPHYR OS v1.7.99 - BUILD: Mar 5 2017 02:10:17 *****
Timeout, packet not received
Timeout, packet not received
Timeout, packet not received
IPv4 wrong user data 0x0010e068 returned, expected 0x0010e054
508: UDP test "&any_addr4-&any_addr4-1234-4242" fail
===================================================================
PROJECT EXECUTION FAILED
--------------------------sanity-out/qemu_x86/tests/net/udp/test/qemu.log---------------------------
0 of 30 tests passed with 0 warnings in 30 seconds
Extra environment setting:
CONFIG_DEBUG=y
Build step 'Execute shell' marked build as failure


job zephyr-sanity build number 550 failed
see: https://jenkins.zephyrproject.org/job/zephyr-sanity/550/

CC ext/lib/crypto/mbedtls/library/x509_crl.o
CC ext/lib/crypto/mbedtls/library/x509_crt.o
CC ext/lib/crypto/mbedtls/library/x509_csr.o
CC ext/lib/crypto/mbedtls/library/x509write_crt.o
CC ext/lib/crypto/mbedtls/library/x509write_csr.o
CC ext/lib/crypto/mbedtls/library/xtea.o
LD ext/lib/crypto/mbedtls/built-in.o
LD ext/lib/crypto/built-in.o
LD ext/lib/built-in.o
LD ext/built-in.o
AR libzephyr.a
LINK zephyr.lnk
/opt/zephyr-sdk-0.9/sysroots/x86_64-pokysdk-linux/usr/libexec/i586-zephyr-elf/gcc/i586-zephyr-elf/6.2.0/real-ld: zephyr_prebuilt.elf section `noinit' will not fit in region `RAM'
/opt/zephyr-sdk-0.9/sysroots/x86_64-pokysdk-linux/usr/libexec/i586-zephyr-elf/gcc/i586-zephyr-elf/6.2.0/real-ld: region `RAM' overflowed by 1952 bytes
collect2: error: ld returned 1 exit status
make[3]: *** [zephyr_prebuilt.elf] Error 1
make[3]: Target `all' not remade because of errors.
make[3]: Leaving directory `/w/workspace/zephyr-sanity/sanity-out/qemu_x86/samples/net/http_server/test'
make[2]: *** [sub-make] Error 2
make[2]: Target `all' not remade because of errors.
make[2]: Leaving directory `/w/workspace/zephyr-sanity'
make[1]: *** [all] Error 2
make[1]: Leaving directory `/w/workspace/zephyr-sanity/samples/net/http_server'
Generating LALR tables
---------------------sanity-out/qemu_x86/samples/net/http_server/test/build.log---------------------
0 of 1 tests passed with 0 warnings in 4 seconds
Extra environment setting:
CONFIG_ASSERT=y
Build step 'Execute shell' marked build as failure

Join builds@lists.zephyrproject.org to automatically receive all group messages.