zephyr/master: daily build zephyr-kernel-1.6.99-170201-f5b3e2a Failure


donotreply@...
 

zephyr/master: daily build zephyr-kernel-1.6.99-170201-f5b3e2a Failure



job zephyr-sanity build number 428 failed
see: https://jenkins.zephyrproject.org/job/zephyr-sanity/428/

===================================================================
PASS - test_mpool_alloc_free_thread.
tc_start() - test_mpool_alloc_free_isr
ASSERTION FAIL [!(_kernel.nested != 0)] @ /w/workspace/zephyr-sanity/kernel/include/ksched.h:237:
---------------sanity-out/qemu_x86/tests/kernel/mem_pool/test_mpool_api/test/qemu.log---------------
qemu_x86_iamcu tests/kernel/mem_pool/test_mpool_api/test FAILED: timeout
------------sanity-out/qemu_x86_iamcu/tests/kernel/mem_pool/test_mpool_api/test/qemu.log------------
***** BOOTING ZEPHYR OS v1.6.99 - BUILD: Feb 2 2017 00:34:19 *****
Running test suite test_mpool_api
tc_start() - test_mpool_alloc_free_thread
===================================================================
PASS - test_mpool_alloc_free_thread.
tc_start() - test_mpool_alloc_free_isr
ASSERTION FAIL [!(_kernel.nested != 0)] @ /w/workspace/zephyr-sanity/kernel/include/ksched.h:237:
------------sanity-out/qemu_x86_iamcu/tests/kernel/mem_pool/test_mpool_api/test/qemu.log------------
qemu_nios2 tests/kernel/pipe/test_pipe_api/test FAILED: timeout
----------------sanity-out/qemu_nios2/tests/kernel/pipe/test_pipe_api/test/qemu.log-----------------
Running test suite test_pipe_api
tc_start() - test_pipe_thread2thread
===================================================================
PASS - test_pipe_thread2thread.
tc_start() - test_pipe_thread2isr
ASSERTION FAIL [!(_kernel.nested != 0)] @ /w/workspace/zephyr-sanity/kernel/include/ksched.h:237:
----------------sanity-out/qemu_nios2/tests/kernel/pipe/test_pipe_api/test/qemu.log-----------------
0 of 47 tests passed with 0 warnings in 195 seconds
Extra environment setting:
CONFIG_ASSERT=y
CONFIG_DEBUG=y
Build step 'Execute shell' marked build as failure


job zephyr-sanity build number 427 failed
see: https://jenkins.zephyrproject.org/job/zephyr-sanity/427/

GDT= 00100070 00000017
IDT= 00103c70 000007ff
CR0=0000003f CR2=00000000 CR3=00000000 CR4=00000000
DR0=00000000 DR1=00000000 DR2=00000000 DR3=00000000
DR6=ffff0ff0 DR7=00000400
CCS=00000000 CCD=00000030 CCO=ADDB
EFER=0000000000000000
FCW=037f FSW=0000 [ST=0] FTW=00 MXCSR=00001f80
FPR0=0000000000000000 0000 FPR1=0000000000000000 0000
FPR2=0000000000000000 0000 FPR3=0000000000000000 0000
FPR4=0000000000000000 0000 FPR5=0000000000000000 0000
FPR6=0000000000000000 0000 FPR7=0000000000000000 0000
XMM00=00000000000000000000000000000000 XMM01=00000000000000000000000000000000
XMM02=00000000000000000000000000000000 XMM03=00000000000000000000000000000000
XMM04=00000000000000000000000000000000 XMM05=00000000000000000000000000000000
XMM06=00000000000000000000000000000000 XMM07=00000000000000000000000000000000
make[3]: *** [run] Aborted (core dumped)
make[3]: Target `qemu' not remade because of errors.
make[3]: Leaving directory `/w/workspace/zephyr-sanity/sanity-out/qemu_x86/tests/kernel/context/test'
make[2]: *** [sub-make] Error 2
make[2]: Target `qemu' not remade because of errors.
make[2]: Leaving directory `/w/workspace/zephyr-sanity'
make[1]: *** [qemu] Error 2
make[1]: Leaving directory `/w/workspace/zephyr-sanity/tests/kernel/context'
-----------------------sanity-out/qemu_x86/tests/kernel/context/test/run.log------------------------
0 of 32 tests passed with 0 warnings in 62 seconds
Extra environment setting:
CONFIG_DEBUG=y
Build step 'Execute shell' marked build as failure


job zephyr-sanity build number 426 failed
see: https://jenkins.zephyrproject.org/job/zephyr-sanity/426/

--------------sanity-out/qemu_x86_iamcu/tests/kernel/pipe/test_pipe_api/test/qemu.log---------------
Running test suite test_pipe_api
tc_start() - test_pipe_thread2thread
===================================================================
PASS - test_pipe_thread2thread.
tc_start() - test_pipe_thread2isr
ASSERTION FAIL [!(_kernel.nested != 0)] @ /w/workspace/zephyr-sanity/kernel/include/ksched.h:237:
Generating LALR tables
Platform 'sam_e70_xplained' not specified in any arch .ini file and will not be tested
--------------sanity-out/qemu_x86_iamcu/tests/kernel/pipe/test_pipe_api/test/qemu.log---------------
qemu_cortex_m3 tests/kernel/timer/timer_api/test FAILED: timeout
----------------sanity-out/qemu_cortex_m3/tests/kernel/timer/timer_api/test/qemu.log----------------
Running test suite test_timer_api
tc_start() - test_timer_duration_period
ASSERTION FAIL [!_IsInIsr()] @ /w/workspace/zephyr-sanity/kernel/timer.c:134:
----------------sanity-out/qemu_cortex_m3/tests/kernel/timer/timer_api/test/qemu.log----------------
qemu_cortex_m3 tests/kernel/pipe/test_pipe_api/test FAILED: timeout
--------------sanity-out/qemu_cortex_m3/tests/kernel/pipe/test_pipe_api/test/qemu.log---------------
Running test suite test_pipe_api
tc_start() - test_pipe_thread2thread
===================================================================
PASS - test_pipe_thread2thread.
tc_start() - test_pipe_thread2isr
ASSERTION FAIL [!_IsInIsr()] @ /w/workspace/zephyr-sanity/kernel/include/ksched.h:237:
--------------sanity-out/qemu_cortex_m3/tests/kernel/pipe/test_pipe_api/test/qemu.log---------------
0 of 16 tests passed with 0 warnings in 85 seconds
Extra environment setting:
CONFIG_ASSERT=y
Build step 'Execute shell' marked build as failure


job zephyr-sanity build number 425 failed
see: https://jenkins.zephyrproject.org/job/zephyr-sanity/425/

[FAIL] Test #1: ECDH - NIST-p256
===================================================================
FAIL - main.
===================================================================
PROJECT EXECUTION FAILED
-------------------sanity-out/qemu_riscv32/tests/crypto/test_ecc_dh/test/qemu.log-------------------
0 of 1 tests passed with 0 warnings in 1270 seconds
Invalid sanity, let's retry #2
sanitycheck --inline-logs +scripts/sanity_chk/sanity_daily.args --only-failed
Generating LALR tables
Platform 'sam_e70_xplained' not specified in any arch .ini file and will not be tested
Cleaning output directory /w/workspace/zephyr-sanity/sanity-out
Selecting all possible platforms per test case
Building testcase defconfigs...
1 tests selected, 11923 tests discarded due to filters
qemu_riscv32 tests/crypto/test_ecc_dh/test FAILED: failed
-------------------sanity-out/qemu_riscv32/tests/crypto/test_ecc_dh/test/qemu.log-------------------
***** BOOTING ZEPHYR OS v1.6.99 - BUILD: Feb 2 2017 00:41:58 *****
tc_start() - TinyCrypt ECC DH tests

Vector #01 check Z - FAILURE
[FAIL] Test #1: ECDH - NIST-p256
===================================================================
FAIL - main.
===================================================================
PROJECT EXECUTION FAILED
-------------------sanity-out/qemu_riscv32/tests/crypto/test_ecc_dh/test/qemu.log-------------------
0 of 1 tests passed with 0 warnings in 4 seconds
Build step 'Execute shell' marked build as failure

Join builds@lists.zephyrproject.org to automatically receive all group messages.