zephyr/master: daily build zephyr-kernel-1.6.99-170202-4fc9606 Failure


donotreply@...
 

zephyr/master: daily build zephyr-kernel-1.6.99-170202-4fc9606 Failure



job zephyr-sanity build number 432 failed
see: https://jenkins.zephyrproject.org/job/zephyr-sanity/432/

***** BOOTING ZEPHYR OS v1.6.99 - BUILD: Feb 3 2017 00:43:28 *****
Running test suite test_mpool_api
tc_start() - test_mpool_alloc_free_thread
===================================================================
PASS - test_mpool_alloc_free_thread.
tc_start() - test_mpool_alloc_free_isr
ASSERTION FAIL [!(_kernel.nested != 0)] @ /w/workspace/zephyr-sanity/kernel/include/ksched.h:237:
--------------sanity-out/qemu_nios2/tests/kernel/mem_pool/test_mpool_api/test/qemu.log--------------
qemu_x86_iamcu tests/kernel/pipe/test_pipe_api/test FAILED: timeout
--------------sanity-out/qemu_x86_iamcu/tests/kernel/pipe/test_pipe_api/test/qemu.log---------------
Running test suite test_pipe_api
tc_start() - test_pipe_thread2thread
===================================================================
PASS - test_pipe_thread2thread.
tc_start() - test_pipe_thread2isr
ASSERTION FAIL [!(_kernel.nested != 0)] @ /w/workspace/zephyr-sanity/kernel/include/ksched.h:237:
--------------sanity-out/qemu_x86_iamcu/tests/kernel/pipe/test_pipe_api/test/qemu.log---------------
qemu_riscv32 tests/kernel/timer/timer_api/test FAILED: timeout
-----------------sanity-out/qemu_riscv32/tests/kernel/timer/timer_api/test/qemu.log-----------------
***** BOOTING ZEPHYR OS v1.6.99 *****
Running test suite test_timer_api
tc_start() - test_timer_duration_period
ASSERTION FAIL [!(_kernel.nested != 0)] @ /w/workspace/zephyr-sanity/kernel/timer.c:134:
-----------------sanity-out/qemu_riscv32/tests/kernel/timer/timer_api/test/qemu.log-----------------
0 of 47 tests passed with 0 warnings in 198 seconds
Extra environment setting:
CONFIG_ASSERT=y
CONFIG_DEBUG=y
Build step 'Execute shell' marked build as failure


job zephyr-sanity build number 431 failed
see: https://jenkins.zephyrproject.org/job/zephyr-sanity/431/

CC ext/lib/crypto/mbedtls/library/x509_create.o
CC ext/lib/crypto/mbedtls/library/x509_crl.o
CC ext/lib/crypto/mbedtls/library/x509_crt.o
CC ext/lib/crypto/mbedtls/library/x509_csr.o
CC ext/lib/crypto/mbedtls/library/x509write_crt.o
CC ext/lib/crypto/mbedtls/library/x509write_csr.o
CC ext/lib/crypto/mbedtls/library/xtea.o
make[7]: Target `__build' not remade because of errors.
make[6]: *** [ext/lib/crypto/mbedtls] Error 2
make[6]: Target `__build' not remade because of errors.
make[5]: *** [ext/lib/crypto] Error 2
make[5]: Target `__build' not remade because of errors.
make[4]: *** [ext/lib] Error 2
make[4]: Target `__build' not remade because of errors.
make[3]: *** [ext] Error 2
make[3]: Target `all' not remade because of errors.
make[3]: Leaving directory `/w/workspace/zephyr-sanity/sanity-out/quark_se_c1000_devboard/tests/crypto/test_mbedtls/test'
make[2]: *** [sub-make] Error 2
make[2]: Target `all' not remade because of errors.
make[2]: Leaving directory `/w/workspace/zephyr-sanity'
make[1]: *** [all] Error 2
make[1]: Leaving directory `/w/workspace/zephyr-sanity/tests/crypto/test_mbedtls'
Generating LALR tables
Platform 'sam_e70_xplained' not specified in any arch .ini file and will not be tested
------------sanity-out/quark_se_c1000_devboard/tests/crypto/test_mbedtls/test/build.log-------------
0 of 32 tests passed with 0 warnings in 62 seconds
Extra environment setting:
CONFIG_DEBUG=y
Build step 'Execute shell' marked build as failure


job zephyr-sanity build number 430 failed
see: https://jenkins.zephyrproject.org/job/zephyr-sanity/430/

Running test suite test_timer_api
tc_start() - test_timer_duration_period
ASSERTION FAIL [!_IsInIsr()] @ /w/workspace/zephyr-sanity/kernel/timer.c:134:
Generating LALR tables
Platform 'sam_e70_xplained' not specified in any arch .ini file and will not be tested
----------------sanity-out/qemu_cortex_m3/tests/kernel/timer/timer_api/test/qemu.log----------------
qemu_cortex_m3 tests/kernel/mem_pool/test_mpool_api/test FAILED: timeout
------------sanity-out/qemu_cortex_m3/tests/kernel/mem_pool/test_mpool_api/test/qemu.log------------
***** BOOTING ZEPHYR OS v1.6.99 - BUILD: Feb 3 2017 00:49:41 *****
Running test suite test_mpool_api
tc_start() - test_mpool_alloc_free_thread
===================================================================
PASS - test_mpool_alloc_free_thread.
tc_start() - test_mpool_alloc_free_isr
ASSERTION FAIL [!_IsInIsr()] @ /w/workspace/zephyr-sanity/kernel/include/ksched.h:237:
------------sanity-out/qemu_cortex_m3/tests/kernel/mem_pool/test_mpool_api/test/qemu.log------------
qemu_cortex_m3 tests/kernel/pipe/test_pipe_api/test FAILED: timeout
--------------sanity-out/qemu_cortex_m3/tests/kernel/pipe/test_pipe_api/test/qemu.log---------------
Running test suite test_pipe_api
tc_start() - test_pipe_thread2thread
===================================================================
PASS - test_pipe_thread2thread.
tc_start() - test_pipe_thread2isr
ASSERTION FAIL [!_IsInIsr()] @ /w/workspace/zephyr-sanity/kernel/include/ksched.h:237:
--------------sanity-out/qemu_cortex_m3/tests/kernel/pipe/test_pipe_api/test/qemu.log---------------
0 of 16 tests passed with 0 warnings in 89 seconds
Extra environment setting:
CONFIG_ASSERT=y
Build step 'Execute shell' marked build as failure


job zephyr-sanity build number 429 failed
see: https://jenkins.zephyrproject.org/job/zephyr-sanity/429/

===================================================================
FAIL - main.
===================================================================
PROJECT EXECUTION FAILED
-------------------sanity-out/qemu_riscv32/tests/crypto/test_ecc_dh/test/qemu.log-------------------
qemu_riscv32 tests/legacy/kernel/test_sleep/test PASSED
1 of 2 tests passed with 0 warnings in 1326 seconds
Invalid sanity, let's retry #2
sanitycheck --inline-logs +scripts/sanity_chk/sanity_daily.args --only-failed
Generating LALR tables
Platform 'sam_e70_xplained' not specified in any arch .ini file and will not be tested
Cleaning output directory /w/workspace/zephyr-sanity/sanity-out
Selecting all possible platforms per test case
Building testcase defconfigs...
1 tests selected, 12003 tests discarded due to filters
qemu_riscv32 tests/crypto/test_ecc_dh/test FAILED: failed
-------------------sanity-out/qemu_riscv32/tests/crypto/test_ecc_dh/test/qemu.log-------------------
***** BOOTING ZEPHYR OS v1.6.99 - BUILD: Feb 3 2017 00:49:33 *****
tc_start() - TinyCrypt ECC DH tests

Vector #00 check Z - FAILURE
[FAIL] Test #1: ECDH - NIST-p256
===================================================================
FAIL - main.
===================================================================
PROJECT EXECUTION FAILED
-------------------sanity-out/qemu_riscv32/tests/crypto/test_ecc_dh/test/qemu.log-------------------
0 of 1 tests passed with 0 warnings in 4 seconds
Build step 'Execute shell' marked build as failure

Join builds@lists.zephyrproject.org to automatically receive all group messages.