zephyr/master: daily build zephyr-kernel-1.6.99-170203-aa58ba2 Failure


donotreply@...
 

zephyr/master: daily build zephyr-kernel-1.6.99-170203-aa58ba2 Failure



job zephyr-sanity build number 436 failed
see: https://jenkins.zephyrproject.org/job/zephyr-sanity/436/

eflags: 0x2
Fatal fault in thread 0x001106a0! Aborting.
***** CPU exception 7
Current thread ID = 0x001106a0
Faulting segment:address = 0x8:0x10e17c
eax: 0x10e17c, ebx: 0x1106a0, ecx: 0x3f8, edx: 0x3f8
esi: 0x6, edi: 0x2, ebp: 0110110, esp: 0x110104
eflags: 0x2
Fatal fault in thread 0x001106a0! Aborting.
***** CPU exception 7
Current thread ID = 0x001106a0
Faulting segment:address = 0x8:0x10e17c
eax: 0x10e17c, ebx: 0x1106a0, ecx: 0x3f8, edx: 0x3f8
esi: 0x6, edi: 0x2, ebp: 010fff8, esp: 0x10ffec
eflags: 0x2
Fatal fault in thread 0x001106a0! Aborting.
***** CPU exception 7
Current thread ID = 0x001106a0
Faulting segment:address = 0x8:0x10e17c
eax: 0x10e17c, ebx: 0x1106a0, ecx: 0x3f8, edx: 0x3f8
esi: 0x6, edi: 0x2, ebp: 010fee0, esp: 0x10fed4
eflags: 0x2
Fatal fault in ISR! Spinning...
--------------------------sanity-out/qemu_x86/tests/net/udp/test/qemu.log---------------------------
0 of 136 tests passed with 0 warnings in 208 seconds
Extra environment setting:
CONFIG_ASSERT=y
CONFIG_DEBUG=y
Build step 'Execute shell' marked build as failure


job zephyr-sanity build number 435 failed
see: https://jenkins.zephyrproject.org/job/zephyr-sanity/435/

make[5]: Target `__build' not remade because of errors.
make[4]: *** [drivers/timer] Error 2
make[4]: Target `__build' not remade because of errors.
make[3]: *** [drivers] Error 2
AR kernel/lib.a
make[3]: Target `all' not remade because of errors.
make[3]: Leaving directory `/w/workspace/zephyr-sanity/sanity-out/zedboard_pulpino/tests/legacy/kernel/test_nano_work/test'
make[2]: *** [sub-make] Error 2
make[2]: Target `all' not remade because of errors.
make[2]: Leaving directory `/w/workspace/zephyr-sanity'
make[1]: *** [all] Error 2
make[1]: Leaving directory `/w/workspace/zephyr-sanity/tests/legacy/kernel/test_nano_work'
-----------sanity-out/zedboard_pulpino/tests/legacy/kernel/test_nano_work/test/build.log------------
qemu_x86 tests/net/udp/test FAILED: timeout
--------------------------sanity-out/qemu_x86/tests/net/udp/test/qemu.log---------------------------
***** BOOTING ZEPHYR OS v1.6.99 - BUILD: Feb 4 2017 01:26:24 *****
***** CPU exception 13
***** Exception code: 0xd65c
Current thread ID = 0x0010fb80
Faulting segment:address = 0x8:0x10fbac
eax: 0x1102c8, ebx: 0x10d606, ecx: 0x10d66c, edx: 0xffffff7f
esi: 0x0, edi: 0x0, ebp: 0fffffff5, esp: 0x10fb64
eflags: 0x282
Fatal fault in thread 0x0010fb80! Aborting.
--------------------------sanity-out/qemu_x86/tests/net/udp/test/qemu.log---------------------------
1 of 122 tests passed with 0 warnings in 134 seconds
Extra environment setting:
CONFIG_DEBUG=y
Build step 'Execute shell' marked build as failure


job zephyr-sanity build number 434 failed
see: https://jenkins.zephyrproject.org/job/zephyr-sanity/434/

ASSERTION FAIL [!(_kernel.nested != 0)] @ /w/workspace/zephyr-sanity/kernel/include/ksched.h:237:
---------------sanity-out/qemu_riscv32/tests/kernel/pipe/test_pipe_api/test/qemu.log----------------
qemu_nios2 tests/kernel/timer/timer_api/test FAILED: timeout
------------------sanity-out/qemu_nios2/tests/kernel/timer/timer_api/test/qemu.log------------------
Running test suite test_timer_api
tc_start() - test_timer_duration_period
ASSERTION FAIL [!(_kernel.nested != 0)] @ /w/workspace/zephyr-sanity/kernel/timer.c:134:
------------------sanity-out/qemu_nios2/tests/kernel/timer/timer_api/test/qemu.log------------------
qemu_x86 tests/kernel/mem_pool/test_mpool_api/test FAILED: timeout
---------------sanity-out/qemu_x86/tests/kernel/mem_pool/test_mpool_api/test/qemu.log---------------
***** BOOTING ZEPHYR OS v1.6.99 - BUILD: Feb 4 2017 01:29:52 *****
Running test suite test_mpool_api
tc_start() - test_mpool_alloc_free_thread
===================================================================
PASS - test_mpool_alloc_free_thread.
tc_start() - test_mpool_alloc_free_isr
ASSERTION FAIL [!(_kernel.nested != 0)] @ /w/workspace/zephyr-sanity/kernel/include/ksched.h:237:
---------------sanity-out/qemu_x86/tests/kernel/mem_pool/test_mpool_api/test/qemu.log---------------
qemu_riscv32 tests/kernel/timer/timer_api/test FAILED: timeout
-----------------sanity-out/qemu_riscv32/tests/kernel/timer/timer_api/test/qemu.log-----------------
***** BOOTING ZEPHYR OS v1.6.99 *****
Running test suite test_timer_api
tc_start() - test_timer_duration_period
ASSERTION FAIL [!(_kernel.nested != 0)] @ /w/workspace/zephyr-sanity/kernel/timer.c:134:
-----------------sanity-out/qemu_riscv32/tests/kernel/timer/timer_api/test/qemu.log-----------------
0 of 104 tests passed with 0 warnings in 171 seconds
Extra environment setting:
CONFIG_ASSERT=y
Build step 'Execute shell' marked build as failure

Join builds@lists.zephyrproject.org to automatically receive all group messages.