zephyr/master: daily build zephyr-kernel-1.6.99-170204-fd74c0c Failure


donotreply@...
 

zephyr/master: daily build zephyr-kernel-1.6.99-170204-fd74c0c Failure



job zephyr-sanity build number 440 failed
see: https://jenkins.zephyrproject.org/job/zephyr-sanity/440/

===================================================================
PASS - test_mpool_alloc_free_thread.
tc_start() - test_mpool_alloc_free_isr
ASSERTION FAIL [!(_kernel.nested != 0)] @ /w/workspace/zephyr-sanity/kernel/include/ksched.h:237:
-------------sanity-out/qemu_riscv32/tests/kernel/mem_pool/test_mpool_api/test/qemu.log-------------
qemu_x86 tests/kernel/pipe/test_pipe_api/test FAILED: timeout
-----------------sanity-out/qemu_x86/tests/kernel/pipe/test_pipe_api/test/qemu.log------------------
Running test suite test_pipe_api
tc_start() - test_pipe_thread2thread
===================================================================
PASS - test_pipe_thread2thread.
tc_start() - test_pipe_thread2isr
ASSERTION FAIL [!(_kernel.nested != 0)] @ /w/workspace/zephyr-sanity/kernel/include/ksched.h:237:
-----------------sanity-out/qemu_x86/tests/kernel/pipe/test_pipe_api/test/qemu.log------------------
qemu_x86_iamcu tests/kernel/mem_pool/test_mpool_api/test FAILED: timeout
------------sanity-out/qemu_x86_iamcu/tests/kernel/mem_pool/test_mpool_api/test/qemu.log------------
***** BOOTING ZEPHYR OS v1.6.99 - BUILD: Feb 5 2017 01:28:14 *****
Running test suite test_mpool_api
tc_start() - test_mpool_alloc_free_thread
===================================================================
PASS - test_mpool_alloc_free_thread.
tc_start() - test_mpool_alloc_free_isr
ASSERTION FAIL [!(_kernel.nested != 0)] @ /w/workspace/zephyr-sanity/kernel/include/ksched.h:237:
------------sanity-out/qemu_x86_iamcu/tests/kernel/mem_pool/test_mpool_api/test/qemu.log------------
0 of 133 tests passed with 0 warnings in 201 seconds
Extra environment setting:
CONFIG_ASSERT=y
CONFIG_DEBUG=y
Build step 'Execute shell' marked build as failure


job zephyr-sanity build number 439 failed
see: https://jenkins.zephyrproject.org/job/zephyr-sanity/439/

make[4]: Target `__build' not remade because of errors.
make[3]: *** [drivers] Error 2
LD kernel/built-in.o
AR kernel/lib.a
make[3]: Target `all' not remade because of errors.
make[3]: Leaving directory `/w/workspace/zephyr-sanity/sanity-out/zedboard_pulpino/tests/crypto/test_ecc_dh/test'
make[2]: *** [sub-make] Error 2
make[2]: Target `all' not remade because of errors.
make[2]: Leaving directory `/w/workspace/zephyr-sanity'
make[1]: *** [all] Error 2
make[1]: Leaving directory `/w/workspace/zephyr-sanity/tests/crypto/test_ecc_dh'
Generating LALR tables
----------------sanity-out/zedboard_pulpino/tests/crypto/test_ecc_dh/test/build.log-----------------
qemu_x86 tests/net/udp/test FAILED: timeout
--------------------------sanity-out/qemu_x86/tests/net/udp/test/qemu.log---------------------------
***** BOOTING ZEPHYR OS v1.6.99 - BUILD: Feb 5 2017 01:17:55 *****
***** CPU exception 13
***** Exception code: 0xd65c
Current thread ID = 0x0010fb80
Faulting segment:address = 0x8:0x10fbac
eax: 0x1102c8, ebx: 0x10d606, ecx: 0x10d66c, edx: 0xffffff7f
esi: 0x0, edi: 0x0, ebp: 0fffffff5, esp: 0x10fb64
eflags: 0x282
Fatal fault in thread 0x0010fb80! Aborting.
--------------------------sanity-out/qemu_x86/tests/net/udp/test/qemu.log---------------------------
0 of 124 tests passed with 0 warnings in 137 seconds
Extra environment setting:
CONFIG_DEBUG=y
Build step 'Execute shell' marked build as failure


job zephyr-sanity build number 438 failed
see: https://jenkins.zephyrproject.org/job/zephyr-sanity/438/

tc_start() - test_mpool_alloc_free_thread
===================================================================
PASS - test_mpool_alloc_free_thread.
tc_start() - test_mpool_alloc_free_isr
ASSERTION FAIL [!(_kernel.nested != 0)] @ /w/workspace/zephyr-sanity/kernel/include/ksched.h:237:
------------sanity-out/qemu_x86_iamcu/tests/kernel/mem_pool/test_mpool_api/test/qemu.log------------
qemu_x86 tests/kernel/mem_pool/test_mpool_api/test FAILED: timeout
---------------sanity-out/qemu_x86/tests/kernel/mem_pool/test_mpool_api/test/qemu.log---------------
***** BOOTING ZEPHYR OS v1.6.99 - BUILD: Feb 5 2017 01:16:59 *****
Running test suite test_mpool_api
tc_start() - test_mpool_alloc_free_thread
===================================================================
PASS - test_mpool_alloc_free_thread.
tc_start() - test_mpool_alloc_free_isr
ASSERTION FAIL [!(_kernel.nested != 0)] @ /w/workspace/zephyr-sanity/kernel/include/ksched.h:237:
---------------sanity-out/qemu_x86/tests/kernel/mem_pool/test_mpool_api/test/qemu.log---------------
qemu_cortex_m3 tests/kernel/pipe/test_pipe_api/test FAILED: timeout
--------------sanity-out/qemu_cortex_m3/tests/kernel/pipe/test_pipe_api/test/qemu.log---------------
Running test suite test_pipe_api
tc_start() - test_pipe_thread2thread
===================================================================
PASS - test_pipe_thread2thread.
tc_start() - test_pipe_thread2isr
ASSERTION FAIL [!_IsInIsr()] @ /w/workspace/zephyr-sanity/kernel/include/ksched.h:237:
--------------sanity-out/qemu_cortex_m3/tests/kernel/pipe/test_pipe_api/test/qemu.log---------------
0 of 100 tests passed with 0 warnings in 168 seconds
Extra environment setting:
CONFIG_ASSERT=y
Build step 'Execute shell' marked build as failure


job zephyr-sanity build number 437 failed
see: https://jenkins.zephyrproject.org/job/zephyr-sanity/437/

CC kernel/work_q.o
/w/workspace/zephyr-sanity/drivers/timer/riscv_machine_timer.c:19:27: error: ‘RISCV_MTIME_BASE’ undeclared here (not in a function)
(riscv_machine_timer_t *)RISCV_MTIME_BASE;
^~~~~~~~~~~~~~~~
/w/workspace/zephyr-sanity/drivers/timer/riscv_machine_timer.c:21:27: error: ‘RISCV_MTIMECMP_BASE’ undeclared here (not in a function)
(riscv_machine_timer_t *)RISCV_MTIMECMP_BASE;
^~~~~~~~~~~~~~~~~~~
/w/workspace/zephyr-sanity/drivers/timer/riscv_machine_timer.c: In function ‘_sys_clock_driver_init’:
/w/workspace/zephyr-sanity/drivers/timer/riscv_machine_timer.c:78:18: error: ‘RISCV_MACHINE_TIMER_IRQ’ undeclared (first use in this function)
IRQ_CONNECT(RISCV_MACHINE_TIMER_IRQ, 0,
^~~~~~~~~~~~~~~~~~~~~~~
/w/workspace/zephyr-sanity/drivers/timer/riscv_machine_timer.c:78:18: note: each undeclared identifier is reported only once for each function it appears in
make[5]: *** [drivers/timer/riscv_machine_timer.o] Error 1
make[5]: Target `__build' not remade because of errors.
make[4]: *** [drivers/timer] Error 2
make[4]: Target `__build' not remade because of errors.
make[3]: *** [drivers] Error 2
LD kernel/built-in.o
AR kernel/lib.a
make[3]: Target `all' not remade because of errors.
make[3]: Leaving directory `/w/workspace/zephyr-sanity/sanity-out/zedboard_pulpino/tests/legacy/kernel/test_fifo/microkernel/test'
make[2]: *** [sub-make] Error 2
make[2]: Target `all' not remade because of errors.
make[2]: Leaving directory `/w/workspace/zephyr-sanity'
make[1]: *** [all] Error 2
make[1]: Leaving directory `/w/workspace/zephyr-sanity/tests/legacy/kernel/test_fifo/microkernel'
--------sanity-out/zedboard_pulpino/tests/legacy/kernel/test_fifo/microkernel/test/build.log--------
0 of 90 tests passed with 0 warnings in 66 seconds
Build step 'Execute shell' marked build as failure

Join builds@lists.zephyrproject.org to automatically receive all group messages.