Date   

zephyr/refs/tags/v1.2.0: tag build zephyr-kernel-1.2.0 Failure

donotreply@...
 

zephyr/refs/tags/v1.2.0: tag build zephyr-kernel-1.2.0 Failure

Check console output at https://jenkins.zephyrproject.org/sandbox/job/zephyr-tag/13/ to view the results.


zephyr/refs/tags/v1.2.0: tag build zephyr-kernel-1.2.0 Aborted

donotreply@...
 

zephyr/refs/tags/v1.2.0: tag build zephyr-kernel-1.2.0 Aborted

Check console output at https://jenkins.zephyrproject.org/sandbox/job/zephyr-tag/12/ to view the results.


zephyr/refs/tags/v1.2.0: tag build zephyr-kernel-1.2.0 Still Failing

donotreply@...
 

zephyr/refs/tags/v1.2.0: tag build zephyr-kernel-1.2.0 Still Failing

Check console output at https://jenkins.zephyrproject.org/sandbox/job/zephyr-tag/11/ to view the results.


zephyr/refs/tags/v1.2.0: tag build zephyr-kernel-1.2.0 Still Failing

donotreply@...
 

zephyr/refs/tags/v1.2.0: tag build zephyr-kernel-1.2.0 Still Failing

Check console output at https://jenkins.zephyrproject.org/sandbox/job/zephyr-tag/10/ to view the results.


zephyr/refs/tags/v1.7.0: tag build zephyr-kernel-1.7.0 Still Failing

donotreply@...
 

zephyr/refs/tags/v1.7.0: tag build zephyr-kernel-1.7.0 Still Failing

Check console output at https://jenkins.zephyrproject.org/sandbox/job/zephyr-tag/9/ to view the results.


zephyr/refs/tags/v1.4.0: tag build zephyr-kernel-1.4.0 Still Failing

donotreply@...
 

zephyr/refs/tags/v1.4.0: tag build zephyr-kernel-1.4.0 Still Failing

Check console output at https://jenkins.zephyrproject.org/sandbox/job/zephyr-tag/8/ to view the results.


zephyr/refs/tags/v1.3.0: tag build zephyr-kernel-1.3.0 Still Failing

donotreply@...
 

zephyr/refs/tags/v1.3.0: tag build zephyr-kernel-1.3.0 Still Failing

Check console output at https://jenkins.zephyrproject.org/sandbox/job/zephyr-tag/7/ to view the results.


zephyr/refs/tags/v1.2.0: tag build zephyr-kernel-1.2.0 Still Failing

donotreply@...
 

zephyr/refs/tags/v1.2.0: tag build zephyr-kernel-1.2.0 Still Failing

Check console output at https://jenkins.zephyrproject.org/sandbox/job/zephyr-tag/6/ to view the results.


zephyr/refs/tags/v1.1.0: tag build zephyr-kernel-1.1.0 Failure

donotreply@...
 

zephyr/refs/tags/v1.1.0: tag build zephyr-kernel-1.1.0 Failure

Check console output at https://jenkins.zephyrproject.org/sandbox/job/zephyr-tag/5/ to view the results.


zephyr/refs/tags/v1.1.0: tag build zephyr-kernel-1.1.0 Aborted

donotreply@...
 

zephyr/refs/tags/v1.1.0: tag build zephyr-kernel-1.1.0 Aborted

Check console output at https://jenkins.zephyrproject.org/sandbox/job/zephyr-tag/4/ to view the results.


zephyr/refs/tags/v1.3.0: tag build zephyr-kernel-1.3.0 Still Failing

donotreply@...
 

zephyr/refs/tags/v1.3.0: tag build zephyr-kernel-1.3.0 Still Failing

Check console output at https://jenkins.zephyrproject.org/sandbox/job/zephyr-tag/3/ to view the results.


zephyr/refs/tags/v1.3.0: tag build zephyr-kernel-1.3.0 Still Failing

donotreply@...
 

zephyr/refs/tags/v1.3.0: tag build zephyr-kernel-1.3.0 Still Failing

Check console output at https://jenkins.zephyrproject.org/sandbox/job/zephyr-tag/2/ to view the results.


zephyr/refs/tags/v1.1.0: tag build zephyr-kernel-1.1.0 Failure

donotreply@...
 

zephyr/refs/tags/v1.1.0: tag build zephyr-kernel-1.1.0 Failure

Check console output at https://jenkins.zephyrproject.org/sandbox/job/zephyr-tag/1/ to view the results.


zephyr/master: daily build zephyr-kernel-1.7.99-170320-c9cff15 Failure

donotreply@...
 

zephyr/master: daily build zephyr-kernel-1.7.99-170320-c9cff15 Failure



job zephyr-sanity build number 616 failed
see: https://jenkins.zephyrproject.org/job/zephyr-sanity/616/

make[2]: Leaving directory `/w/workspace/zephyr-sanity'
make[1]: *** [all] Error 2
make[1]: Leaving directory `/w/workspace/zephyr-sanity/samples/bluetooth/central_hr'
Generating LALR tables
Platform 'arduino_101_mcuboot' not specified in any arch .ini file and will not be tested
------------------sanity-out/qemu_x86/samples/bluetooth/central_hr/test/build.log-------------------
qemu_x86 tests/net/neighbor/test FAILED: timeout
------------------------sanity-out/qemu_x86/tests/net/neighbor/test/qemu.log------------------------
***** BOOTING ZEPHYR OS v1.7.99 - BUILD: Mar 21 2017 05:46:04 *****
ASSERTION FAIL [num_events > 0] @ /w/workspace/zephyr-sanity/kernel/poll.c:177:
zero events
------------------------sanity-out/qemu_x86/tests/net/neighbor/test/qemu.log------------------------
qemu_x86 tests/net/trickle/test FAILED: timeout
------------------------sanity-out/qemu_x86/tests/net/trickle/test/qemu.log-------------------------
***** BOOTING ZEPHYR OS v1.7.99 - BUILD: Mar 21 2017 05:46:19 *****
ASSERTION FAIL [num_events > 0] @ /w/workspace/zephyr-sanity/kernel/poll.c:177:
zero events
------------------------sanity-out/qemu_x86/tests/net/trickle/test/qemu.log-------------------------
qemu_x86 tests/net/lib/dns_packet/test FAILED: timeout
---------------------sanity-out/qemu_x86/tests/net/lib/dns_packet/test/qemu.log---------------------
***** BOOTING ZEPHYR OS v1.7.99 - BUILD: Mar 21 2017 05:44:16 *****
ASSERTION FAIL [num_events > 0] @ /w/workspace/zephyr-sanity/kernel/poll.c:177:
zero events
---------------------sanity-out/qemu_x86/tests/net/lib/dns_packet/test/qemu.log---------------------
1 of 145 tests passed with 0 warnings in 10859 seconds
Extra environment setting:
CONFIG_ASSERT=y
CONFIG_DEBUG=y
Build step 'Execute shell' marked build as failure


job zephyr-sanity build number 615 failed
see: https://jenkins.zephyrproject.org/job/zephyr-sanity/615/

[PASS] Test #1: ECDH - NIST-p256
[PASS] Test #2: ECC KeyGen - NIST-p256
[PASS] Test #3: PubKeyVerify - NIST-p256-SHA2-256
Shared secrets are not identical!
Shared secret 1 = 861210fe 218ef2c4 5c227632 bf718c7e 403ad0d1 01698f34 4d0d03e1 ca3e6211
Shared secret 2 = 1235ac8e 9e6db8f6 3e08847b b33e5533 b84b9c3e a5e59f67 a9681822 fa0d5cac
Private key 1 = 00000000 00000000 00000000 00000000 00000000 00000000 00000000 00000000
Private key 2 = 5eb697df 06b7a200 bfbb6041 b71427e4 9a50a860 54ffde2f dcfb85f7 b2d26320
[FAIL] Test #4: Monte Carlo (Randomized EC-DH key-exchange) - NIST-p256
===================================================================
FAIL - main.
===================================================================
PROJECT EXECUTION FAILED
------------------sanity-out/qemu_cortex_m3/tests/crypto/test_ecc_dh/test/qemu.log------------------
qemu_x86 tests/net/udp/test FAILED: timeout
--------------------------sanity-out/qemu_x86/tests/net/udp/test/qemu.log---------------------------
***** BOOTING ZEPHYR OS v1.7.99 - BUILD: Mar 21 2017 02:00:17 *****
***** CPU exception 7
Current thread ID = 0x00111180
Faulting segment:address = 0x8:0x10f3e9
eax: 0x80, ebx: 0x0, ecx: 0x111180, edx: 0x10f024
esi: 0x0, edi: 0x1, ebp: 00, esp: 0x11156c
eflags: 0x282
Fatal fault in essential thread! Spinning...
--------------------------sanity-out/qemu_x86/tests/net/udp/test/qemu.log---------------------------
0 of 33 tests passed with 0 warnings in 85 seconds
Extra environment setting:
CONFIG_DEBUG=y
Build step 'Execute shell' marked build as failure


job zephyr-sanity build number 614 failed
see: https://jenkins.zephyrproject.org/job/zephyr-sanity/614/

--------------------sanity-out/qemu_x86/tests/net/lib/mqtt_packet/test/qemu.log---------------------
qemu_x86 tests/net/lib/zoap/test FAILED: timeout
------------------------sanity-out/qemu_x86/tests/net/lib/zoap/test/qemu.log------------------------
***** BOOTING ZEPHYR OS v1.7.99 - BUILD: Mar 21 2017 05:36:40 *****
ASSERTION FAIL [num_events > 0] @ /w/workspace/zephyr-sanity/kernel/poll.c:177:
zero events
------------------------sanity-out/qemu_x86/tests/net/lib/zoap/test/qemu.log------------------------
qemu_x86 tests/net/nbuf/test FAILED: timeout
--------------------------sanity-out/qemu_x86/tests/net/nbuf/test/qemu.log--------------------------
***** BOOTING ZEPHYR OS v1.7.99 - BUILD: Mar 21 2017 05:36:59 *****
ASSERTION FAIL [num_events > 0] @ /w/workspace/zephyr-sanity/kernel/poll.c:177:
zero events
--------------------------sanity-out/qemu_x86/tests/net/nbuf/test/qemu.log--------------------------
qemu_x86 tests/net/utils/test FAILED: timeout
-------------------------sanity-out/qemu_x86/tests/net/utils/test/qemu.log--------------------------
***** BOOTING ZEPHYR OS v1.7.99 - BUILD: Mar 21 2017 05:37:23 *****
ASSERTION FAIL [num_events > 0] @ /w/workspace/zephyr-sanity/kernel/poll.c:177:
zero events
-------------------------sanity-out/qemu_x86/tests/net/utils/test/qemu.log--------------------------
qemu_x86 tests/net/lib/dns_packet/test FAILED: timeout
---------------------sanity-out/qemu_x86/tests/net/lib/dns_packet/test/qemu.log---------------------
***** BOOTING ZEPHYR OS v1.7.99 - BUILD: Mar 21 2017 05:35:32 *****
ASSERTION FAIL [num_events > 0] @ /w/workspace/zephyr-sanity/kernel/poll.c:177:
zero events
---------------------sanity-out/qemu_x86/tests/net/lib/dns_packet/test/qemu.log---------------------
0 of 120 tests passed with 0 warnings in 10840 seconds
Extra environment setting:
CONFIG_ASSERT=y
Build step 'Execute shell' marked build as failure


job zephyr-sanity build number 613 failed
see: https://jenkins.zephyrproject.org/job/zephyr-sanity/613/

zero=00000000 at=00000000 r2=00000001 r3=00201000
r4=00000000 r5=0000000a r6=00423630 r7=004017bc
r8=004016c4 r9=00000001 r10=00000001 r11=00000000
r12=00000040 r13=00000011 r14=0040162c r15=00000000
r16=00000000 r17=00000000 r18=00000000 r19=00000000
r20=00000000 r21=00000000 r22=00000000 r23=00000000
et=00000001 bt=00000000 gp=00408680 sp=004018d4
fp=00000000 ea=00420bd0 ba=00000000 ra=00000000
status=00000001 estatus=00000001 bstatus=00000000 ienable=00000004
ipending=00000000 cpuid=00000000 reserved=00000000 exception=00000008
pteaddr=00000000 tlbacc=00000000 tlbmisc=00000000 reserved=00000000
badaddr=00000000 config=00000000 mpubase=00000000 mpuacc=00000000
reserved=00000000 reserved=00000000 reserved=00000000 reserved=00000000
reserved=00000000 reserved=00000000 reserved=00000000 reserved=00000000
reserved=00000000 reserved=00000000 reserved=00000000 reserved=00000000
reserved=00000000 reserved=00000000 reserved=00000000 reserved=00000000
rpc=00000000 mmu write: VPN=00000 PID 00 TLBACC 00000000


make[3]: *** [run] Aborted (core dumped)
make[3]: Leaving directory `/w/workspace/zephyr-sanity/sanity-out/qemu_nios2/tests/crypto/test_ecc_dh/test'
make[2]: *** [sub-make] Error 2
make[2]: Target `run' not remade because of errors.
make[2]: Leaving directory `/w/workspace/zephyr-sanity'
make[1]: *** [run] Error 2
make[1]: Leaving directory `/w/workspace/zephyr-sanity/tests/crypto/test_ecc_dh'
--------------------sanity-out/qemu_nios2/tests/crypto/test_ecc_dh/test/run.log---------------------
0 of 1 tests passed with 0 warnings in 6 seconds
Build step 'Execute shell' marked build as failure


zephyr/master: daily build zephyr-kernel-1.7.99-170319-7d7b3b7 Failure

donotreply@...
 

zephyr/master: daily build zephyr-kernel-1.7.99-170319-7d7b3b7 Failure



job zephyr-sanity build number 612 failed
see: https://jenkins.zephyrproject.org/job/zephyr-sanity/612/

qemu_x86 tests/net/icmpv6/test FAILED: timeout
-------------------------sanity-out/qemu_x86/tests/net/icmpv6/test/qemu.log-------------------------
***** BOOTING ZEPHYR OS v1.7.99 - BUILD: Mar 20 2017 07:14:07 *****
ASSERTION FAIL [num_events > 0] @ /w/workspace/zephyr-sanity/kernel/poll.c:177:
zero events
-------------------------sanity-out/qemu_x86/tests/net/icmpv6/test/qemu.log-------------------------
qemu_x86 tests/net/lib/mqtt_packet/test FAILED: timeout
--------------------sanity-out/qemu_x86/tests/net/lib/mqtt_packet/test/qemu.log---------------------
***** BOOTING ZEPHYR OS v1.7.99 - BUILD: Mar 20 2017 07:14:22 *****
ASSERTION FAIL [num_events > 0] @ /w/workspace/zephyr-sanity/kernel/poll.c:177:
zero events
--------------------sanity-out/qemu_x86/tests/net/lib/mqtt_packet/test/qemu.log---------------------
qemu_x86 tests/net/lib/http_header_fields/test FAILED: timeout
-----------------sanity-out/qemu_x86/tests/net/lib/http_header_fields/test/qemu.log-----------------
***** BOOTING ZEPHYR OS v1.7.99 - BUILD: Mar 20 2017 07:14:45 *****
ASSERTION FAIL [num_events > 0] @ /w/workspace/zephyr-sanity/kernel/poll.c:177:
zero events
-----------------sanity-out/qemu_x86/tests/net/lib/http_header_fields/test/qemu.log-----------------
qemu_x86 tests/net/lib/dns_packet/test FAILED: timeout
---------------------sanity-out/qemu_x86/tests/net/lib/dns_packet/test/qemu.log---------------------
***** BOOTING ZEPHYR OS v1.7.99 - BUILD: Mar 20 2017 07:12:16 *****
ASSERTION FAIL [num_events > 0] @ /w/workspace/zephyr-sanity/kernel/poll.c:177:
zero events
---------------------sanity-out/qemu_x86/tests/net/lib/dns_packet/test/qemu.log---------------------
1 of 145 tests passed with 0 warnings in 10846 seconds
Extra environment setting:
CONFIG_ASSERT=y
CONFIG_DEBUG=y
Build step 'Execute shell' marked build as failure


job zephyr-sanity build number 611 failed
see: https://jenkins.zephyrproject.org/job/zephyr-sanity/611/

[PASS] Test #1: ECDH - NIST-p256
[PASS] Test #2: ECC KeyGen - NIST-p256
[PASS] Test #3: PubKeyVerify - NIST-p256-SHA2-256
Shared secrets are not identical!
Shared secret 1 = 232dbe15 0f3217e5 a1726ed5 f30770d6 93e0c165 22739f8a 9916962e c134ee1d
Shared secret 2 = b771389f 3e985053 adaec211 459b7929 6c429c64 a5563771 e606ca97 115b06cf
Private key 1 = 00000000 00000000 00000000 00000000 00000000 00000000 00000000 00000000
Private key 2 = 611b0368 12adbbe0 c94d0e87 c0a5d628 a17deb1a 54ffde2c da971a64 b06df784
[FAIL] Test #4: Monte Carlo (Randomized EC-DH key-exchange) - NIST-p256
===================================================================
FAIL - main.
===================================================================
PROJECT EXECUTION FAILED
------------------sanity-out/qemu_cortex_m3/tests/crypto/test_ecc_dh/test/qemu.log------------------
qemu_x86 tests/net/udp/test FAILED: timeout
--------------------------sanity-out/qemu_x86/tests/net/udp/test/qemu.log---------------------------
***** BOOTING ZEPHYR OS v1.7.99 - BUILD: Mar 20 2017 02:05:43 *****
***** CPU exception 7
Current thread ID = 0x00111180
Faulting segment:address = 0x8:0x10f3e9
eax: 0x80, ebx: 0x0, ecx: 0x111180, edx: 0x10f024
esi: 0x0, edi: 0x1, ebp: 00, esp: 0x11156c
eflags: 0x282
Fatal fault in essential thread! Spinning...
--------------------------sanity-out/qemu_x86/tests/net/udp/test/qemu.log---------------------------
0 of 33 tests passed with 0 warnings in 87 seconds
Extra environment setting:
CONFIG_DEBUG=y
Build step 'Execute shell' marked build as failure


job zephyr-sanity build number 610 failed
see: https://jenkins.zephyrproject.org/job/zephyr-sanity/610/

-------------------------sanity-out/qemu_x86/tests/net/utils/test/qemu.log--------------------------
qemu_x86 tests/net/nbuf/test FAILED: timeout
--------------------------sanity-out/qemu_x86/tests/net/nbuf/test/qemu.log--------------------------
***** BOOTING ZEPHYR OS v1.7.99 - BUILD: Mar 20 2017 06:23:35 *****
ASSERTION FAIL [num_events > 0] @ /w/workspace/zephyr-sanity/kernel/poll.c:177:
zero events
--------------------------sanity-out/qemu_x86/tests/net/nbuf/test/qemu.log--------------------------
qemu_x86 tests/net/icmpv6/test FAILED: timeout
-------------------------sanity-out/qemu_x86/tests/net/icmpv6/test/qemu.log-------------------------
***** BOOTING ZEPHYR OS v1.7.99 - BUILD: Mar 20 2017 06:23:37 *****
ASSERTION FAIL [num_events > 0] @ /w/workspace/zephyr-sanity/kernel/poll.c:177:
zero events
-------------------------sanity-out/qemu_x86/tests/net/icmpv6/test/qemu.log-------------------------
qemu_x86 tests/net/lib/mqtt_packet/test FAILED: timeout
--------------------sanity-out/qemu_x86/tests/net/lib/mqtt_packet/test/qemu.log---------------------
***** BOOTING ZEPHYR OS v1.7.99 - BUILD: Mar 20 2017 06:23:37 *****
ASSERTION FAIL [num_events > 0] @ /w/workspace/zephyr-sanity/kernel/poll.c:177:
zero events
--------------------sanity-out/qemu_x86/tests/net/lib/mqtt_packet/test/qemu.log---------------------
qemu_x86 tests/net/lib/dns_packet/test FAILED: timeout
---------------------sanity-out/qemu_x86/tests/net/lib/dns_packet/test/qemu.log---------------------
***** BOOTING ZEPHYR OS v1.7.99 - BUILD: Mar 20 2017 06:22:56 *****
ASSERTION FAIL [num_events > 0] @ /w/workspace/zephyr-sanity/kernel/poll.c:177:
zero events
---------------------sanity-out/qemu_x86/tests/net/lib/dns_packet/test/qemu.log---------------------
0 of 120 tests passed with 0 warnings in 10880 seconds
Extra environment setting:
CONFIG_ASSERT=y
Build step 'Execute shell' marked build as failure


job zephyr-sanity build number 609 failed
see: https://jenkins.zephyrproject.org/job/zephyr-sanity/609/

zero=00000000 at=00000000 r2=00000001 r3=00201000
r4=00000000 r5=0000000a r6=00423630 r7=004017bc
r8=004016c4 r9=00000001 r10=00000001 r11=00000000
r12=00000040 r13=00000011 r14=0040162c r15=00000000
r16=00000000 r17=00000000 r18=00000000 r19=00000000
r20=00000000 r21=00000000 r22=00000000 r23=00000000
et=00000001 bt=00000000 gp=00408680 sp=004018d4
fp=00000000 ea=00421984 ba=00000000 ra=00000000
status=00000001 estatus=00000001 bstatus=00000000 ienable=00000004
ipending=00000000 cpuid=00000000 reserved=00000000 exception=00000008
pteaddr=00000000 tlbacc=00000000 tlbmisc=00000000 reserved=00000000
badaddr=00000000 config=00000000 mpubase=00000000 mpuacc=00000000
reserved=00000000 reserved=00000000 reserved=00000000 reserved=00000000
reserved=00000000 reserved=00000000 reserved=00000000 reserved=00000000
reserved=00000000 reserved=00000000 reserved=00000000 reserved=00000000
reserved=00000000 reserved=00000000 reserved=00000000 reserved=00000000
rpc=00000000 mmu write: VPN=00000 PID 00 TLBACC 00000000


make[3]: *** [run] Aborted (core dumped)
make[3]: Leaving directory `/w/workspace/zephyr-sanity/sanity-out/qemu_nios2/tests/crypto/test_ecc_dh/test'
make[2]: *** [sub-make] Error 2
make[2]: Target `run' not remade because of errors.
make[2]: Leaving directory `/w/workspace/zephyr-sanity'
make[1]: *** [run] Error 2
make[1]: Leaving directory `/w/workspace/zephyr-sanity/tests/crypto/test_ecc_dh'
--------------------sanity-out/qemu_nios2/tests/crypto/test_ecc_dh/test/run.log---------------------
0 of 1 tests passed with 0 warnings in 6 seconds
Build step 'Execute shell' marked build as failure


zephyr/master: daily build zephyr-kernel-1.7.99-170318-1436e44 Failure

donotreply@...
 

zephyr/master: daily build zephyr-kernel-1.7.99-170318-1436e44 Failure



job zephyr-sanity build number 608 failed
see: https://jenkins.zephyrproject.org/job/zephyr-sanity/608/

Faulting segment:address = 0x8:0x1101b5
eax: 0xd8, ebx: 0x0, ecx: 0x111f40, edx: 0x10fe4c
esi: 0x0, edi: 0x0, ebp: 00, esp: 0x11232c
eflags: 0x246
Fatal fault in essential thread! Spinning...
--------------------------sanity-out/qemu_x86/tests/net/udp/test/qemu.log---------------------------
qemu_x86 tests/net/nbuf/test FAILED: timeout
--------------------------sanity-out/qemu_x86/tests/net/nbuf/test/qemu.log--------------------------
***** BOOTING ZEPHYR OS v1.7.99 - BUILD: Mar 19 2017 07:48:37 *****
ASSERTION FAIL [num_events > 0] @ /w/workspace/zephyr-sanity/kernel/poll.c:177:
zero events
--------------------------sanity-out/qemu_x86/tests/net/nbuf/test/qemu.log--------------------------
qemu_x86 tests/net/lib/http_header_fields/test FAILED: timeout
-----------------sanity-out/qemu_x86/tests/net/lib/http_header_fields/test/qemu.log-----------------
***** BOOTING ZEPHYR OS v1.7.99 - BUILD: Mar 19 2017 07:48:50 *****
ASSERTION FAIL [num_events > 0] @ /w/workspace/zephyr-sanity/kernel/poll.c:177:
zero events
-----------------sanity-out/qemu_x86/tests/net/lib/http_header_fields/test/qemu.log-----------------
qemu_x86 tests/net/lib/dns_packet/test FAILED: timeout
---------------------sanity-out/qemu_x86/tests/net/lib/dns_packet/test/qemu.log---------------------
***** BOOTING ZEPHYR OS v1.7.99 - BUILD: Mar 19 2017 07:48:22 *****
ASSERTION FAIL [num_events > 0] @ /w/workspace/zephyr-sanity/kernel/poll.c:177:
zero events
---------------------sanity-out/qemu_x86/tests/net/lib/dns_packet/test/qemu.log---------------------
1 of 145 tests passed with 0 warnings in 10938 seconds
Extra environment setting:
CONFIG_ASSERT=y
CONFIG_DEBUG=y
Build step 'Execute shell' marked build as failure


job zephyr-sanity build number 607 failed
see: https://jenkins.zephyrproject.org/job/zephyr-sanity/607/

[PASS] Test #2: ECC KeyGen - NIST-p256
[PASS] Test #3: PubKeyVerify - NIST-p256-SHA2-256
Shared secrets are not identical!
Shared secret 1 = 9799e64c ee22d522 365eef89 4a89c014 006c9504 e0567328 6a66c092 cd74be7f
Shared secret 2 = f9a000c4 6034bf05 5f68688f 9450fc98 1ac710d3 ecfc45d3 2a9ae83a abcaa445
Private key 1 = 00000000 00000000 00000000 00000000 00000000 00000000 00000000 00000000
Private key 2 = 5f380b11 093ee25b c1c12d49 b919f4ea 9bd50236 54ffde2d dc7a12b5 b250efcc
[FAIL] Test #4: Monte Carlo (Randomized EC-DH key-exchange) - NIST-p256
===================================================================
FAIL - main.
===================================================================
PROJECT EXECUTION FAILED
------------------sanity-out/qemu_cortex_m3/tests/crypto/test_ecc_dh/test/qemu.log------------------
qemu_x86 tests/net/udp/test FAILED: timeout
--------------------------sanity-out/qemu_x86/tests/net/udp/test/qemu.log---------------------------
***** BOOTING ZEPHYR OS v1.7.99 - BUILD: Mar 19 2017 02:10:08 *****
***** CPU exception 13
***** Exception code: 0x2b18
Current thread ID = 0x00110e80
Faulting segment:address = 0x8:0x10f001
eax: 0x0, ebx: 0x0, ecx: 0x110e80, edx: 0x10ed8c
esi: 0x0, edi: 0x1, ebp: 00, esp: 0x11126c
eflags: 0x216
Fatal fault in essential thread! Spinning...
--------------------------sanity-out/qemu_x86/tests/net/udp/test/qemu.log---------------------------
1 of 34 tests passed with 0 warnings in 98 seconds
Extra environment setting:
CONFIG_DEBUG=y
Build step 'Execute shell' marked build as failure


job zephyr-sanity build number 606 failed
see: https://jenkins.zephyrproject.org/job/zephyr-sanity/606/

--------------------sanity-out/qemu_nios2/tests/crypto/test_ecc_dh/test/run.log---------------------
qemu_x86 tests/net/utils/test FAILED: timeout
-------------------------sanity-out/qemu_x86/tests/net/utils/test/qemu.log--------------------------
***** BOOTING ZEPHYR OS v1.7.99 - BUILD: Mar 19 2017 07:17:07 *****
ASSERTION FAIL [num_events > 0] @ /w/workspace/zephyr-sanity/kernel/poll.c:177:
zero events
-------------------------sanity-out/qemu_x86/tests/net/utils/test/qemu.log--------------------------
qemu_x86 tests/net/lib/http_header_fields/test FAILED: timeout
-----------------sanity-out/qemu_x86/tests/net/lib/http_header_fields/test/qemu.log-----------------
***** BOOTING ZEPHYR OS v1.7.99 - BUILD: Mar 19 2017 07:17:23 *****
ASSERTION FAIL [num_events > 0] @ /w/workspace/zephyr-sanity/kernel/poll.c:177:
zero events
-----------------sanity-out/qemu_x86/tests/net/lib/http_header_fields/test/qemu.log-----------------
qemu_x86 tests/net/trickle/test FAILED: timeout
------------------------sanity-out/qemu_x86/tests/net/trickle/test/qemu.log-------------------------
***** BOOTING ZEPHYR OS v1.7.99 - BUILD: Mar 19 2017 07:18:02 *****
ASSERTION FAIL [num_events > 0] @ /w/workspace/zephyr-sanity/kernel/poll.c:177:
zero events
------------------------sanity-out/qemu_x86/tests/net/trickle/test/qemu.log-------------------------
qemu_x86 tests/net/lib/dns_packet/test FAILED: timeout
---------------------sanity-out/qemu_x86/tests/net/lib/dns_packet/test/qemu.log---------------------
***** BOOTING ZEPHYR OS v1.7.99 - BUILD: Mar 19 2017 07:17:30 *****
ASSERTION FAIL [num_events > 0] @ /w/workspace/zephyr-sanity/kernel/poll.c:177:
zero events
---------------------sanity-out/qemu_x86/tests/net/lib/dns_packet/test/qemu.log---------------------
0 of 120 tests passed with 0 warnings in 10954 seconds
Extra environment setting:
CONFIG_ASSERT=y
Build step 'Execute shell' marked build as failure


job zephyr-sanity build number 605 failed
see: https://jenkins.zephyrproject.org/job/zephyr-sanity/605/

zero=00000000 at=00000000 r2=00000001 r3=00201000
r4=00000000 r5=0000000a r6=00423630 r7=004017bc
r8=004016c4 r9=00000001 r10=00000001 r11=00000000
r12=00000040 r13=00000011 r14=0040162c r15=00000000
r16=00000000 r17=00000000 r18=00000000 r19=00000000
r20=00000000 r21=00000000 r22=00000000 r23=00000000
et=00000001 bt=00000000 gp=00408680 sp=004018d4
fp=00000000 ea=0042171c ba=00000000 ra=00000000
status=00000001 estatus=00000001 bstatus=00000000 ienable=00000004
ipending=00000000 cpuid=00000000 reserved=00000000 exception=00000008
pteaddr=00000000 tlbacc=00000000 tlbmisc=00000000 reserved=00000000
badaddr=00000000 config=00000000 mpubase=00000000 mpuacc=00000000
reserved=00000000 reserved=00000000 reserved=00000000 reserved=00000000
reserved=00000000 reserved=00000000 reserved=00000000 reserved=00000000
reserved=00000000 reserved=00000000 reserved=00000000 reserved=00000000
reserved=00000000 reserved=00000000 reserved=00000000 reserved=00000000
rpc=00000000 mmu write: VPN=00000 PID 00 TLBACC 00000000


make[3]: *** [run] Aborted (core dumped)
make[3]: Leaving directory `/w/workspace/zephyr-sanity/sanity-out/qemu_nios2/tests/crypto/test_ecc_dh/test'
make[2]: *** [sub-make] Error 2
make[2]: Target `run' not remade because of errors.
make[2]: Leaving directory `/w/workspace/zephyr-sanity'
make[1]: *** [run] Error 2
make[1]: Leaving directory `/w/workspace/zephyr-sanity/tests/crypto/test_ecc_dh'
--------------------sanity-out/qemu_nios2/tests/crypto/test_ecc_dh/test/run.log---------------------
0 of 1 tests passed with 0 warnings in 4 seconds
Build step 'Execute shell' marked build as failure


zephyr/master: daily build zephyr-kernel-1.7.99-170317-efc68b4 Failure

donotreply@...
 

zephyr/master: daily build zephyr-kernel-1.7.99-170317-efc68b4 Failure



job zephyr-sanity build number 604 failed
see: https://jenkins.zephyrproject.org/job/zephyr-sanity/604/

zero events
------------------------sanity-out/qemu_x86/tests/net/neighbor/test/qemu.log------------------------
qemu_x86 tests/net/nbuf/test FAILED: timeout
--------------------------sanity-out/qemu_x86/tests/net/nbuf/test/qemu.log--------------------------
***** BOOTING ZEPHYR OS v1.7.99 - BUILD: Mar 18 2017 07:08:12 *****
ASSERTION FAIL [num_events > 0] @ /w/workspace/zephyr-sanity/kernel/poll.c:177:
zero events
Generating LALR tables
Platform 'arduino_101_mcuboot' not specified in any arch .ini file and will not be tested
--------------------------sanity-out/qemu_x86/tests/net/nbuf/test/qemu.log--------------------------
qemu_x86 tests/net/lib/mqtt_packet/test FAILED: timeout
--------------------sanity-out/qemu_x86/tests/net/lib/mqtt_packet/test/qemu.log---------------------
***** BOOTING ZEPHYR OS v1.7.99 - BUILD: Mar 18 2017 07:08:46 *****
ASSERTION FAIL [num_events > 0] @ /w/workspace/zephyr-sanity/kernel/poll.c:177:
zero events
--------------------sanity-out/qemu_x86/tests/net/lib/mqtt_packet/test/qemu.log---------------------
qemu_x86 tests/net/lib/dns_packet/test FAILED: timeout
---------------------sanity-out/qemu_x86/tests/net/lib/dns_packet/test/qemu.log---------------------
***** BOOTING ZEPHYR OS v1.7.99 - BUILD: Mar 18 2017 07:06:22 *****
ASSERTION FAIL [num_events > 0] @ /w/workspace/zephyr-sanity/kernel/poll.c:177:
zero events
---------------------sanity-out/qemu_x86/tests/net/lib/dns_packet/test/qemu.log---------------------
qemu_nios2 tests/legacy/kernel/test_sleep/test WARNING: rom_size +1208, is now 18804 +6.87%
Deltas based on metrics from last release
1 of 145 tests passed with 1 warnings in 10833 seconds
Extra environment setting:
CONFIG_ASSERT=y
CONFIG_DEBUG=y
Build step 'Execute shell' marked build as failure


job zephyr-sanity build number 603 failed
see: https://jenkins.zephyrproject.org/job/zephyr-sanity/603/

collect2: error: ld returned 1 exit status
make[3]: *** [zephyr_prebuilt.elf] Error 1
make[3]: Target `all' not remade because of errors.
make[3]: Leaving directory `/w/workspace/zephyr-sanity/sanity-out/qemu_x86/samples/net/echo_server/test_bt'
make[2]: *** [sub-make] Error 2
make[2]: Target `all' not remade because of errors.
make[2]: Leaving directory `/w/workspace/zephyr-sanity'
make[1]: *** [all] Error 2
make[1]: Leaving directory `/w/workspace/zephyr-sanity/samples/net/echo_server'
Generating LALR tables
Platform 'arduino_101_mcuboot' not specified in any arch .ini file and will not be tested
-------------------sanity-out/qemu_x86/samples/net/echo_server/test_bt/build.log--------------------
qemu_riscv32 tests/legacy/kernel/test_sleep/test PASSED
qemu_x86 tests/net/udp/test FAILED: timeout
--------------------------sanity-out/qemu_x86/tests/net/udp/test/qemu.log---------------------------
***** BOOTING ZEPHYR OS v1.7.99 - BUILD: Mar 18 2017 02:48:42 *****
***** CPU exception 13
***** Exception code: 0x2b18
Current thread ID = 0x00110e80
Faulting segment:address = 0x8:0x10f001
eax: 0x0, ebx: 0x0, ecx: 0x110e80, edx: 0x10ed8c
esi: 0x0, edi: 0x1, ebp: 00, esp: 0x11126c
eflags: 0x216
Fatal fault in essential thread! Spinning...
--------------------------sanity-out/qemu_x86/tests/net/udp/test/qemu.log---------------------------
2 of 35 tests passed with 0 warnings in 102 seconds
Extra environment setting:
CONFIG_DEBUG=y
Build step 'Execute shell' marked build as failure


job zephyr-sanity build number 602 failed
see: https://jenkins.zephyrproject.org/job/zephyr-sanity/602/

make[2]: Target `all' not remade because of errors.
make[2]: Leaving directory `/w/workspace/zephyr-sanity'
make[1]: *** [all] Error 2
make[1]: Leaving directory `/w/workspace/zephyr-sanity/tests/bluetooth/init'
Generating LALR tables
Platform 'arduino_101_mcuboot' not specified in any arch .ini file and will not be tested
--------------sanity-out/nrf51_pca10028/tests/bluetooth/init/test_controller/build.log--------------
qemu_x86 tests/net/lib/http_header_fields/test FAILED: timeout
-----------------sanity-out/qemu_x86/tests/net/lib/http_header_fields/test/qemu.log-----------------
***** BOOTING ZEPHYR OS v1.7.99 - BUILD: Mar 18 2017 08:17:55 *****
ASSERTION FAIL [num_events > 0] @ /w/workspace/zephyr-sanity/kernel/poll.c:177:
zero events
-----------------sanity-out/qemu_x86/tests/net/lib/http_header_fields/test/qemu.log-----------------
qemu_x86 tests/net/neighbor/test FAILED: timeout
------------------------sanity-out/qemu_x86/tests/net/neighbor/test/qemu.log------------------------
***** BOOTING ZEPHYR OS v1.7.99 - BUILD: Mar 18 2017 08:18:16 *****
ASSERTION FAIL [num_events > 0] @ /w/workspace/zephyr-sanity/kernel/poll.c:177:
zero events
------------------------sanity-out/qemu_x86/tests/net/neighbor/test/qemu.log------------------------
qemu_x86 tests/net/lib/dns_packet/test FAILED: timeout
---------------------sanity-out/qemu_x86/tests/net/lib/dns_packet/test/qemu.log---------------------
***** BOOTING ZEPHYR OS v1.7.99 - BUILD: Mar 18 2017 08:16:58 *****
ASSERTION FAIL [num_events > 0] @ /w/workspace/zephyr-sanity/kernel/poll.c:177:
zero events
---------------------sanity-out/qemu_x86/tests/net/lib/dns_packet/test/qemu.log---------------------
0 of 119 tests passed with 0 warnings in 10866 seconds
Extra environment setting:
CONFIG_ASSERT=y
Build step 'Execute shell' marked build as failure


job zephyr-sanity build number 601 failed
see: https://jenkins.zephyrproject.org/job/zephyr-sanity/601/

zero=00000000 at=00000000 r2=00000001 r3=00201000
r4=00000000 r5=0000000a r6=00423630 r7=004017bc
r8=004016c4 r9=00000001 r10=00000001 r11=00000000
r12=00000040 r13=00000011 r14=0040162c r15=00000000
r16=00000000 r17=00000000 r18=00000000 r19=00000000
r20=00000000 r21=00000000 r22=00000000 r23=00000000
et=00000001 bt=00000000 gp=00408680 sp=004018d4
fp=00000000 ea=00420bd0 ba=00000000 ra=00000000
status=00000001 estatus=00000001 bstatus=00000000 ienable=00000004
ipending=00000000 cpuid=00000000 reserved=00000000 exception=00000008
pteaddr=00000000 tlbacc=00000000 tlbmisc=00000000 reserved=00000000
badaddr=00000000 config=00000000 mpubase=00000000 mpuacc=00000000
reserved=00000000 reserved=00000000 reserved=00000000 reserved=00000000
reserved=00000000 reserved=00000000 reserved=00000000 reserved=00000000
reserved=00000000 reserved=00000000 reserved=00000000 reserved=00000000
reserved=00000000 reserved=00000000 reserved=00000000 reserved=00000000
rpc=00000000 mmu write: VPN=00000 PID 00 TLBACC 00000000


make[3]: *** [run] Aborted (core dumped)
make[3]: Leaving directory `/w/workspace/zephyr-sanity/sanity-out/qemu_nios2/tests/crypto/test_ecc_dh/test'
make[2]: *** [sub-make] Error 2
make[2]: Target `run' not remade because of errors.
make[2]: Leaving directory `/w/workspace/zephyr-sanity'
make[1]: *** [run] Error 2
make[1]: Leaving directory `/w/workspace/zephyr-sanity/tests/crypto/test_ecc_dh'
--------------------sanity-out/qemu_nios2/tests/crypto/test_ecc_dh/test/run.log---------------------
0 of 1 tests passed with 0 warnings in 7 seconds
Build step 'Execute shell' marked build as failure


zephyr/refs/tags/v1.1.0: tag build zephyr-kernel-1.1.0 Still Failing

donotreply@...
 

zephyr/refs/tags/v1.1.0: tag build zephyr-kernel-1.1.0 Still Failing

Check console output at https://jenkins.zephyrproject.org/sandbox/job/zephyr-tag/37/ to view the results.


zephyr/master: daily build zephyr-kernel-1.7.99-170316-a375932 Failure

donotreply@...
 

zephyr/master: daily build zephyr-kernel-1.7.99-170316-a375932 Failure



job zephyr-sanity build number 600 failed
see: https://jenkins.zephyrproject.org/job/zephyr-sanity/600/

qemu_x86 tests/net/lib/zoap/test FAILED: timeout
------------------------sanity-out/qemu_x86/tests/net/lib/zoap/test/qemu.log------------------------
***** BOOTING ZEPHYR OS v1.7.99 - BUILD: Mar 17 2017 07:45:44 *****
ASSERTION FAIL [num_events > 0] @ /w/workspace/zephyr-sanity/kernel/poll.c:177:
zero events
------------------------sanity-out/qemu_x86/tests/net/lib/zoap/test/qemu.log------------------------
qemu_x86 tests/net/neighbor/test FAILED: timeout
------------------------sanity-out/qemu_x86/tests/net/neighbor/test/qemu.log------------------------
***** BOOTING ZEPHYR OS v1.7.99 - BUILD: Mar 17 2017 07:46:24 *****
ASSERTION FAIL [num_events > 0] @ /w/workspace/zephyr-sanity/kernel/poll.c:177:
zero events
------------------------sanity-out/qemu_x86/tests/net/neighbor/test/qemu.log------------------------
qemu_x86 tests/net/utils/test FAILED: timeout
-------------------------sanity-out/qemu_x86/tests/net/utils/test/qemu.log--------------------------
***** BOOTING ZEPHYR OS v1.7.99 - BUILD: Mar 17 2017 07:46:24 *****
ASSERTION FAIL [num_events > 0] @ /w/workspace/zephyr-sanity/kernel/poll.c:177:
zero events
-------------------------sanity-out/qemu_x86/tests/net/utils/test/qemu.log--------------------------
qemu_x86 tests/net/lib/dns_packet/test FAILED: timeout
---------------------sanity-out/qemu_x86/tests/net/lib/dns_packet/test/qemu.log---------------------
***** BOOTING ZEPHYR OS v1.7.99 - BUILD: Mar 17 2017 07:46:00 *****
ASSERTION FAIL [num_events > 0] @ /w/workspace/zephyr-sanity/kernel/poll.c:177:
zero events
---------------------sanity-out/qemu_x86/tests/net/lib/dns_packet/test/qemu.log---------------------
0 of 144 tests passed with 0 warnings in 10922 seconds
Extra environment setting:
CONFIG_ASSERT=y
CONFIG_DEBUG=y
Build step 'Execute shell' marked build as failure


job zephyr-sanity build number 599 failed
see: https://jenkins.zephyrproject.org/job/zephyr-sanity/599/

[PASS] Test #2: ECC KeyGen - NIST-p256
[PASS] Test #3: PubKeyVerify - NIST-p256-SHA2-256
Shared secrets are not identical!
Shared secret 1 = d6dc6889 2b6d7167 5b47b2be 100c17a7 3f70d5c3 52370010 10419216 13f346fa
Shared secret 2 = 16773f22 3ab6a6ea 2767adc2 60714e7b a001a99a 4d6ff797 9603d18b e3131b07
Private key 1 = 00000000 00000000 00000000 00000000 00000000 00000000 00000000 00000000
Private key 2 = b5c5d0b4 ac50207d abcf759a b622bf97 eaef7b0c 0a32d5dc 14baeb9b f4d931f4
[FAIL] Test #4: Monte Carlo (Randomized EC-DH key-exchange) - NIST-p256
===================================================================
FAIL - main.
===================================================================
PROJECT EXECUTION FAILED
------------------sanity-out/qemu_x86_iamcu/tests/crypto/test_ecc_dh/test/qemu.log------------------
qemu_x86 tests/net/udp/test FAILED: timeout
--------------------------sanity-out/qemu_x86/tests/net/udp/test/qemu.log---------------------------
***** BOOTING ZEPHYR OS v1.7.99 - BUILD: Mar 17 2017 02:23:59 *****
***** CPU exception 13
***** Exception code: 0x2b18
Current thread ID = 0x00110e80
Faulting segment:address = 0x8:0x10f001
eax: 0x0, ebx: 0x0, ecx: 0x110e80, edx: 0x10ed8c
esi: 0x0, edi: 0x1, ebp: 00, esp: 0x11126c
eflags: 0x216
Fatal fault in essential thread! Spinning...
--------------------------sanity-out/qemu_x86/tests/net/udp/test/qemu.log---------------------------
0 of 33 tests passed with 0 warnings in 82 seconds
Extra environment setting:
CONFIG_DEBUG=y
Build step 'Execute shell' marked build as failure


job zephyr-sanity build number 598 failed
see: https://jenkins.zephyrproject.org/job/zephyr-sanity/598/

qemu_x86 tests/net/lib/http_header_fields/test FAILED: timeout
-----------------sanity-out/qemu_x86/tests/net/lib/http_header_fields/test/qemu.log-----------------
***** BOOTING ZEPHYR OS v1.7.99 - BUILD: Mar 17 2017 06:00:49 *****
ASSERTION FAIL [num_events > 0] @ /w/workspace/zephyr-sanity/kernel/poll.c:177:
zero events
Generating LALR tables
-----------------sanity-out/qemu_x86/tests/net/lib/http_header_fields/test/qemu.log-----------------
qemu_x86 tests/net/trickle/test FAILED: timeout
------------------------sanity-out/qemu_x86/tests/net/trickle/test/qemu.log-------------------------
***** BOOTING ZEPHYR OS v1.7.99 - BUILD: Mar 17 2017 06:01:15 *****
ASSERTION FAIL [num_events > 0] @ /w/workspace/zephyr-sanity/kernel/poll.c:177:
zero events
------------------------sanity-out/qemu_x86/tests/net/trickle/test/qemu.log-------------------------
qemu_x86 tests/net/lib/zoap/test FAILED: timeout
------------------------sanity-out/qemu_x86/tests/net/lib/zoap/test/qemu.log------------------------
***** BOOTING ZEPHYR OS v1.7.99 - BUILD: Mar 17 2017 06:01:15 *****
ASSERTION FAIL [num_events > 0] @ /w/workspace/zephyr-sanity/kernel/poll.c:177:
zero events
------------------------sanity-out/qemu_x86/tests/net/lib/zoap/test/qemu.log------------------------
qemu_x86 tests/net/lib/dns_packet/test FAILED: timeout
---------------------sanity-out/qemu_x86/tests/net/lib/dns_packet/test/qemu.log---------------------
***** BOOTING ZEPHYR OS v1.7.99 - BUILD: Mar 17 2017 05:59:44 *****
ASSERTION FAIL [num_events > 0] @ /w/workspace/zephyr-sanity/kernel/poll.c:177:
zero events
---------------------sanity-out/qemu_x86/tests/net/lib/dns_packet/test/qemu.log---------------------
1 of 120 tests passed with 0 warnings in 10842 seconds
Extra environment setting:
CONFIG_ASSERT=y
Build step 'Execute shell' marked build as failure


job zephyr-sanity build number 597 failed
see: https://jenkins.zephyrproject.org/job/zephyr-sanity/597/

zero=00000000 at=00000000 r2=00000001 r3=00201000
r4=00000000 r5=0000000a r6=00423630 r7=004017bc
r8=004016c4 r9=00000001 r10=00000001 r11=00000000
r12=00000040 r13=00000011 r14=0040162c r15=00000000
r16=00000000 r17=00000000 r18=00000000 r19=00000000
r20=00000000 r21=00000000 r22=00000000 r23=00000000
et=00000001 bt=00000000 gp=00408680 sp=004018d4
fp=00000000 ea=00421764 ba=00000000 ra=00000000
status=00000001 estatus=00000001 bstatus=00000000 ienable=00000004
ipending=00000000 cpuid=00000000 reserved=00000000 exception=00000008
pteaddr=00000000 tlbacc=00000000 tlbmisc=00000000 reserved=00000000
badaddr=00000000 config=00000000 mpubase=00000000 mpuacc=00000000
reserved=00000000 reserved=00000000 reserved=00000000 reserved=00000000
reserved=00000000 reserved=00000000 reserved=00000000 reserved=00000000
reserved=00000000 reserved=00000000 reserved=00000000 reserved=00000000
reserved=00000000 reserved=00000000 reserved=00000000 reserved=00000000
rpc=00000000 mmu write: VPN=00000 PID 00 TLBACC 00000000


make[3]: *** [run] Aborted (core dumped)
make[3]: Leaving directory `/w/workspace/zephyr-sanity/sanity-out/qemu_nios2/tests/crypto/test_ecc_dh/test'
make[2]: *** [sub-make] Error 2
make[2]: Target `run' not remade because of errors.
make[2]: Leaving directory `/w/workspace/zephyr-sanity'
make[1]: *** [run] Error 2
make[1]: Leaving directory `/w/workspace/zephyr-sanity/tests/crypto/test_ecc_dh'
--------------------sanity-out/qemu_nios2/tests/crypto/test_ecc_dh/test/run.log---------------------
0 of 1 tests passed with 0 warnings in 7 seconds
Build step 'Execute shell' marked build as failure


zephyr/master: daily build zephyr-kernel-1.7.99-170315-a375932 Failure

donotreply@...
 

zephyr/master: daily build zephyr-kernel-1.7.99-170315-a375932 Failure



job zephyr-sanity build number 596 failed
see: https://jenkins.zephyrproject.org/job/zephyr-sanity/596/

qemu_x86 tests/net/trickle/test FAILED: timeout
------------------------sanity-out/qemu_x86/tests/net/trickle/test/qemu.log-------------------------
***** BOOTING ZEPHYR OS v1.7.99 - BUILD: Mar 16 2017 07:14:56 *****
ASSERTION FAIL [num_events > 0] @ /w/workspace/zephyr-sanity/kernel/poll.c:177:
zero events
------------------------sanity-out/qemu_x86/tests/net/trickle/test/qemu.log-------------------------
qemu_x86 tests/net/utils/test FAILED: timeout
-------------------------sanity-out/qemu_x86/tests/net/utils/test/qemu.log--------------------------
***** BOOTING ZEPHYR OS v1.7.99 - BUILD: Mar 16 2017 07:14:56 *****
ASSERTION FAIL [num_events > 0] @ /w/workspace/zephyr-sanity/kernel/poll.c:177:
zero events
-------------------------sanity-out/qemu_x86/tests/net/utils/test/qemu.log--------------------------
qemu_x86 tests/net/lib/mqtt_packet/test FAILED: timeout
--------------------sanity-out/qemu_x86/tests/net/lib/mqtt_packet/test/qemu.log---------------------
***** BOOTING ZEPHYR OS v1.7.99 - BUILD: Mar 16 2017 07:14:56 *****
ASSERTION FAIL [num_events > 0] @ /w/workspace/zephyr-sanity/kernel/poll.c:177:
zero events
--------------------sanity-out/qemu_x86/tests/net/lib/mqtt_packet/test/qemu.log---------------------
qemu_x86 tests/net/lib/dns_packet/test FAILED: timeout
---------------------sanity-out/qemu_x86/tests/net/lib/dns_packet/test/qemu.log---------------------
***** BOOTING ZEPHYR OS v1.7.99 - BUILD: Mar 16 2017 07:13:58 *****
ASSERTION FAIL [num_events > 0] @ /w/workspace/zephyr-sanity/kernel/poll.c:177:
zero events
---------------------sanity-out/qemu_x86/tests/net/lib/dns_packet/test/qemu.log---------------------
0 of 145 tests passed with 0 warnings in 10894 seconds
Extra environment setting:
CONFIG_ASSERT=y
CONFIG_DEBUG=y
Build step 'Execute shell' marked build as failure


job zephyr-sanity build number 595 failed
see: https://jenkins.zephyrproject.org/job/zephyr-sanity/595/

[PASS] Test #2: ECC KeyGen - NIST-p256
[PASS] Test #3: PubKeyVerify - NIST-p256-SHA2-256
Shared secrets are not identical!
Shared secret 1 = b954811e 16782521 f133c0e5 a8983ec5 058035e4 ff5c48a9 251a8417 fe560bed
Shared secret 2 = 56b449d7 8f3d18ad 1203b3b2 8ad88f89 1cfca734 ae48e415 fc1316d5 4d03895f
Private key 1 = 00000000 00000000 00000000 00000000 00000000 00000000 00000000 00000000
Private key 2 = 5eeacd7f 07bcae36 c08c36d3 b7e4fe75 9aed4949 54ffde28 dcc7504a b29e2d75
[FAIL] Test #4: Monte Carlo (Randomized EC-DH key-exchange) - NIST-p256
===================================================================
FAIL - main.
===================================================================
PROJECT EXECUTION FAILED
------------------sanity-out/qemu_cortex_m3/tests/crypto/test_ecc_dh/test/qemu.log------------------
qemu_x86 tests/net/udp/test FAILED: timeout
--------------------------sanity-out/qemu_x86/tests/net/udp/test/qemu.log---------------------------
***** BOOTING ZEPHYR OS v1.7.99 - BUILD: Mar 16 2017 01:48:17 *****
***** CPU exception 13
***** Exception code: 0x2b18
Current thread ID = 0x00110e80
Faulting segment:address = 0x8:0x10f001
eax: 0x0, ebx: 0x0, ecx: 0x110e80, edx: 0x10ed8c
esi: 0x0, edi: 0x1, ebp: 00, esp: 0x11126c
eflags: 0x216
Fatal fault in essential thread! Spinning...
--------------------------sanity-out/qemu_x86/tests/net/udp/test/qemu.log---------------------------
1 of 35 tests passed with 0 warnings in 94 seconds
Extra environment setting:
CONFIG_DEBUG=y
Build step 'Execute shell' marked build as failure


job zephyr-sanity build number 594 failed
see: https://jenkins.zephyrproject.org/job/zephyr-sanity/594/

-------------------------sanity-out/qemu_x86/tests/net/utils/test/qemu.log--------------------------
qemu_x86 tests/net/nbuf/test FAILED: timeout
--------------------------sanity-out/qemu_x86/tests/net/nbuf/test/qemu.log--------------------------
***** BOOTING ZEPHYR OS v1.7.99 - BUILD: Mar 16 2017 07:09:26 *****
ASSERTION FAIL [num_events > 0] @ /w/workspace/zephyr-sanity/kernel/poll.c:177:
zero events
--------------------------sanity-out/qemu_x86/tests/net/nbuf/test/qemu.log--------------------------
qemu_x86 tests/net/trickle/test FAILED: timeout
------------------------sanity-out/qemu_x86/tests/net/trickle/test/qemu.log-------------------------
***** BOOTING ZEPHYR OS v1.7.99 - BUILD: Mar 16 2017 07:09:41 *****
ASSERTION FAIL [num_events > 0] @ /w/workspace/zephyr-sanity/kernel/poll.c:177:
zero events
------------------------sanity-out/qemu_x86/tests/net/trickle/test/qemu.log-------------------------
qemu_x86 tests/net/neighbor/test FAILED: timeout
------------------------sanity-out/qemu_x86/tests/net/neighbor/test/qemu.log------------------------
***** BOOTING ZEPHYR OS v1.7.99 - BUILD: Mar 16 2017 07:09:42 *****
ASSERTION FAIL [num_events > 0] @ /w/workspace/zephyr-sanity/kernel/poll.c:177:
zero events
------------------------sanity-out/qemu_x86/tests/net/neighbor/test/qemu.log------------------------
qemu_x86 tests/net/lib/dns_packet/test FAILED: timeout
---------------------sanity-out/qemu_x86/tests/net/lib/dns_packet/test/qemu.log---------------------
***** BOOTING ZEPHYR OS v1.7.99 - BUILD: Mar 16 2017 07:08:01 *****
ASSERTION FAIL [num_events > 0] @ /w/workspace/zephyr-sanity/kernel/poll.c:177:
zero events
---------------------sanity-out/qemu_x86/tests/net/lib/dns_packet/test/qemu.log---------------------
0 of 120 tests passed with 0 warnings in 10829 seconds
Extra environment setting:
CONFIG_ASSERT=y
Build step 'Execute shell' marked build as failure


job zephyr-sanity build number 593 failed
see: https://jenkins.zephyrproject.org/job/zephyr-sanity/593/

zero=00000000 at=00000000 r2=00000001 r3=00201000
r4=00000000 r5=0000000a r6=00423630 r7=004017bc
r8=004016c4 r9=00000001 r10=00000001 r11=00000000
r12=00000040 r13=00000011 r14=0040162c r15=00000000
r16=00000000 r17=00000000 r18=00000000 r19=00000000
r20=00000000 r21=00000000 r22=00000000 r23=00000000
et=00000001 bt=00000000 gp=00408680 sp=004018d4
fp=00000000 ea=00420bd0 ba=00000000 ra=00000000
status=00000001 estatus=00000001 bstatus=00000000 ienable=00000004
ipending=00000000 cpuid=00000000 reserved=00000000 exception=00000008
pteaddr=00000000 tlbacc=00000000 tlbmisc=00000000 reserved=00000000
badaddr=00000000 config=00000000 mpubase=00000000 mpuacc=00000000
reserved=00000000 reserved=00000000 reserved=00000000 reserved=00000000
reserved=00000000 reserved=00000000 reserved=00000000 reserved=00000000
reserved=00000000 reserved=00000000 reserved=00000000 reserved=00000000
reserved=00000000 reserved=00000000 reserved=00000000 reserved=00000000
rpc=00000000 mmu write: VPN=00000 PID 00 TLBACC 00000000


make[3]: *** [run] Aborted (core dumped)
make[3]: Leaving directory `/w/workspace/zephyr-sanity/sanity-out/qemu_nios2/tests/crypto/test_ecc_dh/test'
make[2]: *** [sub-make] Error 2
make[2]: Target `run' not remade because of errors.
make[2]: Leaving directory `/w/workspace/zephyr-sanity'
make[1]: *** [run] Error 2
make[1]: Leaving directory `/w/workspace/zephyr-sanity/tests/crypto/test_ecc_dh'
--------------------sanity-out/qemu_nios2/tests/crypto/test_ecc_dh/test/run.log---------------------
0 of 1 tests passed with 0 warnings in 6 seconds
Build step 'Execute shell' marked build as failure

2841 - 2860 of 2976