Date   

zephyr/refs/tags/zephyr-v1.6.0: tag build zephyr-kernel-1.6.0 Successful

donotreply@...
 

zephyr/refs/tags/zephyr-v1.6.0: tag build zephyr-kernel-1.6.0 Successful

Check console output at https://jenkins.zephyrproject.org/job/zephyr-tag/37/ to view the results.


zephyr/refs/tags/zephyr-v1.5.0: tag build zephyr-kernel-1.5.0 Successful

donotreply@...
 

zephyr/refs/tags/zephyr-v1.5.0: tag build zephyr-kernel-1.5.0 Successful

Check console output at https://jenkins.zephyrproject.org/job/zephyr-tag/36/ to view the results.


zephyr/refs/tags/zephyr-v1.4.0: tag build zephyr-kernel-1.4.0 Successful

donotreply@...
 

zephyr/refs/tags/zephyr-v1.4.0: tag build zephyr-kernel-1.4.0 Successful

Check console output at https://jenkins.zephyrproject.org/job/zephyr-tag/35/ to view the results.


zephyr/refs/tags/zephyr-v1.3.0: tag build zephyr-kernel-1.3.0 Successful

donotreply@...
 

zephyr/refs/tags/zephyr-v1.3.0: tag build zephyr-kernel-1.3.0 Successful

Check console output at https://jenkins.zephyrproject.org/job/zephyr-tag/34/ to view the results.


zephyr/refs/tags/zephyr-v1.2.0: tag build zephyr-kernel-1.2.0 Successful

donotreply@...
 

zephyr/refs/tags/zephyr-v1.2.0: tag build zephyr-kernel-1.2.0 Successful

Check console output at https://jenkins.zephyrproject.org/job/zephyr-tag/33/ to view the results.


zephyr/refs/tags/zephyr-v1.1.0: tag build zephyr-kernel-1.1.0 Successful

donotreply@...
 

zephyr/refs/tags/zephyr-v1.1.0: tag build zephyr-kernel-1.1.0 Successful

Check console output at https://jenkins.zephyrproject.org/job/zephyr-tag/32/ to view the results.


zephyr/refs/tags/zephyr-v1.0.0: tag build zephyr-kernel-1.0.0 Fixed

donotreply@...
 

zephyr/refs/tags/zephyr-v1.0.0: tag build zephyr-kernel-1.0.0 Fixed

Check console output at https://jenkins.zephyrproject.org/job/zephyr-tag/31/ to view the results.


zephyr/master: daily build zephyr-kernel-1.7.99-170418-c09b4b8 Failure

donotreply@...
 

zephyr/master: daily build zephyr-kernel-1.7.99-170418-c09b4b8 Failure



job zephyr-sanity build number 732 failed
see: https://jenkins.zephyrproject.org/job/zephyr-sanity/732/

--------------------------sanity-out/qemu_x86/tests/net/nbuf/test/qemu.log--------------------------
***** BOOTING ZEPHYR OS v1.7.99 - BUILD: Apr 19 2017 07:43:14 *****
ASSERTION FAIL [num_events > 0] @ /w/workspace/zephyr-sanity/kernel/poll.c:177:
zero events
Generating LALR tables
--------------------------sanity-out/qemu_x86/tests/net/nbuf/test/qemu.log--------------------------
qemu_x86 tests/net/lib/mqtt_packet/test FAILED: timeout
--------------------sanity-out/qemu_x86/tests/net/lib/mqtt_packet/test/qemu.log---------------------
***** BOOTING ZEPHYR OS v1.7.99 - BUILD: Apr 19 2017 07:43:34 *****
ASSERTION FAIL [num_events > 0] @ /w/workspace/zephyr-sanity/kernel/poll.c:177:
zero events
--------------------sanity-out/qemu_x86/tests/net/lib/mqtt_packet/test/qemu.log---------------------
qemu_x86 tests/net/neighbor/test FAILED: timeout
------------------------sanity-out/qemu_x86/tests/net/neighbor/test/qemu.log------------------------
***** BOOTING ZEPHYR OS v1.7.99 - BUILD: Apr 19 2017 07:43:42 *****
ASSERTION FAIL [num_events > 0] @ /w/workspace/zephyr-sanity/kernel/poll.c:177:
zero events
------------------------sanity-out/qemu_x86/tests/net/neighbor/test/qemu.log------------------------
qemu_x86 tests/net/lib/dns_packet/test FAILED: timeout
---------------------sanity-out/qemu_x86/tests/net/lib/dns_packet/test/qemu.log---------------------
***** BOOTING ZEPHYR OS v1.7.99 - BUILD: Apr 19 2017 07:41:08 *****
ASSERTION FAIL [num_events > 0] @ /w/workspace/zephyr-sanity/kernel/poll.c:177:
zero events
---------------------sanity-out/qemu_x86/tests/net/lib/dns_packet/test/qemu.log---------------------
0 of 162 tests passed with 0 warnings in 10992 seconds
Extra environment setting:
CONFIG_ASSERT=y
CONFIG_DEBUG=y
Build step 'Execute shell' marked build as failure


job zephyr-sanity build number 731 failed
see: https://jenkins.zephyrproject.org/job/zephyr-sanity/731/

TR =0000 00000000 0000ffff 00008b00 DPL=0 TSS32-busy
GDT= 00100070 00000017
IDT= 00102c50 000007ff
CR0=0000003f CR2=00000000 CR3=00000000 CR4=00000000
DR0=00000000 DR1=00000000 DR2=00000000 DR3=00000000
DR6=ffff0ff0 DR7=00000400
CCS=0000000a CCD=0000003c CCO=CLR
EFER=0000000000000000
FCW=037f FSW=0000 [ST=0] FTW=00 MXCSR=00001f80
FPR0=0000000000000000 0000 FPR1=0000000000000000 0000
FPR2=0000000000000000 0000 FPR3=0000000000000000 0000
FPR4=0000000000000000 0000 FPR5=0000000000000000 0000
FPR6=0000000000000000 0000 FPR7=0000000000000000 0000
XMM00=00000000000000000000000000000000 XMM01=00000000000000000000000000000000
XMM02=00000000000000000000000000000000 XMM03=00000000000000000000000000000000
XMM04=00000000000000000000000000000000 XMM05=00000000000000000000000000000000
XMM06=00000000000000000000000000000000 XMM07=00000000000000000000000000000000
make[3]: *** [run] Aborted (core dumped)
make[3]: Leaving directory `/w/workspace/zephyr-sanity/sanity-out/qemu_x86/tests/kernel/test_sleep/test'
make[2]: *** [sub-make] Error 2
make[2]: Target `run' not remade because of errors.
make[2]: Leaving directory `/w/workspace/zephyr-sanity'
make[1]: *** [run] Error 2
make[1]: Leaving directory `/w/workspace/zephyr-sanity/tests/kernel/test_sleep'
----------------------sanity-out/qemu_x86/tests/kernel/test_sleep/test/run.log----------------------
0 of 26 tests passed with 0 warnings in 33 seconds
Extra environment setting:
CONFIG_DEBUG=y
Build step 'Execute shell' marked build as failure


job zephyr-sanity build number 730 failed
see: https://jenkins.zephyrproject.org/job/zephyr-sanity/730/

make[2]: *** [sub-make] Error 2
make[2]: Target `all' not remade because of errors.
make[2]: Leaving directory `/w/workspace/zephyr-sanity'
make[1]: *** [all] Error 2
make[1]: Leaving directory `/w/workspace/zephyr-sanity/tests/bluetooth/init'
------------------sanity-out/qemu_cortex_m3/tests/bluetooth/init/test_21/build.log------------------
Generating LALR tables
qemu_x86 tests/net/lib/mqtt_packet/test FAILED: timeout
--------------------sanity-out/qemu_x86/tests/net/lib/mqtt_packet/test/qemu.log---------------------
***** BOOTING ZEPHYR OS v1.7.99 - BUILD: Apr 19 2017 06:00:09 *****
ASSERTION FAIL [num_events > 0] @ /w/workspace/zephyr-sanity/kernel/poll.c:177:
zero events
--------------------sanity-out/qemu_x86/tests/net/lib/mqtt_packet/test/qemu.log---------------------
qemu_x86 tests/net/nbuf/test FAILED: timeout
--------------------------sanity-out/qemu_x86/tests/net/nbuf/test/qemu.log--------------------------
***** BOOTING ZEPHYR OS v1.7.99 - BUILD: Apr 19 2017 06:00:10 *****
ASSERTION FAIL [num_events > 0] @ /w/workspace/zephyr-sanity/kernel/poll.c:177:
zero events
--------------------------sanity-out/qemu_x86/tests/net/nbuf/test/qemu.log--------------------------
qemu_x86 tests/net/lib/dns_packet/test FAILED: timeout
---------------------sanity-out/qemu_x86/tests/net/lib/dns_packet/test/qemu.log---------------------
***** BOOTING ZEPHYR OS v1.7.99 - BUILD: Apr 19 2017 06:00:11 *****
ASSERTION FAIL [num_events > 0] @ /w/workspace/zephyr-sanity/kernel/poll.c:177:
zero events
---------------------sanity-out/qemu_x86/tests/net/lib/dns_packet/test/qemu.log---------------------
0 of 139 tests passed with 0 warnings in 11066 seconds
Extra environment setting:
CONFIG_ASSERT=y
Build step 'Execute shell' marked build as failure


zephyr/master: daily build zephyr-kernel-1.7.99-170417-ab8a3b2 Failure

donotreply@...
 

zephyr/master: daily build zephyr-kernel-1.7.99-170417-ab8a3b2 Failure



job zephyr-sanity build number 728 failed
see: https://jenkins.zephyrproject.org/job/zephyr-sanity/728/

make[2]: Target `all' not remade because of errors.
make[2]: Leaving directory `/w/workspace/zephyr-sanity'
make[1]: *** [all] Error 2
make[1]: Leaving directory `/w/workspace/zephyr-sanity/tests/bluetooth/init'
Generating LALR tables
---------------------sanity-out/qemu_x86/tests/bluetooth/init/test_8/build.log----------------------
qemu_x86 tests/net/icmpv6/test FAILED: timeout
-------------------------sanity-out/qemu_x86/tests/net/icmpv6/test/qemu.log-------------------------
***** BOOTING ZEPHYR OS v1.7.99 - BUILD: Apr 18 2017 06:47:00 *****
ASSERTION FAIL [num_events > 0] @ /w/workspace/zephyr-sanity/kernel/poll.c:177:
zero events
-------------------------sanity-out/qemu_x86/tests/net/icmpv6/test/qemu.log-------------------------
qemu_x86 tests/net/lib/mqtt_packet/test FAILED: timeout
--------------------sanity-out/qemu_x86/tests/net/lib/mqtt_packet/test/qemu.log---------------------
***** BOOTING ZEPHYR OS v1.7.99 - BUILD: Apr 18 2017 06:47:24 *****
ASSERTION FAIL [num_events > 0] @ /w/workspace/zephyr-sanity/kernel/poll.c:177:
zero events
--------------------sanity-out/qemu_x86/tests/net/lib/mqtt_packet/test/qemu.log---------------------
qemu_x86 tests/net/lib/dns_packet/test FAILED: timeout
---------------------sanity-out/qemu_x86/tests/net/lib/dns_packet/test/qemu.log---------------------
***** BOOTING ZEPHYR OS v1.7.99 - BUILD: Apr 18 2017 06:47:38 *****
ASSERTION FAIL [num_events > 0] @ /w/workspace/zephyr-sanity/kernel/poll.c:177:
zero events
---------------------sanity-out/qemu_x86/tests/net/lib/dns_packet/test/qemu.log---------------------
0 of 162 tests passed with 0 warnings in 10971 seconds
Extra environment setting:
CONFIG_ASSERT=y
CONFIG_DEBUG=y
Build step 'Execute shell' marked build as failure


job zephyr-sanity build number 727 failed
see: https://jenkins.zephyrproject.org/job/zephyr-sanity/727/

CC subsys/net/ip/net_stats.o
CC kernel/timer.o
CC kernel/work_q.o
CC subsys/net/ip/connection.o
LD subsys/net/ip/l2/built-in.o
LD kernel/built-in.o
LD subsys/net/ip/built-in.o
LD subsys/net/built-in.o
AR kernel/lib.a
LD subsys/built-in.o
AR libzephyr.a
LINK zephyr.lnk
/opt/zephyr-sdk-0.9/sysroots/x86_64-pokysdk-linux/usr/libexec/i586-zephyr-elf/gcc/i586-zephyr-elf/6.2.0/real-ld: zephyr_prebuilt.elf section `rodata' will not fit in region `RAM'
/opt/zephyr-sdk-0.9/sysroots/x86_64-pokysdk-linux/usr/libexec/i586-zephyr-elf/gcc/i586-zephyr-elf/6.2.0/real-ld: region `RAM' overflowed by 65244 bytes
collect2: error: ld returned 1 exit status
make[3]: *** [zephyr_prebuilt.elf] Error 1
make[3]: Target `all' not remade because of errors.
make[3]: Leaving directory `/w/workspace/zephyr-sanity/sanity-out/qemu_x86/tests/net/all/test'
make[2]: *** [sub-make] Error 2
make[2]: Target `all' not remade because of errors.
make[2]: Leaving directory `/w/workspace/zephyr-sanity'
make[1]: *** [all] Error 2
make[1]: Leaving directory `/w/workspace/zephyr-sanity/tests/net/all'
Generating LALR tables
--------------------------sanity-out/qemu_x86/tests/net/all/test/build.log--------------------------
0 of 26 tests passed with 0 warnings in 29 seconds
Extra environment setting:
CONFIG_DEBUG=y
Build step 'Execute shell' marked build as failure


job zephyr-sanity build number 726 failed
see: https://jenkins.zephyrproject.org/job/zephyr-sanity/726/

--------------------sanity-out/qemu_x86/tests/net/lib/mqtt_packet/test/qemu.log---------------------
qemu_x86 tests/net/icmpv6/test FAILED: timeout
-------------------------sanity-out/qemu_x86/tests/net/icmpv6/test/qemu.log-------------------------
***** BOOTING ZEPHYR OS v1.7.99 - BUILD: Apr 18 2017 06:28:56 *****
ASSERTION FAIL [num_events > 0] @ /w/workspace/zephyr-sanity/kernel/poll.c:177:
zero events
-------------------------sanity-out/qemu_x86/tests/net/icmpv6/test/qemu.log-------------------------
qemu_x86 tests/net/trickle/test FAILED: timeout
------------------------sanity-out/qemu_x86/tests/net/trickle/test/qemu.log-------------------------
***** BOOTING ZEPHYR OS v1.7.99 - BUILD: Apr 18 2017 06:29:13 *****
ASSERTION FAIL [num_events > 0] @ /w/workspace/zephyr-sanity/kernel/poll.c:177:
zero events
------------------------sanity-out/qemu_x86/tests/net/trickle/test/qemu.log-------------------------
qemu_x86 tests/net/nbuf/test FAILED: timeout
--------------------------sanity-out/qemu_x86/tests/net/nbuf/test/qemu.log--------------------------
***** BOOTING ZEPHYR OS v1.7.99 - BUILD: Apr 18 2017 06:29:14 *****
ASSERTION FAIL [num_events > 0] @ /w/workspace/zephyr-sanity/kernel/poll.c:177:
zero events
--------------------------sanity-out/qemu_x86/tests/net/nbuf/test/qemu.log--------------------------
qemu_x86 tests/net/lib/dns_packet/test FAILED: timeout
---------------------sanity-out/qemu_x86/tests/net/lib/dns_packet/test/qemu.log---------------------
***** BOOTING ZEPHYR OS v1.7.99 - BUILD: Apr 18 2017 06:27:11 *****
ASSERTION FAIL [num_events > 0] @ /w/workspace/zephyr-sanity/kernel/poll.c:177:
zero events
---------------------sanity-out/qemu_x86/tests/net/lib/dns_packet/test/qemu.log---------------------
0 of 138 tests passed with 0 warnings in 10841 seconds
Extra environment setting:
CONFIG_ASSERT=y
Build step 'Execute shell' marked build as failure


zephyr/master: daily build zephyr-kernel-1.7.99-170416-ab8a3b2 Failure

donotreply@...
 

zephyr/master: daily build zephyr-kernel-1.7.99-170416-ab8a3b2 Failure



job zephyr-sanity build number 724 failed
see: https://jenkins.zephyrproject.org/job/zephyr-sanity/724/

make[2]: Target `all' not remade because of errors.
make[2]: Leaving directory `/w/workspace/zephyr-sanity'
make[1]: *** [all] Error 2
make[1]: Leaving directory `/w/workspace/zephyr-sanity/samples/bluetooth/peripheral_csc'
----------------sanity-out/qemu_x86/samples/bluetooth/peripheral_csc/test/build.log-----------------
qemu_x86 tests/net/neighbor/test FAILED: timeout
------------------------sanity-out/qemu_x86/tests/net/neighbor/test/qemu.log------------------------
***** BOOTING ZEPHYR OS v1.7.99 - BUILD: Apr 17 2017 07:20:51 *****
ASSERTION FAIL [num_events > 0] @ /w/workspace/zephyr-sanity/kernel/poll.c:177:
zero events
Generating LALR tables
------------------------sanity-out/qemu_x86/tests/net/neighbor/test/qemu.log------------------------
qemu_x86 tests/net/trickle/test FAILED: timeout
------------------------sanity-out/qemu_x86/tests/net/trickle/test/qemu.log-------------------------
***** BOOTING ZEPHYR OS v1.7.99 - BUILD: Apr 17 2017 07:21:33 *****
ASSERTION FAIL [num_events > 0] @ /w/workspace/zephyr-sanity/kernel/poll.c:177:
zero events
------------------------sanity-out/qemu_x86/tests/net/trickle/test/qemu.log-------------------------
qemu_x86 tests/net/lib/dns_packet/test FAILED: timeout
---------------------sanity-out/qemu_x86/tests/net/lib/dns_packet/test/qemu.log---------------------
***** BOOTING ZEPHYR OS v1.7.99 - BUILD: Apr 17 2017 07:20:24 *****
ASSERTION FAIL [num_events > 0] @ /w/workspace/zephyr-sanity/kernel/poll.c:177:
zero events
---------------------sanity-out/qemu_x86/tests/net/lib/dns_packet/test/qemu.log---------------------
0 of 161 tests passed with 0 warnings in 10936 seconds
Extra environment setting:
CONFIG_ASSERT=y
CONFIG_DEBUG=y
Build step 'Execute shell' marked build as failure


job zephyr-sanity build number 723 failed
see: https://jenkins.zephyrproject.org/job/zephyr-sanity/723/

/w/workspace/zephyr-sanity/ext/lib/crypto/mbedtls/library/cmac.c:886:11: error: ‘ret’ may be used uninitialized in this function [-Werror=maybe-uninitialized]
return( ret );
^
/w/workspace/zephyr-sanity/ext/lib/crypto/mbedtls/library/cmac.c:850:12: note: ‘ret’ was declared here
int i, ret;
^~~
cc1: all warnings being treated as errors
make[7]: *** [ext/lib/crypto/mbedtls/library/cmac.o] Error 1
make[7]: Target `__build' not remade because of errors.
make[6]: *** [ext/lib/crypto/mbedtls] Error 2
make[6]: Target `__build' not remade because of errors.
make[5]: *** [ext/lib/crypto] Error 2
make[5]: Target `__build' not remade because of errors.
make[4]: *** [ext/lib] Error 2
make[4]: Target `__build' not remade because of errors.
make[3]: *** [ext] Error 2
make[3]: Target `all' not remade because of errors.
make[3]: Leaving directory `/w/workspace/zephyr-sanity/sanity-out/qemu_nios2/tests/crypto/test_mbedtls/test_nios'
make[2]: *** [sub-make] Error 2
make[2]: Target `all' not remade because of errors.
make[2]: Leaving directory `/w/workspace/zephyr-sanity'
make[1]: *** [all] Error 2
make[1]: Leaving directory `/w/workspace/zephyr-sanity/tests/crypto/test_mbedtls'
Generating LALR tables
----------------sanity-out/qemu_nios2/tests/crypto/test_mbedtls/test_nios/build.log-----------------
0 of 26 tests passed with 0 warnings in 28 seconds
Extra environment setting:
CONFIG_DEBUG=y
Build step 'Execute shell' marked build as failure


job zephyr-sanity build number 722 failed
see: https://jenkins.zephyrproject.org/job/zephyr-sanity/722/

make[6]: Target `__build' not remade because of errors.
make[5]: *** [subsys/bluetooth/host] Error 2
make[5]: Target `__build' not remade because of errors.
make[4]: *** [subsys/bluetooth] Error 2
make[4]: Target `__build' not remade because of errors.
make[3]: *** [subsys] Error 2
LD arch/arm/core/cortex_m/built-in.o
LD arch/arm/core/built-in.o
LD arch/arm/built-in.o
LD arch/built-in.o
make[3]: Target `all' not remade because of errors.
make[3]: Leaving directory `/w/workspace/zephyr-sanity/sanity-out/nrf51_pca10028/tests/bluetooth/init/test_controller'
make[2]: *** [sub-make] Error 2
make[2]: Target `all' not remade because of errors.
make[2]: Leaving directory `/w/workspace/zephyr-sanity'
make[1]: *** [all] Error 2
make[1]: Leaving directory `/w/workspace/zephyr-sanity/tests/bluetooth/init'
Generating LALR tables
--------------sanity-out/nrf51_pca10028/tests/bluetooth/init/test_controller/build.log--------------
qemu_x86 tests/net/lib/dns_packet/test FAILED: timeout
---------------------sanity-out/qemu_x86/tests/net/lib/dns_packet/test/qemu.log---------------------
***** BOOTING ZEPHYR OS v1.7.99 - BUILD: Apr 17 2017 11:53:51 *****
ASSERTION FAIL [num_events > 0] @ /w/workspace/zephyr-sanity/kernel/poll.c:177:
zero events
---------------------sanity-out/qemu_x86/tests/net/lib/dns_packet/test/qemu.log---------------------
1 of 140 tests passed with 0 warnings in 11009 seconds
Extra environment setting:
CONFIG_ASSERT=y
Build step 'Execute shell' marked build as failure


zephyr/master: daily build zephyr-kernel-1.7.99-170415-ab8a3b2 Failure

donotreply@...
 

zephyr/master: daily build zephyr-kernel-1.7.99-170415-ab8a3b2 Failure



job zephyr-sanity build number 720 failed
see: https://jenkins.zephyrproject.org/job/zephyr-sanity/720/

qemu_x86 tests/net/neighbor/test FAILED: timeout
------------------------sanity-out/qemu_x86/tests/net/neighbor/test/qemu.log------------------------
***** BOOTING ZEPHYR OS v1.7.99 - BUILD: Apr 16 2017 09:03:59 *****
ASSERTION FAIL [num_events > 0] @ /w/workspace/zephyr-sanity/kernel/poll.c:177:
zero events
------------------------sanity-out/qemu_x86/tests/net/neighbor/test/qemu.log------------------------
qemu_x86 tests/net/lib/http_header_fields/test FAILED: timeout
-----------------sanity-out/qemu_x86/tests/net/lib/http_header_fields/test/qemu.log-----------------
***** BOOTING ZEPHYR OS v1.7.99 - BUILD: Apr 16 2017 09:04:37 *****
ASSERTION FAIL [num_events > 0] @ /w/workspace/zephyr-sanity/kernel/poll.c:177:
zero events
-----------------sanity-out/qemu_x86/tests/net/lib/http_header_fields/test/qemu.log-----------------
qemu_x86 tests/net/lib/zoap/test FAILED: timeout
------------------------sanity-out/qemu_x86/tests/net/lib/zoap/test/qemu.log------------------------
***** BOOTING ZEPHYR OS v1.7.99 - BUILD: Apr 16 2017 09:05:01 *****
ASSERTION FAIL [num_events > 0] @ /w/workspace/zephyr-sanity/kernel/poll.c:177:
zero events
------------------------sanity-out/qemu_x86/tests/net/lib/zoap/test/qemu.log------------------------
qemu_x86 tests/net/lib/dns_packet/test FAILED: timeout
---------------------sanity-out/qemu_x86/tests/net/lib/dns_packet/test/qemu.log---------------------
***** BOOTING ZEPHYR OS v1.7.99 - BUILD: Apr 16 2017 09:04:05 *****
ASSERTION FAIL [num_events > 0] @ /w/workspace/zephyr-sanity/kernel/poll.c:177:
zero events
---------------------sanity-out/qemu_x86/tests/net/lib/dns_packet/test/qemu.log---------------------
0 of 162 tests passed with 0 warnings in 11167 seconds
Extra environment setting:
CONFIG_ASSERT=y
CONFIG_DEBUG=y
Build step 'Execute shell' marked build as failure


job zephyr-sanity build number 719 failed
see: https://jenkins.zephyrproject.org/job/zephyr-sanity/719/

CC kernel/stack.o
CC kernel/sys_clock.o
CC kernel/system_work_q.o
LD arch/built-in.o
CC kernel/thread.o
CC kernel/thread_abort.o
CC kernel/timer.o
CC kernel/work_q.o
LD kernel/built-in.o
AR kernel/lib.a
AR libzephyr.a
LINK zephyr.lnk
/opt/zephyr-sdk-0.9/sysroots/x86_64-pokysdk-linux/usr/libexec/i586-zephyr-elfiamcu/gcc/i586-zephyr-elfiamcu/6.2.0/real-ld: zephyr_prebuilt.elf section `datas' will not fit in region `ROM'
/opt/zephyr-sdk-0.9/sysroots/x86_64-pokysdk-linux/usr/libexec/i586-zephyr-elfiamcu/gcc/i586-zephyr-elfiamcu/6.2.0/real-ld: region `ROM' overflowed by 2520 bytes
collect2: error: ld returned 1 exit status
make[3]: *** [zephyr_prebuilt.elf] Error 1
make[3]: Target `all' not remade because of errors.
make[3]: Leaving directory `/w/workspace/zephyr-sanity/sanity-out/arduino_101/samples/net/http_server/test_bt'
make[2]: *** [sub-make] Error 2
make[2]: Target `all' not remade because of errors.
make[2]: Leaving directory `/w/workspace/zephyr-sanity'
make[1]: *** [all] Error 2
make[1]: Leaving directory `/w/workspace/zephyr-sanity/samples/net/http_server'
Generating LALR tables
------------------sanity-out/arduino_101/samples/net/http_server/test_bt/build.log------------------
0 of 26 tests passed with 0 warnings in 32 seconds
Extra environment setting:
CONFIG_DEBUG=y
Build step 'Execute shell' marked build as failure


job zephyr-sanity build number 718 failed
see: https://jenkins.zephyrproject.org/job/zephyr-sanity/718/

CC kernel/sem.o
CC kernel/stack.o
CC kernel/sys_clock.o
CC kernel/system_work_q.o
CC kernel/thread.o
CC kernel/thread_abort.o
CC kernel/timer.o
CC kernel/work_q.o
LD kernel/built-in.o
AR kernel/lib.a
make[3]: Target `all' not remade because of errors.
make[3]: Leaving directory `/w/workspace/zephyr-sanity/sanity-out/arduino_101/tests/bluetooth/shell/test'
make[2]: *** [sub-make] Error 2
make[2]: Target `all' not remade because of errors.
make[2]: Leaving directory `/w/workspace/zephyr-sanity'
make[1]: *** [all] Error 2
make[1]: Leaving directory `/w/workspace/zephyr-sanity/tests/bluetooth/shell'
Generating LALR tables
--------------------sanity-out/arduino_101/tests/bluetooth/shell/test/build.log---------------------
qemu_x86 tests/net/lib/dns_packet/test FAILED: timeout
---------------------sanity-out/qemu_x86/tests/net/lib/dns_packet/test/qemu.log---------------------
***** BOOTING ZEPHYR OS v1.7.99 - BUILD: Apr 16 2017 07:37:21 *****
ASSERTION FAIL [num_events > 0] @ /w/workspace/zephyr-sanity/kernel/poll.c:177:
zero events
---------------------sanity-out/qemu_x86/tests/net/lib/dns_packet/test/qemu.log---------------------
0 of 139 tests passed with 0 warnings in 10918 seconds
Extra environment setting:
CONFIG_ASSERT=y
Build step 'Execute shell' marked build as failure


zephyr/master: daily build zephyr-kernel-1.7.99-170414-ab1555e Failure

donotreply@...
 

zephyr/master: daily build zephyr-kernel-1.7.99-170414-ab1555e Failure



job zephyr-sanity build number 716 failed
see: https://jenkins.zephyrproject.org/job/zephyr-sanity/716/

make[1]: *** [all] Error 2
make[1]: Leaving directory `/w/workspace/zephyr-sanity/tests/bluetooth/init'
---------------------sanity-out/qemu_x86/tests/bluetooth/init/test_17/build.log---------------------
qemu_x86 tests/net/lib/zoap/test FAILED: timeout
Generating LALR tables
------------------------sanity-out/qemu_x86/tests/net/lib/zoap/test/qemu.log------------------------
***** BOOTING ZEPHYR OS v1.7.99 - BUILD: Apr 15 2017 05:56:40 *****
ASSERTION FAIL [num_events > 0] @ /w/workspace/zephyr-sanity/kernel/poll.c:177:
zero events
------------------------sanity-out/qemu_x86/tests/net/lib/zoap/test/qemu.log------------------------
qemu_x86 tests/net/neighbor/test FAILED: timeout
------------------------sanity-out/qemu_x86/tests/net/neighbor/test/qemu.log------------------------
***** BOOTING ZEPHYR OS v1.7.99 - BUILD: Apr 15 2017 05:56:41 *****
ASSERTION FAIL [num_events > 0] @ /w/workspace/zephyr-sanity/kernel/poll.c:177:
zero events
------------------------sanity-out/qemu_x86/tests/net/neighbor/test/qemu.log------------------------
qemu_x86 tests/net/lib/dns_packet/test FAILED: timeout
---------------------sanity-out/qemu_x86/tests/net/lib/dns_packet/test/qemu.log---------------------
***** BOOTING ZEPHYR OS v1.7.99 - BUILD: Apr 15 2017 05:54:34 *****
ASSERTION FAIL [num_events > 0] @ /w/workspace/zephyr-sanity/kernel/poll.c:177:
zero events
---------------------sanity-out/qemu_x86/tests/net/lib/dns_packet/test/qemu.log---------------------
qemu_nios2 tests/legacy/kernel/test_sleep/test WARNING: rom_size +1160, is now 18756 +6.59%
Deltas based on metrics from last release
1 of 168 tests passed with 1 warnings in 10858 seconds
Extra environment setting:
CONFIG_ASSERT=y
CONFIG_DEBUG=y
Build step 'Execute shell' marked build as failure


job zephyr-sanity build number 715 failed
see: https://jenkins.zephyrproject.org/job/zephyr-sanity/715/

TR =0000 00000000 0000ffff 00008b00 DPL=0 TSS32-busy
GDT= 00100070 00000017
IDT= 00102e70 000007ff
CR0=0000003f CR2=00000000 CR3=00000000 CR4=00000000
DR0=00000000 DR1=00000000 DR2=00000000 DR3=00000000
DR6=ffff0ff0 DR7=00000400
CCS=0000000a CCD=0000003c CCO=CLR
EFER=0000000000000000
FCW=037f FSW=0000 [ST=0] FTW=00 MXCSR=00001f80
FPR0=0000000000000000 0000 FPR1=0000000000000000 0000
FPR2=0000000000000000 0000 FPR3=0000000000000000 0000
FPR4=0000000000000000 0000 FPR5=0000000000000000 0000
FPR6=0000000000000000 0000 FPR7=0000000000000000 0000
XMM00=00000000000000000000000000000000 XMM01=00000000000000000000000000000000
XMM02=00000000000000000000000000000000 XMM03=00000000000000000000000000000000
XMM04=00000000000000000000000000000000 XMM05=00000000000000000000000000000000
XMM06=00000000000000000000000000000000 XMM07=00000000000000000000000000000000
make[3]: *** [run] Aborted (core dumped)
make[3]: Leaving directory `/w/workspace/zephyr-sanity/sanity-out/qemu_x86/tests/legacy/kernel/test_sleep/test'
make[2]: *** [sub-make] Error 2
make[2]: Target `run' not remade because of errors.
make[2]: Leaving directory `/w/workspace/zephyr-sanity'
make[1]: *** [run] Error 2
make[1]: Leaving directory `/w/workspace/zephyr-sanity/tests/legacy/kernel/test_sleep'
------------------sanity-out/qemu_x86/tests/legacy/kernel/test_sleep/test/run.log-------------------
1 of 33 tests passed with 0 warnings in 34 seconds
Extra environment setting:
CONFIG_DEBUG=y
Build step 'Execute shell' marked build as failure


job zephyr-sanity build number 714 failed
see: https://jenkins.zephyrproject.org/job/zephyr-sanity/714/

--------------------sanity-out/qemu_x86/tests/net/lib/mqtt_packet/test/qemu.log---------------------
qemu_x86 tests/net/neighbor/test FAILED: timeout
------------------------sanity-out/qemu_x86/tests/net/neighbor/test/qemu.log------------------------
***** BOOTING ZEPHYR OS v1.7.99 - BUILD: Apr 15 2017 06:33:42 *****
ASSERTION FAIL [num_events > 0] @ /w/workspace/zephyr-sanity/kernel/poll.c:177:
zero events
------------------------sanity-out/qemu_x86/tests/net/neighbor/test/qemu.log------------------------
qemu_x86 tests/net/lib/zoap/test FAILED: timeout
------------------------sanity-out/qemu_x86/tests/net/lib/zoap/test/qemu.log------------------------
***** BOOTING ZEPHYR OS v1.7.99 - BUILD: Apr 15 2017 06:33:51 *****
ASSERTION FAIL [num_events > 0] @ /w/workspace/zephyr-sanity/kernel/poll.c:177:
zero events
------------------------sanity-out/qemu_x86/tests/net/lib/zoap/test/qemu.log------------------------
qemu_x86 tests/net/icmpv6/test FAILED: timeout
-------------------------sanity-out/qemu_x86/tests/net/icmpv6/test/qemu.log-------------------------
***** BOOTING ZEPHYR OS v1.7.99 - BUILD: Apr 15 2017 06:33:53 *****
ASSERTION FAIL [num_events > 0] @ /w/workspace/zephyr-sanity/kernel/poll.c:177:
zero events
-------------------------sanity-out/qemu_x86/tests/net/icmpv6/test/qemu.log-------------------------
qemu_x86 tests/net/lib/dns_packet/test FAILED: timeout
---------------------sanity-out/qemu_x86/tests/net/lib/dns_packet/test/qemu.log---------------------
***** BOOTING ZEPHYR OS v1.7.99 - BUILD: Apr 15 2017 06:33:26 *****
ASSERTION FAIL [num_events > 0] @ /w/workspace/zephyr-sanity/kernel/poll.c:177:
zero events
---------------------sanity-out/qemu_x86/tests/net/lib/dns_packet/test/qemu.log---------------------
0 of 145 tests passed with 0 warnings in 10950 seconds
Extra environment setting:
CONFIG_ASSERT=y
Build step 'Execute shell' marked build as failure


job zephyr-sanity build number 713 failed
see: https://jenkins.zephyrproject.org/job/zephyr-sanity/713/

CC kernel/sem.o
CC kernel/stack.o
CC kernel/sys_clock.o
LD drivers/built-in.o
CC kernel/system_work_q.o
CC kernel/thread.o
CC kernel/thread_abort.o
CC kernel/timer.o
CC kernel/work_q.o
LD kernel/built-in.o
AR kernel/lib.a
AR libzephyr.a
LINK zephyr.lnk
/opt/zephyr-sdk-0.9/sysroots/x86_64-pokysdk-linux/usr/libexec/arm-zephyr-eabi/gcc/arm-zephyr-eabi/6.2.0/real-ld: zephyr_prebuilt.elf section `bss' will not fit in region `SRAM'
/opt/zephyr-sdk-0.9/sysroots/x86_64-pokysdk-linux/usr/libexec/arm-zephyr-eabi/gcc/arm-zephyr-eabi/6.2.0/real-ld: section .intList VMA [0000000020004000,0000000020004083] overlaps section bss VMA [0000000020000630,00000000200055eb]
/opt/zephyr-sdk-0.9/sysroots/x86_64-pokysdk-linux/usr/libexec/arm-zephyr-eabi/gcc/arm-zephyr-eabi/6.2.0/real-ld: region `SRAM' overflowed by 22028 bytes
collect2: error: ld returned 1 exit status
make[3]: *** [zephyr_prebuilt.elf] Error 1
make[3]: Target `all' not remade because of errors.
make[3]: Leaving directory `/w/workspace/zephyr-sanity/sanity-out/bbc_microbit/tests/benchmarks/app_kernel/test'
make[2]: *** [sub-make] Error 2
make[2]: Target `all' not remade because of errors.
make[2]: Leaving directory `/w/workspace/zephyr-sanity'
make[1]: *** [all] Error 2
make[1]: Leaving directory `/w/workspace/zephyr-sanity/tests/benchmarks/app_kernel'
Generating LALR tables
-----------------sanity-out/bbc_microbit/tests/benchmarks/app_kernel/test/build.log-----------------
0 of 6 tests passed with 0 warnings in 13 seconds
Build step 'Execute shell' marked build as failure


zephyr/master: daily build zephyr-kernel-1.7.99-170413-7705c46 Failure

donotreply@...
 

zephyr/master: daily build zephyr-kernel-1.7.99-170413-7705c46 Failure



job zephyr-sanity build number 712 failed
see: https://jenkins.zephyrproject.org/job/zephyr-sanity/712/

qemu_x86 tests/net/neighbor/test FAILED: timeout
------------------------sanity-out/qemu_x86/tests/net/neighbor/test/qemu.log------------------------
***** BOOTING ZEPHYR OS v1.7.99 - BUILD: Apr 14 2017 07:23:53 *****
ASSERTION FAIL [num_events > 0] @ /w/workspace/zephyr-sanity/kernel/poll.c:177:
zero events
------------------------sanity-out/qemu_x86/tests/net/neighbor/test/qemu.log------------------------
qemu_x86 tests/net/lib/mqtt_packet/test FAILED: timeout
--------------------sanity-out/qemu_x86/tests/net/lib/mqtt_packet/test/qemu.log---------------------
***** BOOTING ZEPHYR OS v1.7.99 - BUILD: Apr 14 2017 07:24:09 *****
ASSERTION FAIL [num_events > 0] @ /w/workspace/zephyr-sanity/kernel/poll.c:177:
zero events
--------------------sanity-out/qemu_x86/tests/net/lib/mqtt_packet/test/qemu.log---------------------
qemu_x86 tests/net/lib/http_header_fields/test FAILED: timeout
-----------------sanity-out/qemu_x86/tests/net/lib/http_header_fields/test/qemu.log-----------------
***** BOOTING ZEPHYR OS v1.7.99 - BUILD: Apr 14 2017 07:24:10 *****
ASSERTION FAIL [num_events > 0] @ /w/workspace/zephyr-sanity/kernel/poll.c:177:
zero events
-----------------sanity-out/qemu_x86/tests/net/lib/http_header_fields/test/qemu.log-----------------
qemu_x86 tests/net/lib/dns_packet/test FAILED: timeout
---------------------sanity-out/qemu_x86/tests/net/lib/dns_packet/test/qemu.log---------------------
***** BOOTING ZEPHYR OS v1.7.99 - BUILD: Apr 14 2017 07:24:26 *****
ASSERTION FAIL [num_events > 0] @ /w/workspace/zephyr-sanity/kernel/poll.c:177:
zero events
---------------------sanity-out/qemu_x86/tests/net/lib/dns_packet/test/qemu.log---------------------
0 of 171 tests passed with 0 warnings in 10998 seconds
Extra environment setting:
CONFIG_ASSERT=y
CONFIG_DEBUG=y
Build step 'Execute shell' marked build as failure


job zephyr-sanity build number 711 failed
see: https://jenkins.zephyrproject.org/job/zephyr-sanity/711/

CR0=0000003f CR2=00000000 CR3=00000000 CR4=00000000
DR0=00000000 DR1=00000000 DR2=00000000 DR3=00000000
DR6=ffff0ff0 DR7=00000400
CCS=0000000a CCD=0000003c CCO=CLR
EFER=0000000000000000
FCW=037f FSW=0000 [ST=0] FTW=00 MXCSR=00001f80
FPR0=0000000000000000 0000 FPR1=0000000000000000 0000
FPR2=0000000000000000 0000 FPR3=0000000000000000 0000
FPR4=0000000000000000 0000 FPR5=0000000000000000 0000
FPR6=0000000000000000 0000 FPR7=0000000000000000 0000
XMM00=00000000000000000000000000000000 XMM01=00000000000000000000000000000000
XMM02=00000000000000000000000000000000 XMM03=00000000000000000000000000000000
XMM04=00000000000000000000000000000000 XMM05=00000000000000000000000000000000
XMM06=00000000000000000000000000000000 XMM07=00000000000000000000000000000000
make[3]: *** [run] Aborted (core dumped)
make[3]: Leaving directory `/w/workspace/zephyr-sanity/sanity-out/qemu_x86/tests/legacy/kernel/test_sleep/test'
make[2]: *** [sub-make] Error 2
make[2]: Target `run' not remade because of errors.
make[2]: Leaving directory `/w/workspace/zephyr-sanity'
make[1]: *** [run] Error 2
make[1]: Leaving directory `/w/workspace/zephyr-sanity/tests/legacy/kernel/test_sleep'
Generating LALR tables
Platform 'nrf52_blenano2' not specified in any arch .ini file and will not be tested
------------------sanity-out/qemu_x86/tests/legacy/kernel/test_sleep/test/run.log-------------------
qemu_riscv32 tests/legacy/kernel/test_sleep/test PASSED
1 of 31 tests passed with 0 warnings in 109 seconds
Extra environment setting:
CONFIG_DEBUG=y
Build step 'Execute shell' marked build as failure


job zephyr-sanity build number 710 failed
see: https://jenkins.zephyrproject.org/job/zephyr-sanity/710/

------------------------sanity-out/qemu_x86/tests/net/neighbor/test/qemu.log------------------------
qemu_x86 tests/net/lib/http_header_fields/test FAILED: timeout
-----------------sanity-out/qemu_x86/tests/net/lib/http_header_fields/test/qemu.log-----------------
***** BOOTING ZEPHYR OS v1.7.99 - BUILD: Apr 14 2017 07:36:47 *****
ASSERTION FAIL [num_events > 0] @ /w/workspace/zephyr-sanity/kernel/poll.c:177:
zero events
-----------------sanity-out/qemu_x86/tests/net/lib/http_header_fields/test/qemu.log-----------------
qemu_x86 tests/net/utils/test FAILED: timeout
-------------------------sanity-out/qemu_x86/tests/net/utils/test/qemu.log--------------------------
***** BOOTING ZEPHYR OS v1.7.99 - BUILD: Apr 14 2017 07:37:16 *****
ASSERTION FAIL [num_events > 0] @ /w/workspace/zephyr-sanity/kernel/poll.c:177:
zero events
-------------------------sanity-out/qemu_x86/tests/net/utils/test/qemu.log--------------------------
qemu_x86 tests/net/icmpv6/test FAILED: timeout
-------------------------sanity-out/qemu_x86/tests/net/icmpv6/test/qemu.log-------------------------
***** BOOTING ZEPHYR OS v1.7.99 - BUILD: Apr 14 2017 07:37:27 *****
ASSERTION FAIL [num_events > 0] @ /w/workspace/zephyr-sanity/kernel/poll.c:177:
zero events
-------------------------sanity-out/qemu_x86/tests/net/icmpv6/test/qemu.log-------------------------
qemu_x86 tests/net/lib/dns_packet/test FAILED: timeout
---------------------sanity-out/qemu_x86/tests/net/lib/dns_packet/test/qemu.log---------------------
***** BOOTING ZEPHYR OS v1.7.99 - BUILD: Apr 14 2017 07:36:00 *****
ASSERTION FAIL [num_events > 0] @ /w/workspace/zephyr-sanity/kernel/poll.c:177:
zero events
---------------------sanity-out/qemu_x86/tests/net/lib/dns_packet/test/qemu.log---------------------
0 of 144 tests passed with 0 warnings in 10897 seconds
Extra environment setting:
CONFIG_ASSERT=y
Build step 'Execute shell' marked build as failure


zephyr/master: daily build zephyr-kernel-1.7.99-170412-6702686 Failure

donotreply@...
 

zephyr/master: daily build zephyr-kernel-1.7.99-170412-6702686 Failure



job zephyr-sanity build number 708 failed
see: https://jenkins.zephyrproject.org/job/zephyr-sanity/708/

| non-matching sizes (1_TO_N) to higher priority |
|-----------------------------------------------------------------------------|
| size(B) | time/packet (nsec) | KB/sec |
|-----------------------------------------------------------------------------|
| put | get | no buf | small buf| big buf | no buf | small buf| big buf |
|-----------------------------------------------------------------------------|
| 8| 4096| 1553| 958| 1054| 5151| 8350| 7590|
| 16| 2048| 1055| 938| 997| 15165| 17057| 16048|
| 32| 1024| 1152| 1164| 1142| 27777| 27491| 28021|
| 64| 512| 1879| 6548| 1528| 34060| 9773| 41884|
| 128| 256| 3484| 5186| 5302| 36739| 24681| 24141|
| 256| 128| 49614| 7411| 6184| 5159| 34543| 41397|
| 512| 64| 52278| 24417| 24121| 9793| 20968| 21226|
| 1024| 32| 86982| 47207| 73462| 11772| 21691| 13939|
| 2048| 16| 270455| 158040| 115130| 7572| 12958| 17788|
----------------sanity-out/qemu_x86_iamcu/tests/benchmarks/app_kernel/test/qemu.log-----------------
qemu_x86 tests/net/lib/dns_packet/test FAILED: timeout
---------------------sanity-out/qemu_x86/tests/net/lib/dns_packet/test/qemu.log---------------------
***** BOOTING ZEPHYR OS v1.7.99 - BUILD: Apr 13 2017 07:21:54 *****
ASSERTION FAIL [num_events > 0] @ /w/workspace/zephyr-sanity/kernel/poll.c:177:
zero events
---------------------sanity-out/qemu_x86/tests/net/lib/dns_packet/test/qemu.log---------------------
Generating LALR tables
Platform 'nrf52_blenano2' not specified in any arch .ini file and will not be tested
1 of 175 tests passed with 0 warnings in 11029 seconds
Extra environment setting:
CONFIG_ASSERT=y
CONFIG_DEBUG=y
Build step 'Execute shell' marked build as failure


job zephyr-sanity build number 707 failed
see: https://jenkins.zephyrproject.org/job/zephyr-sanity/707/

|-----------------------------------------------------------------------------|
| non-matching sizes (1_TO_N) to higher priority |
|-----------------------------------------------------------------------------|
| size(B) | time/packet (nsec) | KB/sec |
|-----------------------------------------------------------------------------|
| put | get | no buf | small buf| big buf | no buf | small buf| big buf |
|-----------------------------------------------------------------------------|
| 8| 4096| 1057| 889| 967| 7568| 8998| 8273|
| 16| 2048| 902| 899| 960| 17738| 17797| 16666|
| 32| 1024| 1376| 1072| 1220| 23255| 29850| 26229|
| 64| 512| 1523| 1514| 1764| 42022| 42272| 36281|
| 128| 256| 5592| 5583| 5265| 22889| 22926| 24311|
| 256| 128| 34660| 11265| 11750| 7386| 22725| 21787|
| 512| 64| 25342| 19543| 15215| 20203| 26198| 33651|
| 1024| 32| 85987| 104022| 37540| 11908| 9844| 27277|
| 2048| 16| 290700| 290400| 131740| 7045| 7052| 15545|
| 4096| 8| 592270| 517070| 523010| 6915| 7921| 7831|
|-----------------------------------------------------------------------------|
| non-matching sizes (1_TO_N) to lower priority |
|-----------------------------------------------------------------------------|
| size(B) | time/packet (nsec) | KB/sec |
|-----------------------------------------------------------------------------|
| put | get | no buf | small buf| big buf | no buf | small buf| big buf |
|-----------------------------------------------------------------------------|
----------------sanity-out/qemu_x86_iamcu/tests/benchmarks/app_kernel/test/qemu.log-----------------
0 of 35 tests passed with 0 warnings in 218 seconds
Extra environment setting:
CONFIG_DEBUG=y
Build step 'Execute shell' marked build as failure


job zephyr-sanity build number 706 failed
see: https://jenkins.zephyrproject.org/job/zephyr-sanity/706/

make[2]: Target `all' not remade because of errors.
make[2]: Leaving directory `/w/workspace/zephyr-sanity'
make[1]: *** [all] Error 2
make[1]: Leaving directory `/w/workspace/zephyr-sanity/tests/bluetooth/init'
Generating LALR tables
Platform 'nrf52_blenano2' not specified in any arch .ini file and will not be tested
--------------sanity-out/nrf51_pca10028/tests/bluetooth/init/test_controller/build.log--------------
qemu_x86 tests/net/trickle/test FAILED: timeout
------------------------sanity-out/qemu_x86/tests/net/trickle/test/qemu.log-------------------------
***** BOOTING ZEPHYR OS v1.7.99 - BUILD: Apr 13 2017 09:57:21 *****
ASSERTION FAIL [num_events > 0] @ /w/workspace/zephyr-sanity/kernel/poll.c:177:
zero events
------------------------sanity-out/qemu_x86/tests/net/trickle/test/qemu.log-------------------------
qemu_x86 tests/net/lib/http_header_fields/test FAILED: timeout
-----------------sanity-out/qemu_x86/tests/net/lib/http_header_fields/test/qemu.log-----------------
***** BOOTING ZEPHYR OS v1.7.99 - BUILD: Apr 13 2017 09:57:50 *****
ASSERTION FAIL [num_events > 0] @ /w/workspace/zephyr-sanity/kernel/poll.c:177:
zero events
-----------------sanity-out/qemu_x86/tests/net/lib/http_header_fields/test/qemu.log-----------------
qemu_x86 tests/net/lib/dns_packet/test FAILED: timeout
---------------------sanity-out/qemu_x86/tests/net/lib/dns_packet/test/qemu.log---------------------
***** BOOTING ZEPHYR OS v1.7.99 - BUILD: Apr 13 2017 09:57:51 *****
ASSERTION FAIL [num_events > 0] @ /w/workspace/zephyr-sanity/kernel/poll.c:177:
zero events
---------------------sanity-out/qemu_x86/tests/net/lib/dns_packet/test/qemu.log---------------------
2 of 149 tests passed with 0 warnings in 11235 seconds
Extra environment setting:
CONFIG_ASSERT=y
Build step 'Execute shell' marked build as failure


job zephyr-sanity build number 705 failed
see: https://jenkins.zephyrproject.org/job/zephyr-sanity/705/

|-----------------------------------------------------------------------------|
| non-matching sizes (1_TO_N) to higher priority |
|-----------------------------------------------------------------------------|
| size(B) | time/packet (nsec) | KB/sec |
|-----------------------------------------------------------------------------|
| put | get | no buf | small buf| big buf | no buf | small buf| big buf |
|-----------------------------------------------------------------------------|
| 8| 4096| 2367| 1738| 1771| 3379| 4602| 4517|
| 16| 2048| 1844| 1776| 1651| 8676| 9009| 9691|
| 32| 1024| 2284| 2118| 1271| 14010| 15108| 25177|
| 64| 512| 1889| 1872| 1840| 33880| 34188| 34782|
| 128| 256| 5792| 3311| 3444| 22099| 38659| 37166|
| 256| 128| 39362| 17601| 12411| 6503| 14544| 20626|
| 512| 64| 26515| 37752| 17506| 19309| 13562| 29247|
| 1024| 32| 46572| 66150| 69677| 21987| 15479| 14696|
| 2048| 16| 146160| 174340| 127905| 14012| 11747| 16011|
| 4096| 8| 575450| 534720| 482260| 7117| 7660| 8493|
|-----------------------------------------------------------------------------|
| non-matching sizes (1_TO_N) to lower priority |
|-----------------------------------------------------------------------------|
| size(B) | time/packet (nsec) | KB/sec |
|-----------------------------------------------------------------------------|
| put | get | no buf | small buf| big buf | no buf | small buf| big buf |
|-----------------------------------------------------------------------------|
Generating LALR tables
Platform 'nrf52_blenano2' not specified in any arch .ini file and will not be tested
----------------sanity-out/qemu_x86_iamcu/tests/benchmarks/app_kernel/test/qemu.log-----------------
0 of 6 tests passed with 0 warnings in 194 seconds
Build step 'Execute shell' marked build as failure


help!!! zephyr build error

主 人 <cstyle.z.zhou@...>
 

Hi all,

 

       I meet a build error ,could you please someone get some help,thanks.

 

 

发送自 Windows 10 邮件应用

 


zephyr/master: daily build zephyr-kernel-1.7.99-170411-6683f13 Failure

donotreply@...
 

zephyr/master: daily build zephyr-kernel-1.7.99-170411-6683f13 Failure



job zephyr-sanity build number 704 failed
see: https://jenkins.zephyrproject.org/job/zephyr-sanity/704/

| non-matching sizes (1_TO_N) to higher priority |
|-----------------------------------------------------------------------------|
| size(B) | time/packet (nsec) | KB/sec |
|-----------------------------------------------------------------------------|
| put | get | no buf | small buf| big buf | no buf | small buf| big buf |
|-----------------------------------------------------------------------------|
| 8| 4096| 1070| 839| 990| 7476| 9535| 8080|
| 16| 2048| 1035| 1002| 971| 15458| 15968| 16477|
| 32| 1024| 1110| 1124| 1114| 28828| 28469| 28725|
| 64| 512| 1535| 1618| 1796| 41693| 39555| 35634|
| 128| 256| 3198| 2976| 3155| 40025| 43010| 40570|
| 256| 128| 24460| 8579| 6980| 10466| 29840| 36676|
| 512| 64| 34468| 18558| 17695| 14854| 27589| 28934|
| 1024| 32| 50325| 50700| 48090| 20347| 20197| 21293|
----------------sanity-out/qemu_x86/tests/legacy/benchmark/app_kernel/test/qemu.log-----------------
qemu_x86 tests/net/lib/dns_packet/test FAILED: timeout
---------------------sanity-out/qemu_x86/tests/net/lib/dns_packet/test/qemu.log---------------------
***** BOOTING ZEPHYR OS v1.7.99 - BUILD: Apr 12 2017 05:39:15 *****
ASSERTION FAIL [num_events > 0] @ /w/workspace/zephyr-sanity/kernel/poll.c:177:
zero events
---------------------sanity-out/qemu_x86/tests/net/lib/dns_packet/test/qemu.log---------------------
Generating LALR tables
Platform 'arduino_101_mcuboot' not specified in any arch .ini file and will not be tested
Platform 'nrf52_blenano2' not specified in any arch .ini file and will not be tested
1 of 169 tests passed with 0 warnings in 10927 seconds
Extra environment setting:
CONFIG_ASSERT=y
CONFIG_DEBUG=y
Build step 'Execute shell' marked build as failure


job zephyr-sanity build number 703 failed
see: https://jenkins.zephyrproject.org/job/zephyr-sanity/703/

| 16| 16| 4571| 4689| 4857| 3500| 3412| 3294|
| 32| 32| 4971| 4734| 4798| 6437| 6759| 6669|
| 64| 64| 5258| 4993| 4963| 12171| 12817| 12895|
| 128| 128| 5765| 5605| 6002| 22202| 22836| 21326|
| 256| 256| 7059| 6844| 6915| 36265| 37405| 37020|
| 512| 512| 9505| 9622| 9604| 53866| 53211| 53311|
| 1024| 1024| 14402| 14636| 14364| 71101| 69964| 71289|
| 2048| 2048| 24614| 24195| 24544| 83204| 84645| 83441|
| 4096| 4096| 46437| 45100| 44781| 88205| 90820| 91467|
|-----------------------------------------------------------------------------|
| non-matching sizes (1_TO_N) to higher priority |
|-----------------------------------------------------------------------------|
| size(B) | time/packet (nsec) | KB/sec |
|-----------------------------------------------------------------------------|
| put | get | no buf | small buf| big buf | no buf | small buf| big buf |
|-----------------------------------------------------------------------------|
| 8| 4096| 1807| 1388| 1600| 4427| 5763| 5000|
| 16| 2048| 1628| 1688| 1646| 9828| 9478| 9720|
| 32| 1024| 1165| 1972| 1878| 27467| 16227| 17039|
| 64| 512| 2656| 2687| 2703| 24096| 23818| 23677|
| 128| 256| 4945| 4925| 4751| 25884| 25989| 26941|
| 256| 128| 32094| 11836| 10446| 7976| 21628| 24506|
| 512| 64| 43510| 27483| 23170| 11767| 18629| 22097|
| 1024| 32| 83837| 79760| 69177| 12214| 12838| 14802|
-------------sanity-out/qemu_x86_iamcu/tests/legacy/benchmark/app_kernel/test/qemu.log--------------
1 of 31 tests passed with 0 warnings in 221 seconds
Extra environment setting:
CONFIG_DEBUG=y
Build step 'Execute shell' marked build as failure


job zephyr-sanity build number 702 failed
see: https://jenkins.zephyrproject.org/job/zephyr-sanity/702/

|-----------------------------------------------------------------------------|
| non-matching sizes (1_TO_N) to higher priority |
|-----------------------------------------------------------------------------|
| size(B) | time/packet (nsec) | KB/sec |
|-----------------------------------------------------------------------------|
| put | get | no buf | small buf| big buf | no buf | small buf| big buf |
|-----------------------------------------------------------------------------|
| 8| 4096| 1564| 2288| 1370| 5115| 3496| 5839|
| 16| 2048| 1413| 1823| 1305| 11323| 8776| 12260|
| 32| 1024| 1577| 2803| 1542| 20291| 11416| 20752|
| 64| 512| 4078| 4141| 4009| 15693| 15455| 15964|
| 128| 256| 6922| 6442| 3786| 18491| 19869| 33808|
| 256| 128| 28580| 13348| 8920| 8957| 19178| 28699|
| 512| 64| 33743| 32695| 22662| 15173| 15659| 22592|
| 1024| 32| 73317| 67962| 67722| 13966| 15067| 15120|
----------------sanity-out/qemu_x86/tests/legacy/benchmark/app_kernel/test/qemu.log-----------------
qemu_x86 tests/net/lib/dns_packet/test FAILED: timeout
---------------------sanity-out/qemu_x86/tests/net/lib/dns_packet/test/qemu.log---------------------
***** BOOTING ZEPHYR OS v1.7.99 - BUILD: Apr 12 2017 07:56:06 *****
ASSERTION FAIL [num_events > 0] @ /w/workspace/zephyr-sanity/kernel/poll.c:177:
zero events
---------------------sanity-out/qemu_x86/tests/net/lib/dns_packet/test/qemu.log---------------------
Generating LALR tables
Platform 'arduino_101_mcuboot' not specified in any arch .ini file and will not be tested
Platform 'nrf52_blenano2' not specified in any arch .ini file and will not be tested
0 of 142 tests passed with 0 warnings in 11002 seconds
Extra environment setting:
CONFIG_ASSERT=y
Build step 'Execute shell' marked build as failure


job zephyr-sanity build number 701 failed
see: https://jenkins.zephyrproject.org/job/zephyr-sanity/701/

| 32| 32| 3362| 3272| 3272| 9518| 9779| 9779|
| 64| 64| 3566| 3536| 3520| 17947| 18099| 18181|
| 128| 128| 4081| 3830| 3979| 31364| 33420| 32168|
| 256| 256| 4938| 4911| 5037| 51842| 52127| 50823|
| 512| 512| 6596| 6788| 6833| 77622| 75427| 74930|
| 1024| 1024| 10696| 10673| 10664| 95736| 95943| 96024|
| 2048| 2048| 17807| 19001| 37128| 115010| 107783| 55160|
| 4096| 4096| 33019| 32790| 67355| 124049| 124916| 60812|
|-----------------------------------------------------------------------------|
| non-matching sizes (1_TO_N) to higher priority |
|-----------------------------------------------------------------------------|
| size(B) | time/packet (nsec) | KB/sec |
|-----------------------------------------------------------------------------|
| put | get | no buf | small buf| big buf | no buf | small buf| big buf |
|-----------------------------------------------------------------------------|
| 8| 4096| 2316| 1961| 1227| 3454| 4079| 6519|
| 16| 2048| 1250| 1151| 1214| 12800| 13900| 13179|
| 32| 1024| 1366| 1421| 1502| 23426| 22519| 21304|
| 64| 512| 3604| 3413| 1962| 17758| 18751| 32619|
| 128| 256| 7094| 3202| 3541| 18043| 39975| 36147|
| 256| 128| 23912| 8900| 8888| 10705| 28764| 28802|
| 512| 64| 26958| 18866| 17071| 18992| 27138| 29992|
| 1024| 32| 56312| 51910| 41870| 18184| 19726| 24456|
Generating LALR tables
Platform 'arduino_101_mcuboot' not specified in any arch .ini file and will not be tested
Platform 'nrf52_blenano2' not specified in any arch .ini file and will not be tested
-------------sanity-out/qemu_x86_iamcu/tests/legacy/benchmark/app_kernel/test/qemu.log--------------
0 of 2 tests passed with 0 warnings in 183 seconds
Build step 'Execute shell' marked build as failure


zephyr/master: daily build zephyr-kernel-1.7.99-170410-bf382a5 Failure

donotreply@...
 

zephyr/master: daily build zephyr-kernel-1.7.99-170410-bf382a5 Failure



job zephyr-sanity build number 700 failed
see: https://jenkins.zephyrproject.org/job/zephyr-sanity/700/

| non-matching sizes (1_TO_N) to higher priority |
|-----------------------------------------------------------------------------|
| size(B) | time/packet (nsec) | KB/sec |
|-----------------------------------------------------------------------------|
| put | get | no buf | small buf| big buf | no buf | small buf| big buf |
|-----------------------------------------------------------------------------|
| 8| 4096| 1380| 1068| 1088| 5797| 7490| 7352|
| 16| 2048| 1760| 1083| 1043| 9090| 14773| 15340|
| 32| 1024| 1160| 1146| 1213| 27586| 27923| 26380|
| 64| 512| 2859| 2258| 2723| 22385| 28343| 23503|
| 128| 256| 3327| 2889| 3188| 38473| 44305| 40150|
| 256| 128| 32048| 8706| 6339| 7988| 29405| 40384|
| 512| 64| 34062| 23660| 14405| 15031| 21639| 35543|
| 1024| 32| 54280| 85375| 49477| 18865| 11994| 20696|
Generating LALR tables
Platform 'arduino_101_mcuboot' not specified in any arch .ini file and will not be tested
Platform 'nrf52_blenano2' not specified in any arch .ini file and will not be tested
----------------sanity-out/qemu_x86/tests/legacy/benchmark/app_kernel/test/qemu.log-----------------
qemu_x86 tests/net/lib/dns_packet/test FAILED: timeout
---------------------sanity-out/qemu_x86/tests/net/lib/dns_packet/test/qemu.log---------------------
***** BOOTING ZEPHYR OS v1.7.99 - BUILD: Apr 11 2017 07:16:48 *****
ASSERTION FAIL [num_events > 0] @ /w/workspace/zephyr-sanity/kernel/poll.c:177:
zero events
---------------------sanity-out/qemu_x86/tests/net/lib/dns_packet/test/qemu.log---------------------
1 of 169 tests passed with 0 warnings in 10984 seconds
Extra environment setting:
CONFIG_ASSERT=y
CONFIG_DEBUG=y
Build step 'Execute shell' marked build as failure


job zephyr-sanity build number 699 failed
see: https://jenkins.zephyrproject.org/job/zephyr-sanity/699/

| 128| 128| 5452| 4619| 9221| 23477| 27711| 13881|
| 256| 256| 4862| 8184| 6056| 52653| 31280| 42272|
| 512| 512| 10840| 6846| 20099| 47232| 74788| 25473|
| 1024| 1024| 16565| 24244| 14312| 61817| 42237| 71548|
| 2048| 2048| 24387| 27452| 28035| 83979| 74602| 73051|
| 4096| 4096| 52497| 48908| 37978| 78023| 83749| 107851|
|-----------------------------------------------------------------------------|
| non-matching sizes (1_TO_N) to higher priority |
|-----------------------------------------------------------------------------|
| size(B) | time/packet (nsec) | KB/sec |
|-----------------------------------------------------------------------------|
| put | get | no buf | small buf| big buf | no buf | small buf| big buf |
|-----------------------------------------------------------------------------|
| 8| 4096| 1739| 1495| 1454| 4600| 5351| 5502|
| 16| 2048| 1312| 2289| 1805| 12195| 6989| 8864|
| 32| 1024| 1902| 2325| 1885| 16824| 13763| 16976|
| 64| 512| 3714| 2087| 1592| 17232| 30666| 40201|
| 128| 256| 4920| 3657| 4277| 26016| 35001| 29927|
| 256| 128| 28411| 14371| 12466| 9010| 17813| 20535|
| 512| 64| 38005| 26717| 24948| 13471| 19163| 20522|
| 1024| 32| 86220| 87992| 75975| 11876| 11637| 13478|
Generating LALR tables
Platform 'arduino_101_mcuboot' not specified in any arch .ini file and will not be tested
Platform 'nrf52_blenano2' not specified in any arch .ini file and will not be tested
-------------sanity-out/qemu_x86_iamcu/tests/legacy/benchmark/app_kernel/test/qemu.log--------------
1 of 32 tests passed with 0 warnings in 201 seconds
Extra environment setting:
CONFIG_DEBUG=y
Build step 'Execute shell' marked build as failure


job zephyr-sanity build number 698 failed
see: https://jenkins.zephyrproject.org/job/zephyr-sanity/698/

|-----------------------------------------------------------------------------|
| non-matching sizes (1_TO_N) to higher priority |
|-----------------------------------------------------------------------------|
| size(B) | time/packet (nsec) | KB/sec |
|-----------------------------------------------------------------------------|
| put | get | no buf | small buf| big buf | no buf | small buf| big buf |
|-----------------------------------------------------------------------------|
| 8| 4096| 2578| 1273| 1817| 3103| 6284| 4402|
| 16| 2048| 1390| 1326| 1440| 11510| 12066| 11111|
| 32| 1024| 2583| 1521| 1739| 12388| 21038| 18401|
| 64| 512| 2375| 2161| 3329| 26947| 29615| 19224|
| 128| 256| 4305| 4527| 4780| 29732| 28274| 26778|
| 256| 128| 55393| 16056| 10093| 4621| 15944| 25364|
| 512| 64| 57648| 25370| 35776| 8881| 20181| 14311|
| 1024| 32| 56827| 105045| 90082| 18019| 9748| 11367|
-------------sanity-out/qemu_x86_iamcu/tests/legacy/benchmark/app_kernel/test/qemu.log--------------
Generating LALR tables
Platform 'arduino_101_mcuboot' not specified in any arch .ini file and will not be tested
Platform 'nrf52_blenano2' not specified in any arch .ini file and will not be tested
qemu_x86 tests/net/lib/dns_packet/test FAILED: timeout
---------------------sanity-out/qemu_x86/tests/net/lib/dns_packet/test/qemu.log---------------------
***** BOOTING ZEPHYR OS v1.7.99 - BUILD: Apr 11 2017 07:25:09 *****
ASSERTION FAIL [num_events > 0] @ /w/workspace/zephyr-sanity/kernel/poll.c:177:
zero events
---------------------sanity-out/qemu_x86/tests/net/lib/dns_packet/test/qemu.log---------------------
1 of 142 tests passed with 0 warnings in 10844 seconds
Extra environment setting:
CONFIG_ASSERT=y
Build step 'Execute shell' marked build as failure


job zephyr-sanity build number 697 failed
see: https://jenkins.zephyrproject.org/job/zephyr-sanity/697/

| 32| 32| 5445| 5350| 6285| 5876| 5981| 5091|
| 64| 64| 3864| 7140| 6881| 16563| 8963| 9300|
| 128| 128| 7035| 4697| 7338| 18194| 27251| 17443|
| 256| 256| 8899| 6550| 9177| 28767| 39083| 27895|
| 512| 512| 7238| 13364| 11342| 70737| 38311| 45141|
| 1024| 1024| 15840| 17174| 19627| 64646| 59625| 52173|
| 2048| 2048| 30371| 38405| 26116| 67432| 53326| 78419|
| 4096| 4096| 64861| 39758| 41648| 63150| 103023| 98348|
|-----------------------------------------------------------------------------|
| non-matching sizes (1_TO_N) to higher priority |
|-----------------------------------------------------------------------------|
| size(B) | time/packet (nsec) | KB/sec |
|-----------------------------------------------------------------------------|
| put | get | no buf | small buf| big buf | no buf | small buf| big buf |
|-----------------------------------------------------------------------------|
| 8| 4096| 1353| 1646| 1365| 5912| 4860| 5860|
| 16| 2048| 1304| 1326| 1415| 12269| 12066| 11307|
| 32| 1024| 1710| 1652| 1652| 18713| 19370| 19370|
| 64| 512| 1999| 3414| 3430| 32016| 18746| 18658|
| 128| 256| 6316| 3521| 6246| 20265| 36353| 20493|
| 256| 128| 28040| 10099| 7899| 9129| 25349| 32409|
| 512| 64| 28531| 19691| 18078| 17945| 26001| 28321|
| 1024| 32| 104817| 94317| 45687| 9769| 10857| 22413|
Generating LALR tables
Platform 'arduino_101_mcuboot' not specified in any arch .ini file and will not be tested
Platform 'nrf52_blenano2' not specified in any arch .ini file and will not be tested
-------------sanity-out/qemu_x86_iamcu/tests/legacy/benchmark/app_kernel/test/qemu.log--------------
0 of 2 tests passed with 0 warnings in 184 seconds
Build step 'Execute shell' marked build as failure


zephyr/master: daily build zephyr-kernel-1.7.99-170409-cdb12c5 Failure

donotreply@...
 

zephyr/master: daily build zephyr-kernel-1.7.99-170409-cdb12c5 Failure



job zephyr-sanity build number 696 failed
see: https://jenkins.zephyrproject.org/job/zephyr-sanity/696/

| non-matching sizes (1_TO_N) to higher priority |
|-----------------------------------------------------------------------------|
| size(B) | time/packet (nsec) | KB/sec |
|-----------------------------------------------------------------------------|
| put | get | no buf | small buf| big buf | no buf | small buf| big buf |
|-----------------------------------------------------------------------------|
| 8| 4096| 1410| 924| 1322| 5673| 8658| 6051|
| 16| 2048| 965| 1474| 1084| 16580| 10854| 14760|
| 32| 1024| 1235| 1523| 1864| 25910| 21011| 17167|
| 64| 512| 2164| 1542| 1661| 29574| 41504| 38531|
| 128| 256| 2828| 2919| 2813| 45261| 43850| 45503|
| 256| 128| 42204| 12353| 7910| 6065| 20723| 32364|
| 512| 64| 27576| 22551| 13685| 18566| 22704| 37413|
| 1024| 32| 43442| 45027| 42282| 23571| 22741| 24218|
Generating LALR tables
Platform 'arduino_101_mcuboot' not specified in any arch .ini file and will not be tested
Platform 'nrf52_blenano2' not specified in any arch .ini file and will not be tested
-------------sanity-out/qemu_x86_iamcu/tests/legacy/benchmark/app_kernel/test/qemu.log--------------
qemu_x86 tests/net/lib/dns_packet/test FAILED: timeout
---------------------sanity-out/qemu_x86/tests/net/lib/dns_packet/test/qemu.log---------------------
***** BOOTING ZEPHYR OS v1.7.99 - BUILD: Apr 10 2017 06:51:50 *****
ASSERTION FAIL [num_events > 0] @ /w/workspace/zephyr-sanity/kernel/poll.c:177:
zero events
---------------------sanity-out/qemu_x86/tests/net/lib/dns_packet/test/qemu.log---------------------
2 of 143 tests passed with 0 warnings in 10992 seconds
Extra environment setting:
CONFIG_ASSERT=y
CONFIG_DEBUG=y
Build step 'Execute shell' marked build as failure


job zephyr-sanity build number 695 failed
see: https://jenkins.zephyrproject.org/job/zephyr-sanity/695/

| 16| 16| 6560| 6513| 5222| 2439| 2456| 3063|
| 32| 32| 6800| 6728| 7052| 4705| 4756| 4537|
| 64| 64| 7149| 7083| 7069| 8952| 9035| 9053|
| 128| 128| 7653| 6660| 7643| 16725| 19219| 16747|
| 256| 256| 9384| 9104| 9114| 27280| 28119| 28088|
| 512| 512| 12021| 12261| 11832| 42592| 41758| 43272|
| 1024| 1024| 15968| 17830| 17351| 64128| 57431| 59016|
| 2048| 2048| 28556| 29843| 21697| 71718| 68625| 94390|
| 4096| 4096| 37463| 28054| 51627| 109334| 146004| 79338|
|-----------------------------------------------------------------------------|
| non-matching sizes (1_TO_N) to higher priority |
|-----------------------------------------------------------------------------|
| size(B) | time/packet (nsec) | KB/sec |
|-----------------------------------------------------------------------------|
| put | get | no buf | small buf| big buf | no buf | small buf| big buf |
|-----------------------------------------------------------------------------|
| 8| 4096| 2294| 1712| 1956| 3487| 4672| 4089|
| 16| 2048| 2327| 2035| 2312| 6875| 7862| 6920|
| 32| 1024| 2454| 2382| 4565| 13039| 13434| 7009|
| 64| 512| 3370| 3223| 4050| 18991| 19857| 15802|
| 128| 256| 5861| 5855| 6303| 21839| 21861| 20307|
| 256| 128| 45117| 14509| 15550| 5674| 17644| 16463|
| 512| 64| 61345| 30888| 28873| 8346| 16576| 17732|
| 1024| 32| 103462| 70057| 79327| 9897| 14616| 12908|
----------------sanity-out/qemu_x86/tests/legacy/benchmark/app_kernel/test/qemu.log-----------------
2 of 33 tests passed with 0 warnings in 211 seconds
Extra environment setting:
CONFIG_DEBUG=y
Build step 'Execute shell' marked build as failure


job zephyr-sanity build number 694 failed
see: https://jenkins.zephyrproject.org/job/zephyr-sanity/694/

|-----------------------------------------------------------------------------|
| non-matching sizes (1_TO_N) to higher priority |
|-----------------------------------------------------------------------------|
| size(B) | time/packet (nsec) | KB/sec |
|-----------------------------------------------------------------------------|
| put | get | no buf | small buf| big buf | no buf | small buf| big buf |
|-----------------------------------------------------------------------------|
| 8| 4096| 3081| 1560| 1534| 2596| 5128| 5215|
| 16| 2048| 1872| 1883| 3046| 8547| 8497| 5252|
| 32| 1024| 1711| 1942| 2081| 18702| 16477| 15377|
| 64| 512| 3927| 5072| 2170| 16297| 12618| 29493|
| 128| 256| 7554| 7341| 7283| 16944| 17436| 17575|
| 256| 128| 29590| 10687| 16705| 8651| 23954| 15324|
| 512| 64| 32462| 24683| 26083| 15772| 20743| 19629|
| 1024| 32| 54312| 127617| 44955| 18854| 8024| 22778|
-------------sanity-out/qemu_x86_iamcu/tests/legacy/benchmark/app_kernel/test/qemu.log--------------
qemu_x86 tests/net/lib/dns_packet/test FAILED: timeout
---------------------sanity-out/qemu_x86/tests/net/lib/dns_packet/test/qemu.log---------------------
***** BOOTING ZEPHYR OS v1.7.99 - BUILD: Apr 10 2017 05:09:50 *****
ASSERTION FAIL [num_events > 0] @ /w/workspace/zephyr-sanity/kernel/poll.c:177:
zero events
---------------------sanity-out/qemu_x86/tests/net/lib/dns_packet/test/qemu.log---------------------
Generating LALR tables
Platform 'arduino_101_mcuboot' not specified in any arch .ini file and will not be tested
Platform 'nrf52_blenano2' not specified in any arch .ini file and will not be tested
0 of 121 tests passed with 0 warnings in 10937 seconds
Extra environment setting:
CONFIG_ASSERT=y
Build step 'Execute shell' marked build as failure


job zephyr-sanity build number 693 failed
see: https://jenkins.zephyrproject.org/job/zephyr-sanity/693/

| 32| 32| 7089| 7224| 7061| 4514| 4429| 4531|
| 64| 64| 4121| 7810| 4113| 15530| 8194| 15560|
| 128| 128| 4673| 10066| 4602| 27391| 12716| 27813|
| 256| 256| 5701| 10512| 5726| 44904| 24353| 44708|
| 512| 512| 8068| 14256| 14510| 63460| 35914| 35286|
| 1024| 1024| 23476| 23309| 22961| 43619| 43931| 44597|
| 2048| 2048| 37977| 39868| 38095| 53927| 51369| 53760|
| 4096| 4096| 70270| 70200| 69567| 58289| 58347| 58878|
|-----------------------------------------------------------------------------|
| non-matching sizes (1_TO_N) to higher priority |
|-----------------------------------------------------------------------------|
| size(B) | time/packet (nsec) | KB/sec |
|-----------------------------------------------------------------------------|
| put | get | no buf | small buf| big buf | no buf | small buf| big buf |
|-----------------------------------------------------------------------------|
| 8| 4096| 2662| 2346| 2484| 3005| 3410| 3220|
| 16| 2048| 2560| 2569| 2548| 6250| 6228| 6279|
| 32| 1024| 2790| 2790| 2801| 11469| 11469| 11424|
| 64| 512| 4050| 4135| 4160| 15802| 15477| 15384|
| 128| 256| 7180| 6718| 6943| 17827| 19053| 18435|
| 256| 128| 48599| 18209| 14848| 5267| 14058| 17241|
| 512| 64| 53011| 37740| 33680| 9658| 13566| 15201|
| 1024| 32| 104635| 107007| 89720| 9786| 9569| 11413|
Generating LALR tables
Platform 'arduino_101_mcuboot' not specified in any arch .ini file and will not be tested
Platform 'nrf52_blenano2' not specified in any arch .ini file and will not be tested
-------------sanity-out/qemu_x86_iamcu/tests/legacy/benchmark/app_kernel/test/qemu.log--------------
0 of 3 tests passed with 0 warnings in 184 seconds
Build step 'Execute shell' marked build as failure


zephyr/master: daily build zephyr-kernel-1.7.99-170408-5d7a7c2 Failure

donotreply@...
 

zephyr/master: daily build zephyr-kernel-1.7.99-170408-5d7a7c2 Failure



job zephyr-sanity build number 692 failed
see: https://jenkins.zephyrproject.org/job/zephyr-sanity/692/

| non-matching sizes (1_TO_N) to higher priority |
|-----------------------------------------------------------------------------|
| size(B) | time/packet (nsec) | KB/sec |
|-----------------------------------------------------------------------------|
| put | get | no buf | small buf| big buf | no buf | small buf| big buf |
|-----------------------------------------------------------------------------|
| 8| 4096| 2090| 954| 1033| 3827| 8385| 7744|
| 16| 2048| 1082| 1106| 1090| 14787| 14466| 14678|
| 32| 1024| 1429| 1261| 1175| 22393| 25376| 27234|
| 64| 512| 1808| 2440| 2338| 35398| 26229| 27373|
| 128| 256| 3162| 3312| 3094| 40480| 38647| 41370|
| 256| 128| 38458| 14143| 9530| 6656| 18100| 26862|
| 512| 64| 32647| 23131| 30175| 15682| 22134| 16967|
| 1024| 32| 94247| 78240| 67315| 10865| 13087| 15212|
----------------sanity-out/qemu_x86/tests/legacy/benchmark/app_kernel/test/qemu.log-----------------
qemu_x86 tests/net/lib/dns_packet/test FAILED: timeout
---------------------sanity-out/qemu_x86/tests/net/lib/dns_packet/test/qemu.log---------------------
***** BOOTING ZEPHYR OS v1.7.99 - BUILD: Apr 9 2017 05:32:43 *****
ASSERTION FAIL [num_events > 0] @ /w/workspace/zephyr-sanity/kernel/poll.c:177:
zero events
---------------------sanity-out/qemu_x86/tests/net/lib/dns_packet/test/qemu.log---------------------
Generating LALR tables
Platform 'arduino_101_mcuboot' not specified in any arch .ini file and will not be tested
Platform 'nrf52_blenano2' not specified in any arch .ini file and will not be tested
0 of 141 tests passed with 0 warnings in 10856 seconds
Extra environment setting:
CONFIG_ASSERT=y
CONFIG_DEBUG=y
Build step 'Execute shell' marked build as failure


job zephyr-sanity build number 691 failed
see: https://jenkins.zephyrproject.org/job/zephyr-sanity/691/

| 16| 16| 6173| 6117| 9816| 2591| 2615| 1629|
| 32| 32| 6464| 6176| 5936| 4950| 5181| 5390|
| 64| 64| 6539| 6843| 6882| 9787| 9352| 9299|
| 128| 128| 7344| 7313| 7214| 17429| 17503| 17743|
| 256| 256| 8931| 8997| 11282| 28664| 28453| 22691|
| 512| 512| 11680| 11565| 11725| 43835| 44271| 43667|
| 1024| 1024| 17646| 18617| 25371| 58030| 55003| 40361|
| 2048| 2048| 29741| 30344| 29683| 68861| 67492| 68995|
| 4096| 4096| 52193| 52076| 53994| 78477| 78654| 75860|
|-----------------------------------------------------------------------------|
| non-matching sizes (1_TO_N) to higher priority |
|-----------------------------------------------------------------------------|
| size(B) | time/packet (nsec) | KB/sec |
|-----------------------------------------------------------------------------|
| put | get | no buf | small buf| big buf | no buf | small buf| big buf |
|-----------------------------------------------------------------------------|
| 8| 4096| 2226| 2875| 2016| 3593| 2782| 3968|
| 16| 2048| 2243| 2055| 2371| 7133| 7785| 6748|
| 32| 1024| 3219| 3125| 4308| 9940| 10240| 7428|
| 64| 512| 3966| 4876| 4068| 16137| 13125| 15732|
| 128| 256| 6719| 7352| 5463| 19050| 17410| 23430|
| 256| 128| 49200| 13865| 17823| 5203| 18463| 14363|
| 512| 64| 127040| 45247| 31360| 4030| 11315| 16326|
| 1024| 32| 118040| 123432| 94997| 8675| 8296| 10779|
-------------sanity-out/qemu_x86_iamcu/tests/legacy/benchmark/app_kernel/test/qemu.log--------------
1 of 32 tests passed with 0 warnings in 218 seconds
Extra environment setting:
CONFIG_DEBUG=y
Build step 'Execute shell' marked build as failure


job zephyr-sanity build number 690 failed
see: https://jenkins.zephyrproject.org/job/zephyr-sanity/690/

|-----------------------------------------------------------------------------|
| non-matching sizes (1_TO_N) to higher priority |
|-----------------------------------------------------------------------------|
| size(B) | time/packet (nsec) | KB/sec |
|-----------------------------------------------------------------------------|
| put | get | no buf | small buf| big buf | no buf | small buf| big buf |
|-----------------------------------------------------------------------------|
| 8| 4096| 1343| 1286| 1405| 5956| 6220| 5693|
| 16| 2048| 1256| 1184| 1341| 12738| 13513| 11931|
| 32| 1024| 1415| 1421| 1557| 22614| 22519| 20552|
| 64| 512| 2157| 2540| 2426| 29670| 25196| 26380|
| 128| 256| 3797| 3500| 3515| 33710| 36571| 36415|
| 256| 128| 24190| 10145| 7762| 10582| 25234| 32981|
| 512| 64| 26607| 21101| 18962| 19243| 24264| 27001|
| 1024| 32| 52420| 105187| 47670| 19534| 9735| 21481|
-------------sanity-out/qemu_x86_iamcu/tests/legacy/benchmark/app_kernel/test/qemu.log--------------
qemu_x86 tests/net/lib/dns_packet/test FAILED: timeout
---------------------sanity-out/qemu_x86/tests/net/lib/dns_packet/test/qemu.log---------------------
***** BOOTING ZEPHYR OS v1.7.99 - BUILD: Apr 9 2017 06:05:08 *****
ASSERTION FAIL [num_events > 0] @ /w/workspace/zephyr-sanity/kernel/poll.c:177:
zero events
---------------------sanity-out/qemu_x86/tests/net/lib/dns_packet/test/qemu.log---------------------
Generating LALR tables
Platform 'arduino_101_mcuboot' not specified in any arch .ini file and will not be tested
Platform 'nrf52_blenano2' not specified in any arch .ini file and will not be tested
0 of 120 tests passed with 0 warnings in 10945 seconds
Extra environment setting:
CONFIG_ASSERT=y
Build step 'Execute shell' marked build as failure


job zephyr-sanity build number 689 failed
see: https://jenkins.zephyrproject.org/job/zephyr-sanity/689/

| 32| 32| 6183| 7158| 8614| 5175| 4470| 3714|
| 64| 64| 3922| 7973| 6564| 16318| 8027| 9750|
| 128| 128| 7534| 4565| 14104| 16989| 28039| 9075|
| 256| 256| 11122| 9416| 11120| 23017| 27187| 23021|
| 512| 512| 7309| 14868| 15456| 70050| 34436| 33126|
| 1024| 1024| 12882| 24549| 22165| 79490| 41712| 46198|
| 2048| 2048| 39505| 39458| 19632| 51841| 51903| 104319|
| 4096| 4096| 40723| 128080| 56779| 100581| 31980| 72139|
|-----------------------------------------------------------------------------|
| non-matching sizes (1_TO_N) to higher priority |
|-----------------------------------------------------------------------------|
| size(B) | time/packet (nsec) | KB/sec |
|-----------------------------------------------------------------------------|
| put | get | no buf | small buf| big buf | no buf | small buf| big buf |
|-----------------------------------------------------------------------------|
| 8| 4096| 1586| 1174| 2750| 5044| 6814| 2909|
| 16| 2048| 2813| 3338| 3250| 5687| 4793| 4923|
| 32| 1024| 5245| 1478| 1475| 6101| 21650| 21694|
| 64| 512| 4379| 1990| 4165| 14615| 32160| 15366|
| 128| 256| 6963| 6808| 6909| 18382| 18801| 18526|
| 256| 128| 27200| 10854| 15692| 9411| 23585| 16314|
| 512| 64| 59056| 20992| 32130| 8669| 24390| 15935|
| 1024| 32| 150925| 112295| 48055| 6784| 9118| 21308|
Generating LALR tables
Platform 'arduino_101_mcuboot' not specified in any arch .ini file and will not be tested
Platform 'nrf52_blenano2' not specified in any arch .ini file and will not be tested
-------------sanity-out/qemu_x86_iamcu/tests/legacy/benchmark/app_kernel/test/qemu.log--------------
0 of 3 tests passed with 0 warnings in 187 seconds
Build step 'Execute shell' marked build as failure


zephyr/master: daily build zephyr-kernel-1.7.99-170407-de38141 Failure

donotreply@...
 

zephyr/master: daily build zephyr-kernel-1.7.99-170407-de38141 Failure



job zephyr-sanity build number 688 failed
see: https://jenkins.zephyrproject.org/job/zephyr-sanity/688/

AR kernel/lib.a
make[3]: Target `all' not remade because of errors.
make[3]: Leaving directory `/w/workspace/zephyr-sanity/sanity-out/qemu_x86/samples/bluetooth/peripheral_dis/test'
make[2]: *** [sub-make] Error 2
make[2]: Target `all' not remade because of errors.
make[2]: Leaving directory `/w/workspace/zephyr-sanity'
make[1]: *** [all] Error 2
make[1]: Leaving directory `/w/workspace/zephyr-sanity/samples/bluetooth/peripheral_dis'
Generating LALR tables
Platform 'arduino_101_mcuboot' not specified in any arch .ini file and will not be tested
Platform 'nrf52_blenano2' not specified in any arch .ini file and will not be tested
----------------sanity-out/qemu_x86/samples/bluetooth/peripheral_dis/test/build.log-----------------
qemu_x86 tests/net/utils/test FAILED: timeout
-------------------------sanity-out/qemu_x86/tests/net/utils/test/qemu.log--------------------------
***** BOOTING ZEPHYR OS v1.7.99 - BUILD: Apr 8 2017 09:20:44 *****
ASSERTION FAIL [num_events > 0] @ /w/workspace/zephyr-sanity/kernel/poll.c:177:
zero events
-------------------------sanity-out/qemu_x86/tests/net/utils/test/qemu.log--------------------------
qemu_x86 tests/net/lib/dns_packet/test FAILED: timeout
---------------------sanity-out/qemu_x86/tests/net/lib/dns_packet/test/qemu.log---------------------
***** BOOTING ZEPHYR OS v1.7.99 - BUILD: Apr 8 2017 09:20:06 *****
ASSERTION FAIL [num_events > 0] @ /w/workspace/zephyr-sanity/kernel/poll.c:177:
zero events
---------------------sanity-out/qemu_x86/tests/net/lib/dns_packet/test/qemu.log---------------------
0 of 144 tests passed with 0 warnings in 11156 seconds
Extra environment setting:
CONFIG_ASSERT=y
CONFIG_DEBUG=y
Build step 'Execute shell' marked build as failure


job zephyr-sanity build number 687 failed
see: https://jenkins.zephyrproject.org/job/zephyr-sanity/687/

| 16| 16| 5692| 6065| 5934| 2810| 2638| 2696|
| 32| 32| 5962| 6859| 6000| 5367| 4665| 5333|
| 64| 64| 6469| 6440| 6231| 9893| 9937| 10271|
| 128| 128| 7399| 7089| 7225| 17299| 18056| 17716|
| 256| 256| 8541| 8712| 8490| 29973| 29384| 30153|
| 512| 512| 8224| 11168| 11341| 62256| 45845| 45145|
| 1024| 1024| 16583| 19378| 16560| 61749| 52843| 61835|
| 2048| 2048| 28154| 28664| 27626| 72742| 71448| 74133|
| 4096| 4096| 51000| 51288| 51822| 80313| 79862| 79039|
|-----------------------------------------------------------------------------|
| non-matching sizes (1_TO_N) to higher priority |
|-----------------------------------------------------------------------------|
| size(B) | time/packet (nsec) | KB/sec |
|-----------------------------------------------------------------------------|
| put | get | no buf | small buf| big buf | no buf | small buf| big buf |
|-----------------------------------------------------------------------------|
| 8| 4096| 2068| 1738| 1820| 3868| 4602| 4395|
| 16| 2048| 1794| 1749| 1749| 8918| 9148| 9148|
| 32| 1024| 1798| 2094| 2101| 17797| 15281| 15230|
| 64| 512| 2952| 3258| 3110| 21680| 19643| 20578|
| 128| 256| 5447| 5504| 5342| 23499| 23255| 23961|
| 256| 128| 41655| 14550| 12013| 6145| 17594| 21310|
| 512| 64| 52291| 34130| 31927| 9791| 15001| 16036|
| 1024| 32| 53355| 99882| 77847| 19192| 10252| 13154|
-------------sanity-out/qemu_x86_iamcu/tests/legacy/benchmark/app_kernel/test/qemu.log--------------
0 of 31 tests passed with 0 warnings in 198 seconds
Extra environment setting:
CONFIG_DEBUG=y
Build step 'Execute shell' marked build as failure


job zephyr-sanity build number 686 failed
see: https://jenkins.zephyrproject.org/job/zephyr-sanity/686/

|-----------------------------------------------------------------------------|
| non-matching sizes (1_TO_N) to higher priority |
|-----------------------------------------------------------------------------|
| size(B) | time/packet (nsec) | KB/sec |
|-----------------------------------------------------------------------------|
| put | get | no buf | small buf| big buf | no buf | small buf| big buf |
|-----------------------------------------------------------------------------|
| 8| 4096| 2120| 1769| 2577| 3773| 4522| 3104|
| 16| 2048| 1463| 1267| 1376| 10936| 12628| 11627|
| 32| 1024| 1643| 3382| 1866| 19476| 9461| 17148|
| 64| 512| 4502| 2263| 2136| 14215| 28281| 29962|
| 128| 256| 3920| 5771| 3942| 32653| 22179| 32470|
| 256| 128| 43818| 9926| 10706| 5842| 25790| 23911|
| 512| 64| 48340| 30182| 19881| 10591| 16963| 25753|
| 1024| 32| 68257| 68277| 58250| 15002| 14997| 17579|
----------------sanity-out/qemu_x86/tests/legacy/benchmark/app_kernel/test/qemu.log-----------------
qemu_x86 tests/net/lib/dns_packet/test FAILED: timeout
---------------------sanity-out/qemu_x86/tests/net/lib/dns_packet/test/qemu.log---------------------
***** BOOTING ZEPHYR OS v1.7.99 - BUILD: Apr 8 2017 05:07:10 *****
ASSERTION FAIL [num_events > 0] @ /w/workspace/zephyr-sanity/kernel/poll.c:177:
zero events
---------------------sanity-out/qemu_x86/tests/net/lib/dns_packet/test/qemu.log---------------------
Generating LALR tables
Platform 'arduino_101_mcuboot' not specified in any arch .ini file and will not be tested
Platform 'nrf52_blenano2' not specified in any arch .ini file and will not be tested
0 of 121 tests passed with 0 warnings in 10902 seconds
Extra environment setting:
CONFIG_ASSERT=y
Build step 'Execute shell' marked build as failure


job zephyr-sanity build number 685 failed
see: https://jenkins.zephyrproject.org/job/zephyr-sanity/685/

| 32| 32| 3679| 3588| 3561| 8698| 8918| 8986|
| 64| 64| 3915| 4275| 3783| 16347| 14970| 16917|
| 128| 128| 4503| 6482| 4418| 28425| 19746| 28972|
| 256| 256| 5734| 5981| 5845| 44645| 42802| 43798|
| 512| 512| 7521| 7740| 8473| 68076| 66149| 60427|
| 1024| 1024| 12055| 11888| 21959| 84944| 86137| 46632|
| 2048| 2048| 20155| 30389| 20075| 101612| 67392| 102017|
| 4096| 4096| 53623| 38588| 70299| 76385| 106146| 58265|
|-----------------------------------------------------------------------------|
| non-matching sizes (1_TO_N) to higher priority |
|-----------------------------------------------------------------------------|
| size(B) | time/packet (nsec) | KB/sec |
|-----------------------------------------------------------------------------|
| put | get | no buf | small buf| big buf | no buf | small buf| big buf |
|-----------------------------------------------------------------------------|
| 8| 4096| 1474| 1331| 1449| 5427| 6010| 5521|
| 16| 2048| 2526| 1316| 1722| 6334| 12158| 9291|
| 32| 1024| 1810| 2671| 1608| 17679| 11980| 19900|
| 64| 512| 2249| 4246| 2556| 28457| 15073| 25039|
| 128| 256| 3769| 4275| 3971| 33961| 29941| 32233|
| 256| 128| 35499| 11403| 10830| 7211| 22450| 23638|
| 512| 64| 31842| 48571| 19553| 16079| 10541| 26185|
| 1024| 32| 106675| 110620| 51107| 9599| 9256| 20036|
Generating LALR tables
Platform 'arduino_101_mcuboot' not specified in any arch .ini file and will not be tested
Platform 'nrf52_blenano2' not specified in any arch .ini file and will not be tested
----------------sanity-out/qemu_x86/tests/legacy/benchmark/app_kernel/test/qemu.log-----------------
0 of 3 tests passed with 0 warnings in 185 seconds
Build step 'Execute shell' marked build as failure

2781 - 2800 of 2976