Date   

[ master ] Build FAILED for zephyrproject-rtos/test_results ( tests: reel board test results Testing CI system, run tests on hardware reel board v1 Signed-off-by: Maksim Masalski <maksim.masalski@intel.com> ) on Shippable.com #builds

Shippable.com <noreply@...>
 

SHIPPABLE BUILD REPORT

73
test_results
Branch : master Sha : a145b3b290
Builder : Maksim Masalski Triggered By : Anas Nashif
Custom Environment Variables:
JOB_TRIGGERED_BY_NAME="create_test_commit"
JOB_TRIGGERED_BY_ID="125148"
# Runtime Status Tests Branch Coverage Sequence Coverage Triggered at Duration
73.1 none succeeded 838/971 N/A N/A Sat May 30 2020 04:07:37 GMT+0000 (UTC) 01:49:22
73.2 none unstable 1654/2274 N/A N/A Sat May 30 2020 04:07:37 GMT+0000 (UTC) 01:56:73
73.3 none failed 2868/4778 N/A N/A Sat May 30 2020 04:07:37 GMT+0000 (UTC) 04:31:65
73.4 none unstable 5549/6100 N/A N/A Sat May 30 2020 04:07:37 GMT+0000 (UTC) 01:78:60
73.5 none failed 5895/5941 N/A N/A Sat May 30 2020 04:07:37 GMT+0000 (UTC) 05:84:23


Need help with Shippable? File an Issue


[ master ] Build TIMEOUT for zephyrproject-rtos/ci-test ( ci: Update sdk to 0.11.3 Update sdk to 0.11.3 release and update docker image to get that SDK version. Signed-off-by: Kumar Gala <kumar.gala@linaro.org> ) on Shippable.com #builds

Shippable.com <noreply@...>
 

SHIPPABLE BUILD REPORT

3504
ci-test
Branch : master Sha : 5f9e0cfc3c
Builder : Kumar Gala Triggered By : Kumar Gala
Custom Environment Variables:
JOB_TRIGGERED_BY_NAME="daily-verify"
JOB_TRIGGERED_BY_ID="23790"
# Runtime Status Tests Branch Coverage Sequence Coverage Triggered at Duration
3504.1 none succeeded 1367/1585 N/A N/A Sat May 30 2020 02:05:20 GMT+0000 (UTC) 01:89:15
3504.2 none succeeded 912/1585 N/A N/A Sat May 30 2020 02:05:20 GMT+0000 (UTC) 01:73:96
3504.3 none timeout 0/0 N/A N/A Sat May 30 2020 02:05:20 GMT+0000 (UTC) 02:23:66
3504.4 none timeout 0/0 N/A N/A Sat May 30 2020 02:05:20 GMT+0000 (UTC) 02:23:65
3504.5 none succeeded 1578/1585 N/A N/A Sat May 30 2020 02:05:20 GMT+0000 (UTC) 02:97:92
3504.6 none succeeded 1583/1585 N/A N/A Sat May 30 2020 02:05:20 GMT+0000 (UTC) 02:03:78
3504.7 none succeeded 1186/1585 N/A N/A Sat May 30 2020 02:05:20 GMT+0000 (UTC) 02:97:09
3504.8 none succeeded 787/1585 N/A N/A Sat May 30 2020 02:05:20 GMT+0000 (UTC) 01:64:67
3504.9 none succeeded 1344/1585 N/A N/A Sat May 30 2020 02:05:20 GMT+0000 (UTC) 02:98:90
3504.10 none succeeded 1400/1585 N/A N/A Sat May 30 2020 02:05:20 GMT+0000 (UTC) 02:03:92
3504.11 none succeeded 1452/1585 N/A N/A Sat May 30 2020 02:05:20 GMT+0000 (UTC) 02:07:05
3504.12 none succeeded 1432/1585 N/A N/A Sat May 30 2020 02:05:20 GMT+0000 (UTC) 02:12:36
3504.13 none succeeded 1283/1585 N/A N/A Sat May 30 2020 02:05:20 GMT+0000 (UTC) 01:86:68
3504.14 none succeeded 1177/1585 N/A N/A Sat May 30 2020 02:05:20 GMT+0000 (UTC) 02:97:09
3504.15 none succeeded 1044/1585 N/A N/A Sat May 30 2020 02:05:21 GMT+0000 (UTC) 01:87:26
3504.16 none succeeded 1274/1585 N/A N/A Sat May 30 2020 02:05:21 GMT+0000 (UTC) 01:86:65
3504.17 none succeeded 1095/1585 N/A N/A Sat May 30 2020 02:05:21 GMT+0000 (UTC) 01:88:97
3504.18 none succeeded 1540/1585 N/A N/A Sat May 30 2020 02:05:21 GMT+0000 (UTC) 02:04:15
3504.19 none succeeded 1082/1585 N/A N/A Sat May 30 2020 02:05:21 GMT+0000 (UTC) 01:77:45
3504.20 none succeeded 1585/1585 N/A N/A Sat May 30 2020 02:05:21 GMT+0000 (UTC) 02:02:94
3504.21 none succeeded 1533/1585 N/A N/A Sat May 30 2020 02:05:21 GMT+0000 (UTC) 02:03:77
3504.22 none succeeded 1089/1585 N/A N/A Sat May 30 2020 02:05:21 GMT+0000 (UTC) 02:91:48
3504.23 none succeeded 1255/1585 N/A N/A Sat May 30 2020 02:05:21 GMT+0000 (UTC) 01:90:79
3504.24 none succeeded 1264/1585 N/A N/A Sat May 30 2020 02:05:21 GMT+0000 (UTC) 02:92:00
3504.25 none succeeded 1574/1584 N/A N/A Sat May 30 2020 02:05:21 GMT+0000 (UTC) 02:13:81
3504.26 none succeeded 1568/1584 N/A N/A Sat May 30 2020 02:05:21 GMT+0000 (UTC) 02:21:44
3504.27 none succeeded 991/1584 N/A N/A Sat May 30 2020 02:05:21 GMT+0000 (UTC) 01:80:20
3504.28 none succeeded 1355/1584 N/A N/A Sat May 30 2020 02:05:21 GMT+0000 (UTC) 02:99:25
3504.29 none succeeded 1299/1584 N/A N/A Sat May 30 2020 02:05:21 GMT+0000 (UTC) 01:89:66
3504.30 none succeeded 1576/1584 N/A N/A Sat May 30 2020 02:05:21 GMT+0000 (UTC) 02:06:44
3504.31 none succeeded 1575/1584 N/A N/A Sat May 30 2020 02:05:21 GMT+0000 (UTC) 02:05:14
3504.32 none timeout 0/0 N/A N/A Sat May 30 2020 02:05:22 GMT+0000 (UTC) 02:24:68
3504.33 none timeout 0/0 N/A N/A Sat May 30 2020 02:05:22 GMT+0000 (UTC) 02:21:88
3504.34 none succeeded 1575/1584 N/A N/A Sat May 30 2020 02:05:22 GMT+0000 (UTC) 02:99:53
3504.35 none succeeded 1584/1584 N/A N/A Sat May 30 2020 02:05:22 GMT+0000 (UTC) 02:96:78


Need help with Shippable? File an Issue


[ master ] Build FAILED for zephyrproject-rtos/test_results ( tests: reel board test results Testing CI system, run tests on hardware reel board v1 Signed-off-by: Maksim Masalski <maksim.masalski@intel.com> ) on Shippable.com #builds

Shippable.com <noreply@...>
 

SHIPPABLE BUILD REPORT

72
test_results
Branch : master Sha : a145b3b290
Builder : Maksim Masalski Triggered By : Anas Nashif
Custom Environment Variables:
JOB_TRIGGERED_BY_NAME="create_test_commit"
JOB_TRIGGERED_BY_ID="125148"
# Runtime Status Tests Branch Coverage Sequence Coverage Triggered at Duration
72.1 none succeeded 838/971 N/A N/A Fri May 29 2020 04:06:49 GMT+0000 (UTC) 01:50:04
72.2 none unstable 1654/2274 N/A N/A Fri May 29 2020 04:06:49 GMT+0000 (UTC) 01:54:63
72.3 none failed 2868/4778 N/A N/A Fri May 29 2020 04:06:49 GMT+0000 (UTC) 04:33:70
72.4 none unstable 5549/6100 N/A N/A Fri May 29 2020 04:06:49 GMT+0000 (UTC) 01:79:43
72.5 none unstable 5895/5941 N/A N/A Fri May 29 2020 04:06:49 GMT+0000 (UTC) 01:89:47


Need help with Shippable? File an Issue


[ master ] Build TIMEOUT for zephyrproject-rtos/ci-test ( ci: Update sdk to 0.11.3 Update sdk to 0.11.3 release and update docker image to get that SDK version. Signed-off-by: Kumar Gala <kumar.gala@linaro.org> ) on Shippable.com #builds

Shippable.com <noreply@...>
 

SHIPPABLE BUILD REPORT

3503
ci-test
Branch : master Sha : 5f9e0cfc3c
Builder : Kumar Gala Triggered By : Kumar Gala
Custom Environment Variables:
JOB_TRIGGERED_BY_NAME="daily-verify"
JOB_TRIGGERED_BY_ID="23790"
# Runtime Status Tests Branch Coverage Sequence Coverage Triggered at Duration
3503.1 none succeeded 1367/1585 N/A N/A Fri May 29 2020 02:06:03 GMT+0000 (UTC) 01:90:94
3503.2 none succeeded 912/1585 N/A N/A Fri May 29 2020 02:06:03 GMT+0000 (UTC) 01:74:28
3503.3 none timeout 0/0 N/A N/A Fri May 29 2020 02:06:03 GMT+0000 (UTC) 02:22:00
3503.4 none timeout 0/0 N/A N/A Fri May 29 2020 02:06:03 GMT+0000 (UTC) 02:22:99
3503.5 none succeeded 1578/1585 N/A N/A Fri May 29 2020 02:06:03 GMT+0000 (UTC) 02:98:56
3503.6 none succeeded 1583/1585 N/A N/A Fri May 29 2020 02:06:03 GMT+0000 (UTC) 02:03:99
3503.7 none succeeded 1186/1585 N/A N/A Fri May 29 2020 02:06:03 GMT+0000 (UTC) 02:97:42
3503.8 none succeeded 787/1585 N/A N/A Fri May 29 2020 02:06:03 GMT+0000 (UTC) 01:65:94
3503.9 none succeeded 1344/1585 N/A N/A Fri May 29 2020 02:06:03 GMT+0000 (UTC) 02:05:91
3503.10 none succeeded 1400/1585 N/A N/A Fri May 29 2020 02:06:03 GMT+0000 (UTC) 02:05:03
3503.11 none succeeded 1452/1585 N/A N/A Fri May 29 2020 02:06:03 GMT+0000 (UTC) 02:07:45
3503.12 none succeeded 1432/1585 N/A N/A Fri May 29 2020 02:06:03 GMT+0000 (UTC) 02:11:44
3503.13 none succeeded 1283/1585 N/A N/A Fri May 29 2020 02:06:03 GMT+0000 (UTC) 02:90:00
3503.14 none succeeded 1177/1585 N/A N/A Fri May 29 2020 02:06:03 GMT+0000 (UTC) 02:08:82
3503.15 none succeeded 1044/1585 N/A N/A Fri May 29 2020 02:06:03 GMT+0000 (UTC) 01:90:83
3503.16 none succeeded 1274/1585 N/A N/A Fri May 29 2020 02:06:03 GMT+0000 (UTC) 02:91:30
3503.17 none succeeded 1095/1585 N/A N/A Fri May 29 2020 02:06:03 GMT+0000 (UTC) 02:93:81
3503.18 none succeeded 1540/1585 N/A N/A Fri May 29 2020 02:06:03 GMT+0000 (UTC) 02:98:55
3503.19 none succeeded 1082/1585 N/A N/A Fri May 29 2020 02:06:04 GMT+0000 (UTC) 01:81:76
3503.20 none succeeded 1585/1585 N/A N/A Fri May 29 2020 02:06:04 GMT+0000 (UTC) 02:01:47
3503.21 none succeeded 1533/1585 N/A N/A Fri May 29 2020 02:06:04 GMT+0000 (UTC) 02:07:04
3503.22 none succeeded 1089/1585 N/A N/A Fri May 29 2020 02:06:04 GMT+0000 (UTC) 02:94:17
3503.23 none succeeded 1255/1585 N/A N/A Fri May 29 2020 02:06:04 GMT+0000 (UTC) 02:94:44
3503.24 none succeeded 1264/1585 N/A N/A Fri May 29 2020 02:06:04 GMT+0000 (UTC) 02:04:49
3503.25 none succeeded 1574/1584 N/A N/A Fri May 29 2020 02:06:04 GMT+0000 (UTC) 02:15:17
3503.26 none timeout 0/0 N/A N/A Fri May 29 2020 02:06:04 GMT+0000 (UTC) 02:22:34
3503.27 none succeeded 991/1584 N/A N/A Fri May 29 2020 02:06:04 GMT+0000 (UTC) 01:83:97
3503.28 none succeeded 1355/1584 N/A N/A Fri May 29 2020 02:06:04 GMT+0000 (UTC) 02:97:24
3503.29 none succeeded 1299/1584 N/A N/A Fri May 29 2020 02:06:04 GMT+0000 (UTC) 02:95:15
3503.30 none succeeded 1576/1584 N/A N/A Fri May 29 2020 02:06:04 GMT+0000 (UTC) 02:06:58
3503.31 none succeeded 1575/1584 N/A N/A Fri May 29 2020 02:06:04 GMT+0000 (UTC) 02:15:23
3503.32 none timeout 0/0 N/A N/A Fri May 29 2020 02:06:04 GMT+0000 (UTC) 02:23:73
3503.33 none timeout 0/0 N/A N/A Fri May 29 2020 02:06:04 GMT+0000 (UTC) 02:20:10
3503.34 none succeeded 1575/1584 N/A N/A Fri May 29 2020 02:06:04 GMT+0000 (UTC) 02:02:35
3503.35 none succeeded 1584/1584 N/A N/A Fri May 29 2020 02:06:04 GMT+0000 (UTC) 02:98:50


Need help with Shippable? File an Issue


[ master ] Build UNSTABLE for zephyrproject-rtos/test_results ( tests: reel board test results Testing CI system, run tests on hardware reel board v1 Signed-off-by: Maksim Masalski <maksim.masalski@intel.com> ) on Shippable.com #builds

Shippable.com <noreply@...>
 

SHIPPABLE BUILD REPORT

71
test_results
Branch : master Sha : a145b3b290
Builder : Maksim Masalski Triggered By : Anas Nashif
Custom Environment Variables:
JOB_TRIGGERED_BY_NAME="create_test_commit"
JOB_TRIGGERED_BY_ID="125148"
# Runtime Status Tests Branch Coverage Sequence Coverage Triggered at Duration
71.1 none succeeded 838/971 N/A N/A Thu May 28 2020 04:07:01 GMT+0000 (UTC) 01:48:51
71.2 none unstable 1654/2272 N/A N/A Thu May 28 2020 04:07:01 GMT+0000 (UTC) 01:55:15
71.3 none succeeded 2864/4774 N/A N/A Thu May 28 2020 04:07:01 GMT+0000 (UTC) 01:66:54
71.4 none unstable 5552/6102 N/A N/A Thu May 28 2020 04:07:01 GMT+0000 (UTC) 01:78:72
71.5 none unstable 5895/5941 N/A N/A Thu May 28 2020 04:07:01 GMT+0000 (UTC) 01:87:98


Need help with Shippable? File an Issue


[ master ] Build TIMEOUT for zephyrproject-rtos/ci-test ( ci: Update sdk to 0.11.3 Update sdk to 0.11.3 release and update docker image to get that SDK version. Signed-off-by: Kumar Gala <kumar.gala@linaro.org> ) on Shippable.com #builds

Shippable.com <noreply@...>
 

SHIPPABLE BUILD REPORT

3502
ci-test
Branch : master Sha : 5f9e0cfc3c
Builder : Kumar Gala Triggered By : Kumar Gala
Custom Environment Variables:
JOB_TRIGGERED_BY_NAME="daily-verify"
JOB_TRIGGERED_BY_ID="23790"
# Runtime Status Tests Branch Coverage Sequence Coverage Triggered at Duration
3502.1 none succeeded 1367/1585 N/A N/A Thu May 28 2020 02:05:24 GMT+0000 (UTC) 01:89:43
3502.2 none succeeded 912/1585 N/A N/A Thu May 28 2020 02:05:24 GMT+0000 (UTC) 01:74:17
3502.3 none timeout 0/0 N/A N/A Thu May 28 2020 02:05:24 GMT+0000 (UTC) 02:22:06
3502.4 none timeout 0/0 N/A N/A Thu May 28 2020 02:05:24 GMT+0000 (UTC) 02:22:06
3502.5 none succeeded 1578/1585 N/A N/A Thu May 28 2020 02:05:24 GMT+0000 (UTC) 02:97:25
3502.6 none succeeded 1583/1585 N/A N/A Thu May 28 2020 02:05:24 GMT+0000 (UTC) 02:05:02
3502.7 none succeeded 1186/1585 N/A N/A Thu May 28 2020 02:05:24 GMT+0000 (UTC) 02:00:06
3502.8 none succeeded 787/1585 N/A N/A Thu May 28 2020 02:05:24 GMT+0000 (UTC) 01:65:25
3502.9 none succeeded 1344/1585 N/A N/A Thu May 28 2020 02:05:25 GMT+0000 (UTC) 02:99:23
3502.10 none succeeded 1400/1585 N/A N/A Thu May 28 2020 02:05:25 GMT+0000 (UTC) 02:03:07
3502.11 none succeeded 1452/1585 N/A N/A Thu May 28 2020 02:05:25 GMT+0000 (UTC) 02:08:56
3502.12 none succeeded 1432/1585 N/A N/A Thu May 28 2020 02:05:25 GMT+0000 (UTC) 02:12:33
3502.13 none succeeded 1283/1585 N/A N/A Thu May 28 2020 02:05:25 GMT+0000 (UTC) 01:88:58
3502.14 none succeeded 1177/1585 N/A N/A Thu May 28 2020 02:05:25 GMT+0000 (UTC) 02:99:42
3502.15 none succeeded 1044/1585 N/A N/A Thu May 28 2020 02:05:25 GMT+0000 (UTC) 01:89:13
3502.16 none succeeded 1274/1585 N/A N/A Thu May 28 2020 02:05:25 GMT+0000 (UTC) 02:94:61
3502.17 none succeeded 1095/1585 N/A N/A Thu May 28 2020 02:05:25 GMT+0000 (UTC) 02:93:91
3502.18 none succeeded 1540/1585 N/A N/A Thu May 28 2020 02:05:25 GMT+0000 (UTC) 02:03:82
3502.19 none succeeded 1082/1585 N/A N/A Thu May 28 2020 02:05:25 GMT+0000 (UTC) 01:82:94
3502.20 none succeeded 1585/1585 N/A N/A Thu May 28 2020 02:05:25 GMT+0000 (UTC) 02:00:98
3502.21 none succeeded 1533/1585 N/A N/A Thu May 28 2020 02:05:25 GMT+0000 (UTC) 02:08:98
3502.22 none succeeded 1089/1584 N/A N/A Thu May 28 2020 02:05:25 GMT+0000 (UTC) 02:92:19
3502.23 none succeeded 1254/1584 N/A N/A Thu May 28 2020 02:05:25 GMT+0000 (UTC) 02:95:26
3502.24 none succeeded 1263/1584 N/A N/A Thu May 28 2020 02:05:25 GMT+0000 (UTC) 02:95:04
3502.25 none succeeded 1574/1584 N/A N/A Thu May 28 2020 02:05:25 GMT+0000 (UTC) 02:19:19
3502.26 none timeout 0/0 N/A N/A Thu May 28 2020 02:05:25 GMT+0000 (UTC) 02:22:95
3502.27 none succeeded 991/1584 N/A N/A Thu May 28 2020 02:05:26 GMT+0000 (UTC) 01:86:59
3502.28 none succeeded 1355/1584 N/A N/A Thu May 28 2020 02:05:26 GMT+0000 (UTC) 02:03:76
3502.29 none succeeded 1301/1584 N/A N/A Thu May 28 2020 02:05:26 GMT+0000 (UTC) 02:93:98
3502.30 none succeeded 1574/1584 N/A N/A Thu May 28 2020 02:05:26 GMT+0000 (UTC) 02:10:95
3502.31 none succeeded 1575/1584 N/A N/A Thu May 28 2020 02:05:26 GMT+0000 (UTC) 02:07:24
3502.32 none timeout 0/0 N/A N/A Thu May 28 2020 02:05:26 GMT+0000 (UTC) 02:23:84
3502.33 none timeout 0/0 N/A N/A Thu May 28 2020 02:05:26 GMT+0000 (UTC) 02:20:01
3502.34 none succeeded 1575/1584 N/A N/A Thu May 28 2020 02:05:26 GMT+0000 (UTC) 02:02:22
3502.35 none succeeded 1584/1584 N/A N/A Thu May 28 2020 02:05:26 GMT+0000 (UTC) 02:97:49


Need help with Shippable? File an Issue


[ master ] Build FAILED for zephyrproject-rtos/test_results ( tests: reel board test results Testing CI system, run tests on hardware reel board v1 Signed-off-by: Maksim Masalski <maksim.masalski@intel.com> ) on Shippable.com #builds

Shippable.com <noreply@...>
 

SHIPPABLE BUILD REPORT

70
test_results
Branch : master Sha : a145b3b290
Builder : Maksim Masalski Triggered By : Anas Nashif
Custom Environment Variables:
JOB_TRIGGERED_BY_NAME="create_test_commit"
JOB_TRIGGERED_BY_ID="125148"
# Runtime Status Tests Branch Coverage Sequence Coverage Triggered at Duration
70.1 none succeeded 833/974 N/A N/A Wed May 27 2020 04:07:39 GMT+0000 (UTC) 01:48:02
70.2 none unstable 1653/2270 N/A N/A Wed May 27 2020 04:07:39 GMT+0000 (UTC) 01:55:21
70.3 none unstable 2869/4758 N/A N/A Wed May 27 2020 04:07:39 GMT+0000 (UTC) 01:66:89
70.4 none failed 5547/6095 N/A N/A Wed May 27 2020 04:07:39 GMT+0000 (UTC) 04:69:12
70.5 none unstable 5889/5935 N/A N/A Wed May 27 2020 04:07:39 GMT+0000 (UTC) 01:86:56


Need help with Shippable? File an Issue


[ master ] Build TIMEOUT for zephyrproject-rtos/ci-test ( ci: Update sdk to 0.11.3 Update sdk to 0.11.3 release and update docker image to get that SDK version. Signed-off-by: Kumar Gala <kumar.gala@linaro.org> ) on Shippable.com #builds

Shippable.com <noreply@...>
 

SHIPPABLE BUILD REPORT

3501
ci-test
Branch : master Sha : 5f9e0cfc3c
Builder : Kumar Gala Triggered By : Kumar Gala
Custom Environment Variables:
JOB_TRIGGERED_BY_NAME="daily-verify"
JOB_TRIGGERED_BY_ID="23790"
# Runtime Status Tests Branch Coverage Sequence Coverage Triggered at Duration
3501.1 none succeeded 1362/1580 N/A N/A Wed May 27 2020 02:06:04 GMT+0000 (UTC) 01:85:73
3501.2 none succeeded 917/1580 N/A N/A Wed May 27 2020 02:06:04 GMT+0000 (UTC) 01:68:91
3501.3 none timeout 0/0 N/A N/A Wed May 27 2020 02:06:04 GMT+0000 (UTC) 02:21:48
3501.4 none timeout 0/0 N/A N/A Wed May 27 2020 02:06:04 GMT+0000 (UTC) 02:21:47
3501.5 none succeeded 1574/1580 N/A N/A Wed May 27 2020 02:06:04 GMT+0000 (UTC) 02:95:92
3501.6 none succeeded 1578/1580 N/A N/A Wed May 27 2020 02:06:04 GMT+0000 (UTC) 02:07:93
3501.7 none succeeded 1042/1580 N/A N/A Wed May 27 2020 02:06:04 GMT+0000 (UTC) 01:89:55
3501.8 none succeeded 910/1580 N/A N/A Wed May 27 2020 02:06:04 GMT+0000 (UTC) 01:71:85
3501.9 none succeeded 1344/1580 N/A N/A Wed May 27 2020 02:06:05 GMT+0000 (UTC) 02:00:83
3501.10 none succeeded 1351/1580 N/A N/A Wed May 27 2020 02:06:05 GMT+0000 (UTC) 02:03:98
3501.11 none succeeded 1493/1580 N/A N/A Wed May 27 2020 02:06:05 GMT+0000 (UTC) 02:09:31
3501.12 none succeeded 1427/1580 N/A N/A Wed May 27 2020 02:06:05 GMT+0000 (UTC) 02:11:64
3501.13 none succeeded 1237/1580 N/A N/A Wed May 27 2020 02:06:05 GMT+0000 (UTC) 01:86:64
3501.14 none succeeded 1217/1580 N/A N/A Wed May 27 2020 02:06:05 GMT+0000 (UTC) 02:08:99
3501.15 none succeeded 1001/1580 N/A N/A Wed May 27 2020 02:06:05 GMT+0000 (UTC) 01:81:84
3501.16 none succeeded 1307/1580 N/A N/A Wed May 27 2020 02:06:05 GMT+0000 (UTC) 02:96:87
3501.17 none succeeded 1051/1580 N/A N/A Wed May 27 2020 02:06:05 GMT+0000 (UTC) 01:88:78
3501.18 none succeeded 1574/1580 N/A N/A Wed May 27 2020 02:06:05 GMT+0000 (UTC) 02:01:49
3501.19 none succeeded 1077/1580 N/A N/A Wed May 27 2020 02:06:05 GMT+0000 (UTC) 01:80:21
3501.20 none succeeded 1580/1580 N/A N/A Wed May 27 2020 02:06:05 GMT+0000 (UTC) 02:03:52
3501.21 none succeeded 1500/1580 N/A N/A Wed May 27 2020 02:06:05 GMT+0000 (UTC) 02:08:54
3501.22 none succeeded 1112/1579 N/A N/A Wed May 27 2020 02:06:05 GMT+0000 (UTC) 02:00:20
3501.23 none succeeded 1252/1579 N/A N/A Wed May 27 2020 02:06:05 GMT+0000 (UTC) 02:97:15
3501.24 none succeeded 1258/1579 N/A N/A Wed May 27 2020 02:06:05 GMT+0000 (UTC) 02:95:27
3501.25 none timeout 1568/1579 N/A N/A Wed May 27 2020 02:06:05 GMT+0000 (UTC) 02:21:35
3501.26 none timeout 1564/1579 N/A N/A Wed May 27 2020 02:06:05 GMT+0000 (UTC) 02:21:35
3501.27 none succeeded 986/1579 N/A N/A Wed May 27 2020 02:06:05 GMT+0000 (UTC) 01:84:57
3501.28 none succeeded 1350/1579 N/A N/A Wed May 27 2020 02:06:06 GMT+0000 (UTC) 02:03:57
3501.29 none succeeded 1294/1579 N/A N/A Wed May 27 2020 02:06:06 GMT+0000 (UTC) 02:92:31
3501.30 none succeeded 1571/1579 N/A N/A Wed May 27 2020 02:06:06 GMT+0000 (UTC) 02:06:87
3501.31 none succeeded 1570/1579 N/A N/A Wed May 27 2020 02:06:06 GMT+0000 (UTC) 02:06:46
3501.32 none timeout 0/0 N/A N/A Wed May 27 2020 02:06:06 GMT+0000 (UTC) 02:24:59
3501.33 none timeout 0/0 N/A N/A Wed May 27 2020 02:06:06 GMT+0000 (UTC) 02:20:18
3501.34 none succeeded 1570/1579 N/A N/A Wed May 27 2020 02:06:06 GMT+0000 (UTC) 02:01:36
3501.35 none succeeded 1579/1579 N/A N/A Wed May 27 2020 02:06:06 GMT+0000 (UTC) 02:97:07


Need help with Shippable? File an Issue


[ master ] Build FAILED for zephyrproject-rtos/test_results ( tests: reel board test results Testing CI system, run tests on hardware reel board v1 Signed-off-by: Maksim Masalski <maksim.masalski@intel.com> ) on Shippable.com #builds

Shippable.com <noreply@...>
 

SHIPPABLE BUILD REPORT

69
test_results
Branch : master Sha : a145b3b290
Builder : Maksim Masalski Triggered By : Anas Nashif
Custom Environment Variables:
JOB_TRIGGERED_BY_NAME="create_test_commit"
JOB_TRIGGERED_BY_ID="125148"
# Runtime Status Tests Branch Coverage Sequence Coverage Triggered at Duration
69.1 none succeeded 833/972 N/A N/A Tue May 26 2020 04:07:13 GMT+0000 (UTC) 01:49:69
69.2 none unstable 1653/2270 N/A N/A Tue May 26 2020 04:07:13 GMT+0000 (UTC) 01:56:73
69.3 none failed 2858/4751 N/A N/A Tue May 26 2020 04:07:13 GMT+0000 (UTC) 04:29:22
69.4 none unstable 5545/6095 N/A N/A Tue May 26 2020 04:07:13 GMT+0000 (UTC) 01:79:58
69.5 none unstable 5881/5925 N/A N/A Tue May 26 2020 04:07:13 GMT+0000 (UTC) 01:86:55


Need help with Shippable? File an Issue


[ master ] Build TIMEOUT for zephyrproject-rtos/ci-test ( ci: Update sdk to 0.11.3 Update sdk to 0.11.3 release and update docker image to get that SDK version. Signed-off-by: Kumar Gala <kumar.gala@linaro.org> ) on Shippable.com #builds

Shippable.com <noreply@...>
 

SHIPPABLE BUILD REPORT

3500
ci-test
Branch : master Sha : 5f9e0cfc3c
Builder : Kumar Gala Triggered By : Kumar Gala
Custom Environment Variables:
JOB_TRIGGERED_BY_NAME="daily-verify"
JOB_TRIGGERED_BY_ID="23790"
# Runtime Status Tests Branch Coverage Sequence Coverage Triggered at Duration
3500.1 none succeeded 1362/1580 N/A N/A Tue May 26 2020 02:05:43 GMT+0000 (UTC) 02:95:02
3500.2 none succeeded 917/1580 N/A N/A Tue May 26 2020 02:05:43 GMT+0000 (UTC) 01:74:62
3500.3 none timeout 0/0 N/A N/A Tue May 26 2020 02:05:43 GMT+0000 (UTC) 02:21:38
3500.4 none timeout 0/0 N/A N/A Tue May 26 2020 02:05:43 GMT+0000 (UTC) 02:21:38
3500.5 none succeeded 1574/1580 N/A N/A Tue May 26 2020 02:05:43 GMT+0000 (UTC) 02:97:41
3500.6 none succeeded 1578/1580 N/A N/A Tue May 26 2020 02:05:43 GMT+0000 (UTC) 02:06:69
3500.7 none succeeded 1042/1580 N/A N/A Tue May 26 2020 02:05:43 GMT+0000 (UTC) 01:89:48
3500.8 none succeeded 910/1580 N/A N/A Tue May 26 2020 02:05:43 GMT+0000 (UTC) 01:71:59
3500.9 none succeeded 1344/1580 N/A N/A Tue May 26 2020 02:05:43 GMT+0000 (UTC) 02:98:54
3500.10 none succeeded 1351/1580 N/A N/A Tue May 26 2020 02:05:43 GMT+0000 (UTC) 02:02:46
3500.11 none succeeded 1493/1580 N/A N/A Tue May 26 2020 02:05:43 GMT+0000 (UTC) 02:11:32
3500.12 none succeeded 1427/1580 N/A N/A Tue May 26 2020 02:05:43 GMT+0000 (UTC) 02:11:66
3500.13 none succeeded 1237/1580 N/A N/A Tue May 26 2020 02:05:43 GMT+0000 (UTC) 02:93:55
3500.14 none succeeded 1217/1580 N/A N/A Tue May 26 2020 02:05:43 GMT+0000 (UTC) 02:04:27
3500.15 none succeeded 1001/1580 N/A N/A Tue May 26 2020 02:05:43 GMT+0000 (UTC) 01:83:54
3500.16 none succeeded 1307/1580 N/A N/A Tue May 26 2020 02:05:43 GMT+0000 (UTC) 02:96:58
3500.17 none succeeded 1051/1580 N/A N/A Tue May 26 2020 02:05:44 GMT+0000 (UTC) 01:88:03
3500.18 none succeeded 1574/1580 N/A N/A Tue May 26 2020 02:05:44 GMT+0000 (UTC) 02:00:11
3500.19 none succeeded 1076/1579 N/A N/A Tue May 26 2020 02:05:44 GMT+0000 (UTC) 01:80:99
3500.20 none succeeded 1579/1579 N/A N/A Tue May 26 2020 02:05:44 GMT+0000 (UTC) 02:01:89
3500.21 none succeeded 1501/1579 N/A N/A Tue May 26 2020 02:05:44 GMT+0000 (UTC) 02:06:35
3500.22 none succeeded 1110/1579 N/A N/A Tue May 26 2020 02:05:44 GMT+0000 (UTC) 02:93:61
3500.23 none succeeded 1252/1579 N/A N/A Tue May 26 2020 02:05:44 GMT+0000 (UTC) 02:00:82
3500.24 none succeeded 1258/1579 N/A N/A Tue May 26 2020 02:05:44 GMT+0000 (UTC) 02:96:68
3500.25 none succeeded 1568/1579 N/A N/A Tue May 26 2020 02:05:44 GMT+0000 (UTC) 02:18:08
3500.26 none succeeded 1564/1579 N/A N/A Tue May 26 2020 02:05:44 GMT+0000 (UTC) 02:20:08
3500.27 none succeeded 986/1579 N/A N/A Tue May 26 2020 02:05:44 GMT+0000 (UTC) 01:82:94
3500.28 none succeeded 1350/1579 N/A N/A Tue May 26 2020 02:05:44 GMT+0000 (UTC) 02:00:73
3500.29 none succeeded 1294/1579 N/A N/A Tue May 26 2020 02:05:44 GMT+0000 (UTC) 02:91:53
3500.30 none succeeded 1571/1579 N/A N/A Tue May 26 2020 02:05:44 GMT+0000 (UTC) 02:08:99
3500.31 none succeeded 1570/1579 N/A N/A Tue May 26 2020 02:05:44 GMT+0000 (UTC) 02:06:61
3500.32 none timeout 0/0 N/A N/A Tue May 26 2020 02:05:44 GMT+0000 (UTC) 02:21:77
3500.33 none timeout 0/0 N/A N/A Tue May 26 2020 02:05:45 GMT+0000 (UTC) 02:21:31
3500.34 none succeeded 1570/1579 N/A N/A Tue May 26 2020 02:05:45 GMT+0000 (UTC) 02:01:83
3500.35 none succeeded 1579/1579 N/A N/A Tue May 26 2020 02:05:45 GMT+0000 (UTC) 02:97:45


Need help with Shippable? File an Issue


[ master ] Build UNSTABLE for zephyrproject-rtos/test_results ( tests: reel board test results Testing CI system, run tests on hardware reel board v1 Signed-off-by: Maksim Masalski <maksim.masalski@intel.com> ) on Shippable.com #builds

Shippable.com <noreply@...>
 

SHIPPABLE BUILD REPORT

68
test_results
Branch : master Sha : a145b3b290
Builder : Maksim Masalski Triggered By : Anas Nashif
Custom Environment Variables:
JOB_TRIGGERED_BY_NAME="create_test_commit"
JOB_TRIGGERED_BY_ID="125148"
# Runtime Status Tests Branch Coverage Sequence Coverage Triggered at Duration
68.1 none succeeded 833/902 N/A N/A Mon May 25 2020 04:06:12 GMT+0000 (UTC) 01:49:29
68.2 none unstable 1652/1840 N/A N/A Mon May 25 2020 04:06:12 GMT+0000 (UTC) 01:55:28
68.3 none unstable 2800/3091 N/A N/A Mon May 25 2020 04:06:13 GMT+0000 (UTC) 01:67:13
68.4 none unstable 5543/5891 N/A N/A Mon May 25 2020 04:06:13 GMT+0000 (UTC) 01:79:46
68.5 none succeeded 5927/5968 N/A N/A Mon May 25 2020 04:06:13 GMT+0000 (UTC) 01:85:25


Need help with Shippable? File an Issue


[ master ] Build TIMEOUT for zephyrproject-rtos/ci-test ( ci: Update sdk to 0.11.3 Update sdk to 0.11.3 release and update docker image to get that SDK version. Signed-off-by: Kumar Gala <kumar.gala@linaro.org> ) on Shippable.com #builds

Shippable.com <noreply@...>
 

SHIPPABLE BUILD REPORT

3499
ci-test
Branch : master Sha : 5f9e0cfc3c
Builder : Kumar Gala Triggered By : Kumar Gala
Custom Environment Variables:
JOB_TRIGGERED_BY_NAME="daily-verify"
JOB_TRIGGERED_BY_ID="23790"
# Runtime Status Tests Branch Coverage Sequence Coverage Triggered at Duration
3499.1 none succeeded 1355/1573 N/A N/A Mon May 25 2020 02:05:34 GMT+0000 (UTC) 01:86:56
3499.2 none succeeded 924/1573 N/A N/A Mon May 25 2020 02:05:34 GMT+0000 (UTC) 01:74:30
3499.3 none timeout 0/0 N/A N/A Mon May 25 2020 02:05:34 GMT+0000 (UTC) 02:20:24
3499.4 none timeout 0/0 N/A N/A Mon May 25 2020 02:05:35 GMT+0000 (UTC) 02:20:23
3499.5 none succeeded 1567/1573 N/A N/A Mon May 25 2020 02:05:35 GMT+0000 (UTC) 02:96:75
3499.6 none succeeded 1571/1573 N/A N/A Mon May 25 2020 02:05:35 GMT+0000 (UTC) 02:12:01
3499.7 none succeeded 1083/1573 N/A N/A Mon May 25 2020 02:05:35 GMT+0000 (UTC) 02:92:13
3499.8 none succeeded 861/1573 N/A N/A Mon May 25 2020 02:05:35 GMT+0000 (UTC) 01:69:55
3499.9 none succeeded 1333/1573 N/A N/A Mon May 25 2020 02:05:35 GMT+0000 (UTC) 02:97:39
3499.10 none succeeded 1371/1573 N/A N/A Mon May 25 2020 02:05:35 GMT+0000 (UTC) 02:03:98
3499.11 none succeeded 1459/1573 N/A N/A Mon May 25 2020 02:05:35 GMT+0000 (UTC) 02:07:17
3499.12 none succeeded 1421/1573 N/A N/A Mon May 25 2020 02:05:35 GMT+0000 (UTC) 02:14:57
3499.13 none succeeded 1267/1573 N/A N/A Mon May 25 2020 02:05:35 GMT+0000 (UTC) 01:86:55
3499.14 none succeeded 1170/1573 N/A N/A Mon May 25 2020 02:05:35 GMT+0000 (UTC) 02:06:44
3499.15 none succeeded 1036/1573 N/A N/A Mon May 25 2020 02:05:35 GMT+0000 (UTC) 01:88:51
3499.16 none succeeded 1258/1573 N/A N/A Mon May 25 2020 02:05:35 GMT+0000 (UTC) 01:90:78
3499.17 none succeeded 1099/1573 N/A N/A Mon May 25 2020 02:05:35 GMT+0000 (UTC) 02:94:43
3499.18 none succeeded 1512/1573 N/A N/A Mon May 25 2020 02:05:35 GMT+0000 (UTC) 02:97:32
3499.19 none succeeded 1070/1573 N/A N/A Mon May 25 2020 02:05:35 GMT+0000 (UTC) 01:80:23
3499.20 none succeeded 1573/1573 N/A N/A Mon May 25 2020 02:05:35 GMT+0000 (UTC) 02:00:85
3499.21 none succeeded 1545/1573 N/A N/A Mon May 25 2020 02:05:36 GMT+0000 (UTC) 02:04:62
3499.22 none succeeded 1054/1573 N/A N/A Mon May 25 2020 02:05:36 GMT+0000 (UTC) 02:91:56
3499.23 none succeeded 1246/1573 N/A N/A Mon May 25 2020 02:05:36 GMT+0000 (UTC) 02:90:19
3499.24 none succeeded 1252/1573 N/A N/A Mon May 25 2020 02:05:36 GMT+0000 (UTC) 02:95:71
3499.25 none succeeded 1562/1572 N/A N/A Mon May 25 2020 02:05:36 GMT+0000 (UTC) 02:16:46
3499.26 none succeeded 1558/1572 N/A N/A Mon May 25 2020 02:05:36 GMT+0000 (UTC) 02:15:15
3499.27 none succeeded 977/1572 N/A N/A Mon May 25 2020 02:05:36 GMT+0000 (UTC) 01:85:03
3499.28 none succeeded 1343/1572 N/A N/A Mon May 25 2020 02:05:36 GMT+0000 (UTC) 02:94:41
3499.29 none succeeded 1292/1572 N/A N/A Mon May 25 2020 02:05:36 GMT+0000 (UTC) 02:91:33
3499.30 none succeeded 1562/1572 N/A N/A Mon May 25 2020 02:05:36 GMT+0000 (UTC) 02:04:40
3499.31 none succeeded 1560/1572 N/A N/A Mon May 25 2020 02:05:36 GMT+0000 (UTC) 02:00:07
3499.32 none timeout 0/0 N/A N/A Mon May 25 2020 02:05:36 GMT+0000 (UTC) 02:22:94
3499.33 none timeout 0/0 N/A N/A Mon May 25 2020 02:05:36 GMT+0000 (UTC) 02:25:87
3499.34 none succeeded 1565/1572 N/A N/A Mon May 25 2020 02:05:36 GMT+0000 (UTC) 02:97:48
3499.35 none succeeded 1572/1572 N/A N/A Mon May 25 2020 02:05:36 GMT+0000 (UTC) 02:98:81


Need help with Shippable? File an Issue


[ master ] Build UNSTABLE for zephyrproject-rtos/test_results ( tests: reel board test results Testing CI system, run tests on hardware reel board v1 Signed-off-by: Maksim Masalski <maksim.masalski@intel.com> ) on Shippable.com #builds

Shippable.com <noreply@...>
 

SHIPPABLE BUILD REPORT

67
test_results
Branch : master Sha : a145b3b290
Builder : Maksim Masalski Triggered By : Anas Nashif
Custom Environment Variables:
JOB_TRIGGERED_BY_NAME="create_test_commit"
JOB_TRIGGERED_BY_ID="125148"
# Runtime Status Tests Branch Coverage Sequence Coverage Triggered at Duration
67.1 none succeeded 833/902 N/A N/A Sun May 24 2020 04:07:17 GMT+0000 (UTC) 01:48:89
67.2 none unstable 1651/1840 N/A N/A Sun May 24 2020 04:07:17 GMT+0000 (UTC) 01:56:35
67.3 none unstable 2798/3091 N/A N/A Sun May 24 2020 04:07:17 GMT+0000 (UTC) 01:67:04
67.4 none unstable 5543/5891 N/A N/A Sun May 24 2020 04:07:17 GMT+0000 (UTC) 01:78:08
67.5 none unstable 5918/5967 N/A N/A Sun May 24 2020 04:07:18 GMT+0000 (UTC) 01:88:64


Need help with Shippable? File an Issue


[ master ] Build TIMEOUT for zephyrproject-rtos/ci-test ( ci: Update sdk to 0.11.3 Update sdk to 0.11.3 release and update docker image to get that SDK version. Signed-off-by: Kumar Gala <kumar.gala@linaro.org> ) on Shippable.com #builds

Shippable.com <noreply@...>
 

SHIPPABLE BUILD REPORT

3498
ci-test
Branch : master Sha : 5f9e0cfc3c
Builder : Kumar Gala Triggered By : Kumar Gala
Custom Environment Variables:
JOB_TRIGGERED_BY_NAME="daily-verify"
JOB_TRIGGERED_BY_ID="23790"
# Runtime Status Tests Branch Coverage Sequence Coverage Triggered at Duration
3498.1 none succeeded 1354/1572 N/A N/A Sun May 24 2020 02:05:52 GMT+0000 (UTC) 01:89:25
3498.2 none succeeded 925/1572 N/A N/A Sun May 24 2020 02:05:53 GMT+0000 (UTC) 01:74:63
3498.3 none timeout 0/0 N/A N/A Sun May 24 2020 02:05:53 GMT+0000 (UTC) 02:25:82
3498.4 none timeout 0/0 N/A N/A Sun May 24 2020 02:05:53 GMT+0000 (UTC) 02:25:82
3498.5 none succeeded 1566/1572 N/A N/A Sun May 24 2020 02:05:53 GMT+0000 (UTC) 01:85:76
3498.6 none succeeded 1570/1572 N/A N/A Sun May 24 2020 02:05:53 GMT+0000 (UTC) 02:06:50
3498.7 none succeeded 1089/1572 N/A N/A Sun May 24 2020 02:05:53 GMT+0000 (UTC) 02:93:65
3498.8 none succeeded 853/1572 N/A N/A Sun May 24 2020 02:05:53 GMT+0000 (UTC) 01:69:25
3498.9 none succeeded 1332/1572 N/A N/A Sun May 24 2020 02:05:53 GMT+0000 (UTC) 02:98:65
3498.10 none succeeded 1378/1572 N/A N/A Sun May 24 2020 02:05:53 GMT+0000 (UTC) 02:01:76
3498.11 none succeeded 1451/1572 N/A N/A Sun May 24 2020 02:05:53 GMT+0000 (UTC) 02:05:18
3498.12 none succeeded 1420/1572 N/A N/A Sun May 24 2020 02:05:53 GMT+0000 (UTC) 02:12:50
3498.13 none succeeded 1268/1572 N/A N/A Sun May 24 2020 02:05:53 GMT+0000 (UTC) 01:85:85
3498.14 none succeeded 1166/1572 N/A N/A Sun May 24 2020 02:05:53 GMT+0000 (UTC) 02:98:04
3498.15 none succeeded 1056/1572 N/A N/A Sun May 24 2020 02:05:53 GMT+0000 (UTC) 01:90:87
3498.16 none succeeded 1278/1572 N/A N/A Sun May 24 2020 02:05:53 GMT+0000 (UTC) 01:90:93
3498.17 none succeeded 1083/1572 N/A N/A Sun May 24 2020 02:05:53 GMT+0000 (UTC) 02:91:82
3498.18 none succeeded 1525/1571 N/A N/A Sun May 24 2020 02:05:53 GMT+0000 (UTC) 02:99:11
3498.19 none succeeded 1068/1571 N/A N/A Sun May 24 2020 02:05:53 GMT+0000 (UTC) 01:84:64
3498.20 none succeeded 1571/1571 N/A N/A Sun May 24 2020 02:05:54 GMT+0000 (UTC) 02:00:81
3498.21 none succeeded 1536/1571 N/A N/A Sun May 24 2020 02:05:54 GMT+0000 (UTC) 02:05:16
3498.22 none succeeded 1059/1571 N/A N/A Sun May 24 2020 02:05:54 GMT+0000 (UTC) 02:92:19
3498.23 none succeeded 1244/1571 N/A N/A Sun May 24 2020 02:05:54 GMT+0000 (UTC) 02:94:24
3498.24 none succeeded 1250/1571 N/A N/A Sun May 24 2020 02:05:54 GMT+0000 (UTC) 02:97:94
3498.25 none succeeded 1561/1571 N/A N/A Sun May 24 2020 02:05:54 GMT+0000 (UTC) 02:15:28
3498.26 none succeeded 1557/1571 N/A N/A Sun May 24 2020 02:05:54 GMT+0000 (UTC) 02:20:93
3498.27 none succeeded 976/1571 N/A N/A Sun May 24 2020 02:05:54 GMT+0000 (UTC) 01:89:46
3498.28 none succeeded 1342/1571 N/A N/A Sun May 24 2020 02:05:54 GMT+0000 (UTC) 02:99:45
3498.29 none succeeded 1291/1571 N/A N/A Sun May 24 2020 02:05:54 GMT+0000 (UTC) 02:97:12
3498.30 none succeeded 1561/1571 N/A N/A Sun May 24 2020 02:05:54 GMT+0000 (UTC) 02:08:05
3498.31 none succeeded 1559/1571 N/A N/A Sun May 24 2020 02:05:54 GMT+0000 (UTC) 02:00:97
3498.32 none timeout 0/0 N/A N/A Sun May 24 2020 02:05:54 GMT+0000 (UTC) 02:20:20
3498.33 none timeout 0/0 N/A N/A Sun May 24 2020 02:05:54 GMT+0000 (UTC) 02:20:09
3498.34 none succeeded 1564/1571 N/A N/A Sun May 24 2020 02:05:54 GMT+0000 (UTC) 02:91:39
3498.35 none succeeded 1571/1571 N/A N/A Sun May 24 2020 02:05:54 GMT+0000 (UTC) 02:95:77


Need help with Shippable? File an Issue


[ master ] Build FAILED for zephyrproject-rtos/test_results ( tests: reel board test results Testing CI system, run tests on hardware reel board v1 Signed-off-by: Maksim Masalski <maksim.masalski@intel.com> ) on Shippable.com #builds

Shippable.com <noreply@...>
 

SHIPPABLE BUILD REPORT

66
test_results
Branch : master Sha : a145b3b290
Builder : Maksim Masalski Triggered By : Anas Nashif
Custom Environment Variables:
JOB_TRIGGERED_BY_NAME="create_test_commit"
JOB_TRIGGERED_BY_ID="125148"
# Runtime Status Tests Branch Coverage Sequence Coverage Triggered at Duration
66.1 none succeeded 833/902 N/A N/A Sat May 23 2020 04:06:43 GMT+0000 (UTC) 01:48:65
66.2 none unstable 1652/1840 N/A N/A Sat May 23 2020 04:06:43 GMT+0000 (UTC) 01:55:07
66.3 none failed 2799/3091 N/A N/A Sat May 23 2020 04:06:43 GMT+0000 (UTC) 04:24:63
66.4 none unstable 5539/5888 N/A N/A Sat May 23 2020 04:06:44 GMT+0000 (UTC) 01:78:85
66.5 none unstable 5926/5968 N/A N/A Sat May 23 2020 04:06:44 GMT+0000 (UTC) 01:86:45


Need help with Shippable? File an Issue


[ master ] Build TIMEOUT for zephyrproject-rtos/ci-test ( ci: Update sdk to 0.11.3 Update sdk to 0.11.3 release and update docker image to get that SDK version. Signed-off-by: Kumar Gala <kumar.gala@linaro.org> ) on Shippable.com #builds

Shippable.com <noreply@...>
 

SHIPPABLE BUILD REPORT

3497
ci-test
Branch : master Sha : 5f9e0cfc3c
Builder : Kumar Gala Triggered By : Kumar Gala
Custom Environment Variables:
JOB_TRIGGERED_BY_NAME="daily-verify"
JOB_TRIGGERED_BY_ID="23790"
# Runtime Status Tests Branch Coverage Sequence Coverage Triggered at Duration
3497.1 none succeeded 1354/1572 N/A N/A Sat May 23 2020 02:05:14 GMT+0000 (UTC) 01:89:40
3497.2 none succeeded 925/1572 N/A N/A Sat May 23 2020 02:05:14 GMT+0000 (UTC) 01:74:64
3497.3 none timeout 0/0 N/A N/A Sat May 23 2020 02:05:14 GMT+0000 (UTC) 02:25:99
3497.4 none timeout 0/0 N/A N/A Sat May 23 2020 02:05:15 GMT+0000 (UTC) 02:25:98
3497.5 none succeeded 1566/1572 N/A N/A Sat May 23 2020 02:05:15 GMT+0000 (UTC) 02:95:01
3497.6 none succeeded 1570/1572 N/A N/A Sat May 23 2020 02:05:15 GMT+0000 (UTC) 02:06:54
3497.7 none succeeded 1089/1572 N/A N/A Sat May 23 2020 02:05:15 GMT+0000 (UTC) 02:97:22
3497.8 none succeeded 853/1572 N/A N/A Sat May 23 2020 02:05:15 GMT+0000 (UTC) 01:72:99
3497.9 none succeeded 1332/1572 N/A N/A Sat May 23 2020 02:05:15 GMT+0000 (UTC) 02:95:02
3497.10 none succeeded 1378/1572 N/A N/A Sat May 23 2020 02:05:15 GMT+0000 (UTC) 02:03:73
3497.11 none succeeded 1451/1572 N/A N/A Sat May 23 2020 02:05:15 GMT+0000 (UTC) 02:05:71
3497.12 none succeeded 1420/1572 N/A N/A Sat May 23 2020 02:05:15 GMT+0000 (UTC) 02:09:44
3497.13 none succeeded 1268/1572 N/A N/A Sat May 23 2020 02:05:15 GMT+0000 (UTC) 01:85:20
3497.14 none succeeded 1166/1572 N/A N/A Sat May 23 2020 02:05:15 GMT+0000 (UTC) 02:93:72
3497.15 none succeeded 1056/1572 N/A N/A Sat May 23 2020 02:05:15 GMT+0000 (UTC) 01:80:81
3497.16 none succeeded 1278/1572 N/A N/A Sat May 23 2020 02:05:16 GMT+0000 (UTC) 02:01:38
3497.17 none succeeded 1083/1572 N/A N/A Sat May 23 2020 02:05:16 GMT+0000 (UTC) 02:95:79
3497.18 none succeeded 1525/1571 N/A N/A Sat May 23 2020 02:05:16 GMT+0000 (UTC) 02:99:61
3497.19 none succeeded 1068/1571 N/A N/A Sat May 23 2020 02:05:16 GMT+0000 (UTC) 01:72:48
3497.20 none succeeded 1571/1571 N/A N/A Sat May 23 2020 02:05:16 GMT+0000 (UTC) 01:88:93
3497.21 none succeeded 1536/1571 N/A N/A Sat May 23 2020 02:05:16 GMT+0000 (UTC) 02:04:16
3497.22 none succeeded 1059/1571 N/A N/A Sat May 23 2020 02:05:16 GMT+0000 (UTC) 02:92:05
3497.23 none succeeded 1244/1571 N/A N/A Sat May 23 2020 02:05:16 GMT+0000 (UTC) 02:91:67
3497.24 none succeeded 1250/1571 N/A N/A Sat May 23 2020 02:05:16 GMT+0000 (UTC) 02:95:03
3497.25 none succeeded 1561/1571 N/A N/A Sat May 23 2020 02:05:16 GMT+0000 (UTC) 02:03:56
3497.26 none succeeded 1557/1571 N/A N/A Sat May 23 2020 02:05:16 GMT+0000 (UTC) 02:19:11
3497.27 none succeeded 976/1571 N/A N/A Sat May 23 2020 02:05:16 GMT+0000 (UTC) 01:88:62
3497.28 none succeeded 1342/1571 N/A N/A Sat May 23 2020 02:05:16 GMT+0000 (UTC) 02:99:69
3497.29 none succeeded 1291/1571 N/A N/A Sat May 23 2020 02:05:16 GMT+0000 (UTC) 02:94:41
3497.30 none succeeded 1561/1571 N/A N/A Sat May 23 2020 02:05:16 GMT+0000 (UTC) 02:09:32
3497.31 none succeeded 1559/1571 N/A N/A Sat May 23 2020 02:05:16 GMT+0000 (UTC) 02:03:08
3497.32 none timeout 0/0 N/A N/A Sat May 23 2020 02:05:16 GMT+0000 (UTC) 02:22:07
3497.33 none timeout 0/0 N/A N/A Sat May 23 2020 02:05:16 GMT+0000 (UTC) 02:21:35
3497.34 none succeeded 1564/1571 N/A N/A Sat May 23 2020 02:05:16 GMT+0000 (UTC) 02:91:42
3497.35 none succeeded 1571/1571 N/A N/A Sat May 23 2020 02:05:17 GMT+0000 (UTC) 02:95:21


Need help with Shippable? File an Issue


[ master ] Build UNSTABLE for zephyrproject-rtos/test_results ( tests: reel board test results Testing CI system, run tests on hardware reel board v1 Signed-off-by: Maksim Masalski <maksim.masalski@intel.com> ) on Shippable.com #builds

Shippable.com <noreply@...>
 

SHIPPABLE BUILD REPORT

65
test_results
Branch : master Sha : a145b3b290
Builder : Maksim Masalski Triggered By : Anas Nashif
Custom Environment Variables:
JOB_TRIGGERED_BY_NAME="create_test_commit"
JOB_TRIGGERED_BY_ID="125148"
# Runtime Status Tests Branch Coverage Sequence Coverage Triggered at Duration
65.1 none succeeded 833/902 N/A N/A Fri May 22 2020 04:06:40 GMT+0000 (UTC) 01:49:37
65.2 none unstable 1651/1840 N/A N/A Fri May 22 2020 04:06:40 GMT+0000 (UTC) 01:56:35
65.3 none unstable 2800/3091 N/A N/A Fri May 22 2020 04:06:41 GMT+0000 (UTC) 01:66:83
65.4 none unstable 5539/5891 N/A N/A Fri May 22 2020 04:06:41 GMT+0000 (UTC) 01:79:39
65.5 none unstable 5919/5968 N/A N/A Fri May 22 2020 04:06:41 GMT+0000 (UTC) 01:86:70


Need help with Shippable? File an Issue


[ master ] Build TIMEOUT for zephyrproject-rtos/ci-test ( ci: Update sdk to 0.11.3 Update sdk to 0.11.3 release and update docker image to get that SDK version. Signed-off-by: Kumar Gala <kumar.gala@linaro.org> ) on Shippable.com #builds

Shippable.com <noreply@...>
 

SHIPPABLE BUILD REPORT

3496
ci-test
Branch : master Sha : 5f9e0cfc3c
Builder : Kumar Gala Triggered By : Kumar Gala
Custom Environment Variables:
JOB_TRIGGERED_BY_NAME="daily-verify"
JOB_TRIGGERED_BY_ID="23790"
# Runtime Status Tests Branch Coverage Sequence Coverage Triggered at Duration
3496.1 none succeeded 1354/1572 N/A N/A Fri May 22 2020 02:06:02 GMT+0000 (UTC) 01:89:49
3496.2 none succeeded 925/1572 N/A N/A Fri May 22 2020 02:06:02 GMT+0000 (UTC) 01:75:71
3496.3 none timeout 0/0 N/A N/A Fri May 22 2020 02:06:02 GMT+0000 (UTC) 02:23:96
3496.4 none timeout 0/0 N/A N/A Fri May 22 2020 02:06:02 GMT+0000 (UTC) 02:23:96
3496.5 none succeeded 1566/1572 N/A N/A Fri May 22 2020 02:06:02 GMT+0000 (UTC) 02:97:02
3496.6 none succeeded 1570/1572 N/A N/A Fri May 22 2020 02:06:02 GMT+0000 (UTC) 02:06:35
3496.7 none succeeded 1089/1572 N/A N/A Fri May 22 2020 02:06:02 GMT+0000 (UTC) 02:01:54
3496.8 none succeeded 853/1572 N/A N/A Fri May 22 2020 02:06:02 GMT+0000 (UTC) 01:69:26
3496.9 none succeeded 1332/1572 N/A N/A Fri May 22 2020 02:06:02 GMT+0000 (UTC) 01:85:87
3496.10 none succeeded 1378/1572 N/A N/A Fri May 22 2020 02:06:02 GMT+0000 (UTC) 02:05:98
3496.11 none succeeded 1451/1572 N/A N/A Fri May 22 2020 02:06:02 GMT+0000 (UTC) 02:04:46
3496.12 none succeeded 1420/1572 N/A N/A Fri May 22 2020 02:06:02 GMT+0000 (UTC) 02:11:62
3496.13 none succeeded 1268/1572 N/A N/A Fri May 22 2020 02:06:02 GMT+0000 (UTC) 01:85:21
3496.14 none succeeded 1166/1572 N/A N/A Fri May 22 2020 02:06:02 GMT+0000 (UTC) 02:99:39
3496.15 none succeeded 1056/1572 N/A N/A Fri May 22 2020 02:06:02 GMT+0000 (UTC) 02:90:30
3496.16 none succeeded 1278/1572 N/A N/A Fri May 22 2020 02:06:02 GMT+0000 (UTC) 02:94:17
3496.17 none succeeded 1083/1572 N/A N/A Fri May 22 2020 02:06:02 GMT+0000 (UTC) 02:91:71
3496.18 none succeeded 1525/1571 N/A N/A Fri May 22 2020 02:06:03 GMT+0000 (UTC) 02:99:31
3496.19 none succeeded 1068/1571 N/A N/A Fri May 22 2020 02:06:03 GMT+0000 (UTC) 01:80:15
3496.20 none succeeded 1571/1571 N/A N/A Fri May 22 2020 02:06:03 GMT+0000 (UTC) 02:00:28
3496.21 none succeeded 1536/1571 N/A N/A Fri May 22 2020 02:06:03 GMT+0000 (UTC) 02:06:76
3496.22 none succeeded 1059/1571 N/A N/A Fri May 22 2020 02:06:03 GMT+0000 (UTC) 02:92:46
3496.23 none succeeded 1244/1571 N/A N/A Fri May 22 2020 02:06:03 GMT+0000 (UTC) 02:94:41
3496.24 none succeeded 1250/1571 N/A N/A Fri May 22 2020 02:06:03 GMT+0000 (UTC) 02:95:20
3496.25 none succeeded 1561/1571 N/A N/A Fri May 22 2020 02:06:03 GMT+0000 (UTC) 02:23:81
3496.26 none succeeded 1557/1571 N/A N/A Fri May 22 2020 02:06:03 GMT+0000 (UTC) 02:20:18
3496.27 none succeeded 976/1571 N/A N/A Fri May 22 2020 02:06:03 GMT+0000 (UTC) 01:88:59
3496.28 none succeeded 1342/1571 N/A N/A Fri May 22 2020 02:06:03 GMT+0000 (UTC) 02:99:57
3496.29 none succeeded 1291/1571 N/A N/A Fri May 22 2020 02:06:03 GMT+0000 (UTC) 02:93:98
3496.30 none succeeded 1561/1571 N/A N/A Fri May 22 2020 02:06:03 GMT+0000 (UTC) 02:06:85
3496.31 none succeeded 1559/1571 N/A N/A Fri May 22 2020 02:06:03 GMT+0000 (UTC) 02:01:33
3496.32 none timeout 0/0 N/A N/A Fri May 22 2020 02:06:03 GMT+0000 (UTC) 02:24:17
3496.33 none timeout 0/0 N/A N/A Fri May 22 2020 02:06:03 GMT+0000 (UTC) 02:23:72
3496.34 none succeeded 1564/1571 N/A N/A Fri May 22 2020 02:06:03 GMT+0000 (UTC) 01:89:36
3496.35 none succeeded 1571/1571 N/A N/A Fri May 22 2020 02:06:04 GMT+0000 (UTC) 02:96:34


Need help with Shippable? File an Issue


[ master ] Build FAILED for zephyrproject-rtos/test_results ( tests: reel board test results Testing CI system, run tests on hardware reel board v1 Signed-off-by: Maksim Masalski <maksim.masalski@intel.com> ) on Shippable.com #builds

Shippable.com <noreply@...>
 

SHIPPABLE BUILD REPORT

64
test_results
Branch : master Sha : a145b3b290
Builder : Maksim Masalski Triggered By : Anas Nashif
Custom Environment Variables:
JOB_TRIGGERED_BY_NAME="create_test_commit"
JOB_TRIGGERED_BY_ID="125148"
# Runtime Status Tests Branch Coverage Sequence Coverage Triggered at Duration
64.1 none succeeded 833/902 N/A N/A Thu May 21 2020 04:06:32 GMT+0000 (UTC) 01:49:40
64.2 none failed 1650/1840 N/A N/A Thu May 21 2020 04:06:32 GMT+0000 (UTC) 03:73:88
64.3 none unstable 2800/3091 N/A N/A Thu May 21 2020 04:06:32 GMT+0000 (UTC) 01:67:32
64.4 none unstable 5541/5890 N/A N/A Thu May 21 2020 04:06:32 GMT+0000 (UTC) 01:79:20
64.5 none succeeded 5926/5967 N/A N/A Thu May 21 2020 04:06:32 GMT+0000 (UTC) 01:86:78


Need help with Shippable? File an Issue


[ master ] Build TIMEOUT for zephyrproject-rtos/ci-test ( ci: Update sdk to 0.11.3 Update sdk to 0.11.3 release and update docker image to get that SDK version. Signed-off-by: Kumar Gala <kumar.gala@linaro.org> ) on Shippable.com #builds

Shippable.com <noreply@...>
 

SHIPPABLE BUILD REPORT

3495
ci-test
Branch : master Sha : 5f9e0cfc3c
Builder : Kumar Gala Triggered By : Kumar Gala
Custom Environment Variables:
JOB_TRIGGERED_BY_NAME="daily-verify"
JOB_TRIGGERED_BY_ID="23790"
# Runtime Status Tests Branch Coverage Sequence Coverage Triggered at Duration
3495.1 none succeeded 1354/1572 N/A N/A Thu May 21 2020 02:06:07 GMT+0000 (UTC) 01:89:20
3495.2 none succeeded 925/1572 N/A N/A Thu May 21 2020 02:06:07 GMT+0000 (UTC) 01:75:94
3495.3 none timeout 0/0 N/A N/A Thu May 21 2020 02:06:07 GMT+0000 (UTC) 02:23:00
3495.4 none timeout 0/0 N/A N/A Thu May 21 2020 02:06:07 GMT+0000 (UTC) 02:23:00
3495.5 none succeeded 1566/1572 N/A N/A Thu May 21 2020 02:06:07 GMT+0000 (UTC) 02:96:45
3495.6 none succeeded 1570/1572 N/A N/A Thu May 21 2020 02:06:07 GMT+0000 (UTC) 02:07:94
3495.7 none succeeded 1089/1572 N/A N/A Thu May 21 2020 02:06:07 GMT+0000 (UTC) 02:92:43
3495.8 none succeeded 852/1571 N/A N/A Thu May 21 2020 02:06:07 GMT+0000 (UTC) 01:69:23
3495.9 none succeeded 1331/1571 N/A N/A Thu May 21 2020 02:06:08 GMT+0000 (UTC) 02:98:93
3495.10 none succeeded 1377/1571 N/A N/A Thu May 21 2020 02:06:08 GMT+0000 (UTC) 02:05:87
3495.11 none succeeded 1450/1571 N/A N/A Thu May 21 2020 02:06:08 GMT+0000 (UTC) 02:04:50
3495.12 none succeeded 1419/1571 N/A N/A Thu May 21 2020 02:06:08 GMT+0000 (UTC) 02:10:25
3495.13 none succeeded 1269/1571 N/A N/A Thu May 21 2020 02:06:08 GMT+0000 (UTC) 01:86:70
3495.14 none succeeded 1163/1571 N/A N/A Thu May 21 2020 02:06:08 GMT+0000 (UTC) 02:96:83
3495.15 none succeeded 1054/1571 N/A N/A Thu May 21 2020 02:06:08 GMT+0000 (UTC) 01:89:17
3495.16 none succeeded 1278/1571 N/A N/A Thu May 21 2020 02:06:08 GMT+0000 (UTC) 02:98:83
3495.17 none succeeded 1082/1571 N/A N/A Thu May 21 2020 02:06:08 GMT+0000 (UTC) 02:91:62
3495.18 none succeeded 1525/1571 N/A N/A Thu May 21 2020 02:06:08 GMT+0000 (UTC) 02:96:32
3495.19 none succeeded 1068/1571 N/A N/A Thu May 21 2020 02:06:08 GMT+0000 (UTC) 01:81:73
3495.20 none succeeded 1571/1571 N/A N/A Thu May 21 2020 02:06:08 GMT+0000 (UTC) 02:99:22
3495.21 none succeeded 1536/1571 N/A N/A Thu May 21 2020 02:06:08 GMT+0000 (UTC) 02:04:65
3495.22 none succeeded 1059/1571 N/A N/A Thu May 21 2020 02:06:08 GMT+0000 (UTC) 02:99:65
3495.23 none succeeded 1244/1571 N/A N/A Thu May 21 2020 02:06:08 GMT+0000 (UTC) 02:94:26
3495.24 none succeeded 1250/1571 N/A N/A Thu May 21 2020 02:06:08 GMT+0000 (UTC) 02:94:48
3495.25 none succeeded 1561/1571 N/A N/A Thu May 21 2020 02:06:08 GMT+0000 (UTC) 02:14:29
3495.26 none succeeded 1557/1571 N/A N/A Thu May 21 2020 02:06:09 GMT+0000 (UTC) 02:15:79
3495.27 none succeeded 976/1571 N/A N/A Thu May 21 2020 02:06:09 GMT+0000 (UTC) 01:84:20
3495.28 none succeeded 1342/1571 N/A N/A Thu May 21 2020 02:06:09 GMT+0000 (UTC) 02:95:95
3495.29 none failed 0/0 N/A N/A Thu May 21 2020 02:06:09 GMT+0000 (UTC) 00:02:16
3495.30 none succeeded 1561/1571 N/A N/A Thu May 21 2020 02:06:09 GMT+0000 (UTC) 02:04:48
3495.31 none succeeded 1559/1571 N/A N/A Thu May 21 2020 02:06:09 GMT+0000 (UTC) 02:05:97
3495.32 none timeout 0/0 N/A N/A Thu May 21 2020 02:06:09 GMT+0000 (UTC) 02:25:72
3495.33 none timeout 0/0 N/A N/A Thu May 21 2020 02:06:09 GMT+0000 (UTC) 02:23:06
3495.34 none succeeded 1564/1571 N/A N/A Thu May 21 2020 02:06:09 GMT+0000 (UTC) 02:05:24
3495.35 none succeeded 1571/1571 N/A N/A Thu May 21 2020 02:06:09 GMT+0000 (UTC) 02:96:74


Need help with Shippable? File an Issue