Date   

[ master ] Build FAILED for zephyrproject-rtos/test_results ( zephyr-v2.3.0-106-g603c24dec9: stm32 sanitycheck results Test results for STM32 platforms on tag zephyr-v2.3.0-106-g603c24dec9 Signed-off-by: Erwan Gouriou <erwan.gouriou@linaro.org> ) on Shippable.com #builds

Shippable.com <noreply@...>
 

SHIPPABLE BUILD REPORT

85
test_results
Branch : master Sha : 292690dd37
Builder : Erwan Gouriou Triggered By : Anas Nashif
Custom Environment Variables:
JOB_TRIGGERED_BY_NAME="create_test_commit"
JOB_TRIGGERED_BY_ID="125148"
# Runtime Status Tests Branch Coverage Sequence Coverage Triggered at Duration
85.1 none failed 852/1091 N/A N/A Thu Jun 11 2020 04:07:17 GMT+0000 (UTC) 02:12:44
85.2 none failed 1895/2605 N/A N/A Thu Jun 11 2020 04:07:17 GMT+0000 (UTC) 03:89:14
85.3 none failed 2810/5606 N/A N/A Thu Jun 11 2020 04:07:17 GMT+0000 (UTC) 04:31:70
85.4 none failed 5647/6409 N/A N/A Thu Jun 11 2020 04:07:17 GMT+0000 (UTC) 05:72:27
85.5 none failed 6230/6346 N/A N/A Thu Jun 11 2020 04:07:17 GMT+0000 (UTC) 05:05:25


Need help with Shippable? File an Issue


[ master ] Build TIMEOUT for zephyrproject-rtos/ci-test ( ci: Update sdk to 0.11.3 Update sdk to 0.11.3 release and update docker image to get that SDK version. Signed-off-by: Kumar Gala <kumar.gala@linaro.org> ) on Shippable.com #builds

Shippable.com <noreply@...>
 

SHIPPABLE BUILD REPORT

3516
ci-test
Branch : master Sha : 5f9e0cfc3c
Builder : Kumar Gala Triggered By : Kumar Gala
Custom Environment Variables:
JOB_TRIGGERED_BY_NAME="daily-verify"
JOB_TRIGGERED_BY_ID="23790"
# Runtime Status Tests Branch Coverage Sequence Coverage Triggered at Duration
3516.1 none succeeded 1428/1646 N/A N/A Thu Jun 11 2020 02:05:42 GMT+0000 (UTC) 02:93:08
3516.2 none succeeded 945/1646 N/A N/A Thu Jun 11 2020 02:05:42 GMT+0000 (UTC) 01:76:71
3516.3 none timeout 0/0 N/A N/A Thu Jun 11 2020 02:05:42 GMT+0000 (UTC) 02:23:53
3516.4 none timeout 0/0 N/A N/A Thu Jun 11 2020 02:05:43 GMT+0000 (UTC) 02:23:53
3516.5 none succeeded 1640/1646 N/A N/A Thu Jun 11 2020 02:05:43 GMT+0000 (UTC) 02:99:55
3516.6 none succeeded 1644/1646 N/A N/A Thu Jun 11 2020 02:05:43 GMT+0000 (UTC) 02:09:68
3516.7 none succeeded 1005/1646 N/A N/A Thu Jun 11 2020 02:05:43 GMT+0000 (UTC) 02:96:32
3516.8 none succeeded 1029/1646 N/A N/A Thu Jun 11 2020 02:05:43 GMT+0000 (UTC) 01:77:96
3516.9 none succeeded 1366/1646 N/A N/A Thu Jun 11 2020 02:05:43 GMT+0000 (UTC) 02:01:67
3516.10 none succeeded 1411/1646 N/A N/A Thu Jun 11 2020 02:05:43 GMT+0000 (UTC) 02:09:49
3516.11 none succeeded 1626/1646 N/A N/A Thu Jun 11 2020 02:05:43 GMT+0000 (UTC) 02:14:37
3516.12 none succeeded 1425/1646 N/A N/A Thu Jun 11 2020 02:05:43 GMT+0000 (UTC) 02:13:92
3516.13 none succeeded 1325/1646 N/A N/A Thu Jun 11 2020 02:05:43 GMT+0000 (UTC) 02:05:05
3516.14 none succeeded 1226/1645 N/A N/A Thu Jun 11 2020 02:05:43 GMT+0000 (UTC) 02:05:07
3516.15 none succeeded 1133/1645 N/A N/A Thu Jun 11 2020 02:05:43 GMT+0000 (UTC) 01:82:09
3516.16 none failed 1375/1645 N/A N/A Thu Jun 11 2020 02:05:43 GMT+0000 (UTC) 02:06:85
3516.17 none succeeded 1108/1645 N/A N/A Thu Jun 11 2020 02:05:43 GMT+0000 (UTC) 02:93:56
3516.18 none succeeded 1631/1645 N/A N/A Thu Jun 11 2020 02:05:43 GMT+0000 (UTC) 02:13:90
3516.19 none succeeded 1122/1645 N/A N/A Thu Jun 11 2020 02:05:43 GMT+0000 (UTC) 01:84:33
3516.20 none succeeded 1605/1645 N/A N/A Thu Jun 11 2020 02:05:43 GMT+0000 (UTC) 02:11:68
3516.21 none succeeded 1524/1645 N/A N/A Thu Jun 11 2020 02:05:44 GMT+0000 (UTC) 02:09:60
3516.22 none succeeded 1097/1645 N/A N/A Thu Jun 11 2020 02:05:44 GMT+0000 (UTC) 02:96:46
3516.23 none succeeded 1188/1645 N/A N/A Thu Jun 11 2020 02:05:44 GMT+0000 (UTC) 02:92:27
3516.24 none succeeded 1292/1645 N/A N/A Thu Jun 11 2020 02:05:44 GMT+0000 (UTC) 02:99:39
3516.25 none timeout 1598/1645 N/A N/A Thu Jun 11 2020 02:05:44 GMT+0000 (UTC) 02:22:42
3516.26 none succeeded 1583/1645 N/A N/A Thu Jun 11 2020 02:05:44 GMT+0000 (UTC) 02:19:68
3516.27 none succeeded 1093/1645 N/A N/A Thu Jun 11 2020 02:05:44 GMT+0000 (UTC) 02:01:59
3516.28 none succeeded 1332/1645 N/A N/A Thu Jun 11 2020 02:05:44 GMT+0000 (UTC) 02:00:82
3516.29 none succeeded 1393/1645 N/A N/A Thu Jun 11 2020 02:05:44 GMT+0000 (UTC) 02:96:47
3516.30 none succeeded 1605/1645 N/A N/A Thu Jun 11 2020 02:05:44 GMT+0000 (UTC) 02:08:86
3516.31 none succeeded 1632/1645 N/A N/A Thu Jun 11 2020 02:05:44 GMT+0000 (UTC) 02:06:44
3516.32 none timeout 0/0 N/A N/A Thu Jun 11 2020 02:05:44 GMT+0000 (UTC) 02:21:55
3516.33 none timeout 0/0 N/A N/A Thu Jun 11 2020 02:05:44 GMT+0000 (UTC) 02:21:31
3516.34 none succeeded 1635/1645 N/A N/A Thu Jun 11 2020 02:05:44 GMT+0000 (UTC) 02:06:56
3516.35 none succeeded 1645/1645 N/A N/A Thu Jun 11 2020 02:05:44 GMT+0000 (UTC) 02:02:34


Need help with Shippable? File an Issue


[ master ] Build FAILED for zephyrproject-rtos/test_results ( add both qemu_arc_hs and qemu_arc_em ) on Shippable.com #builds

Shippable.com <noreply@...>
 

SHIPPABLE BUILD REPORT

84
test_results
Branch : master Sha : a748e98ced
Builder : Anas Nashif Triggered By : Anas Nashif
Custom Environment Variables:
JOB_TRIGGERED_BY_NAME="create_test_commit"
JOB_TRIGGERED_BY_ID="125148"
# Runtime Status Tests Branch Coverage Sequence Coverage Triggered at Duration
84.1 none failed 852/1091 N/A N/A Wed Jun 10 2020 04:06:12 GMT+0000 (UTC) 02:13:95
84.2 none failed 1894/2605 N/A N/A Wed Jun 10 2020 04:06:13 GMT+0000 (UTC) 03:90:77
84.3 none failed 2810/5606 N/A N/A Wed Jun 10 2020 04:06:13 GMT+0000 (UTC) 04:33:61
84.4 none failed 5647/6409 N/A N/A Wed Jun 10 2020 04:06:13 GMT+0000 (UTC) 05:71:75
84.5 none failed 6230/6346 N/A N/A Wed Jun 10 2020 04:06:13 GMT+0000 (UTC) 05:07:27


Need help with Shippable? File an Issue


[ master ] Build TIMEOUT for zephyrproject-rtos/ci-test ( ci: Update sdk to 0.11.3 Update sdk to 0.11.3 release and update docker image to get that SDK version. Signed-off-by: Kumar Gala <kumar.gala@linaro.org> ) on Shippable.com #builds

Shippable.com <noreply@...>
 

SHIPPABLE BUILD REPORT

3515
ci-test
Branch : master Sha : 5f9e0cfc3c
Builder : Kumar Gala Triggered By : Kumar Gala
Custom Environment Variables:
JOB_TRIGGERED_BY_NAME="daily-verify"
JOB_TRIGGERED_BY_ID="23790"
# Runtime Status Tests Branch Coverage Sequence Coverage Triggered at Duration
3515.1 none succeeded 1401/1619 N/A N/A Wed Jun 10 2020 02:05:28 GMT+0000 (UTC) 01:89:18
3515.2 none succeeded 922/1619 N/A N/A Wed Jun 10 2020 02:05:28 GMT+0000 (UTC) 01:69:58
3515.3 none timeout 0/0 N/A N/A Wed Jun 10 2020 02:05:28 GMT+0000 (UTC) 02:22:26
3515.4 none timeout 0/0 N/A N/A Wed Jun 10 2020 02:05:28 GMT+0000 (UTC) 02:22:25
3515.5 none succeeded 1612/1619 N/A N/A Wed Jun 10 2020 02:05:29 GMT+0000 (UTC) 02:95:91
3515.6 none succeeded 1617/1619 N/A N/A Wed Jun 10 2020 02:05:29 GMT+0000 (UTC) 02:09:42
3515.7 none succeeded 1101/1619 N/A N/A Wed Jun 10 2020 02:05:29 GMT+0000 (UTC) 02:95:00
3515.8 none succeeded 901/1619 N/A N/A Wed Jun 10 2020 02:05:29 GMT+0000 (UTC) 01:79:19
3515.9 none succeeded 1379/1619 N/A N/A Wed Jun 10 2020 02:05:29 GMT+0000 (UTC) 02:02:03
3515.10 none succeeded 1382/1619 N/A N/A Wed Jun 10 2020 02:05:29 GMT+0000 (UTC) 02:04:45
3515.11 none succeeded 1543/1618 N/A N/A Wed Jun 10 2020 02:05:29 GMT+0000 (UTC) 02:12:33
3515.12 none succeeded 1465/1618 N/A N/A Wed Jun 10 2020 02:05:29 GMT+0000 (UTC) 02:17:03
3515.13 none succeeded 1235/1618 N/A N/A Wed Jun 10 2020 02:05:29 GMT+0000 (UTC) 01:89:60
3515.14 none succeeded 1291/1618 N/A N/A Wed Jun 10 2020 02:05:29 GMT+0000 (UTC) 02:04:44
3515.15 none succeeded 1095/1618 N/A N/A Wed Jun 10 2020 02:05:29 GMT+0000 (UTC) 02:94:29
3515.16 none failed 1273/1618 N/A N/A Wed Jun 10 2020 02:05:29 GMT+0000 (UTC) 02:93:92
3515.17 none succeeded 1316/1618 N/A N/A Wed Jun 10 2020 02:05:29 GMT+0000 (UTC) 02:09:21
3515.18 none succeeded 1382/1618 N/A N/A Wed Jun 10 2020 02:05:29 GMT+0000 (UTC) 02:92:27
3515.19 none succeeded 1106/1618 N/A N/A Wed Jun 10 2020 02:05:30 GMT+0000 (UTC) 01:82:47
3515.20 none succeeded 1618/1618 N/A N/A Wed Jun 10 2020 02:05:30 GMT+0000 (UTC) 02:03:78
3515.21 none succeeded 1618/1618 N/A N/A Wed Jun 10 2020 02:05:30 GMT+0000 (UTC) 02:08:67
3515.22 none succeeded 1077/1618 N/A N/A Wed Jun 10 2020 02:05:30 GMT+0000 (UTC) 02:95:77
3515.23 none succeeded 1289/1618 N/A N/A Wed Jun 10 2020 02:05:30 GMT+0000 (UTC) 02:00:89
3515.24 none succeeded 1297/1618 N/A N/A Wed Jun 10 2020 02:05:30 GMT+0000 (UTC) 02:00:03
3515.25 none succeeded 1605/1618 N/A N/A Wed Jun 10 2020 02:05:30 GMT+0000 (UTC) 02:21:38
3515.26 none succeeded 1602/1618 N/A N/A Wed Jun 10 2020 02:05:30 GMT+0000 (UTC) 02:20:82
3515.27 none succeeded 1020/1618 N/A N/A Wed Jun 10 2020 02:05:30 GMT+0000 (UTC) 02:91:64
3515.28 none succeeded 1386/1618 N/A N/A Wed Jun 10 2020 02:05:30 GMT+0000 (UTC) 02:06:61
3515.29 none succeeded 1335/1618 N/A N/A Wed Jun 10 2020 02:05:30 GMT+0000 (UTC) 02:98:01
3515.30 none succeeded 1606/1618 N/A N/A Wed Jun 10 2020 02:05:30 GMT+0000 (UTC) 02:15:98
3515.31 none succeeded 1608/1618 N/A N/A Wed Jun 10 2020 02:05:30 GMT+0000 (UTC) 02:05:91
3515.32 none timeout 0/0 N/A N/A Wed Jun 10 2020 02:05:30 GMT+0000 (UTC) 02:23:04
3515.33 none timeout 0/0 N/A N/A Wed Jun 10 2020 02:05:30 GMT+0000 (UTC) 02:25:71
3515.34 none succeeded 1609/1618 N/A N/A Wed Jun 10 2020 02:05:30 GMT+0000 (UTC) 02:05:74
3515.35 none succeeded 1618/1618 N/A N/A Wed Jun 10 2020 02:05:31 GMT+0000 (UTC) 02:01:86


Need help with Shippable? File an Issue


[ master ] Build FAILED for zephyrproject-rtos/test_results ( tests: Add tests results run on Nordic boards Add sanitycheck test results run on nrf52dk_nrf52832 and nrf52840dk_nrf52840 Signed-off-by: Maciej Perkowski <Maciej.Perkowski@nordicsemi.no> ) on Shippable.com #builds

Shippable.com <noreply@...>
 

SHIPPABLE BUILD REPORT

83
test_results
Branch : master Sha : 42c25cb6a0
Builder : Maciej Perkowski Triggered By : Anas Nashif
Custom Environment Variables:
JOB_TRIGGERED_BY_NAME="create_test_commit"
JOB_TRIGGERED_BY_ID="125148"
# Runtime Status Tests Branch Coverage Sequence Coverage Triggered at Duration
83.1 none succeeded 838/977 N/A N/A Tue Jun 09 2020 04:06:06 GMT+0000 (UTC) 01:49:48
83.2 none unstable 1664/2264 N/A N/A Tue Jun 09 2020 04:06:06 GMT+0000 (UTC) 01:55:25
83.3 none failed 2835/4764 N/A N/A Tue Jun 09 2020 04:06:06 GMT+0000 (UTC) 04:29:28
83.4 none failed 5606/6161 N/A N/A Tue Jun 09 2020 04:06:06 GMT+0000 (UTC) 05:72:10
83.5 none unstable 5914/5961 N/A N/A Tue Jun 09 2020 04:06:06 GMT+0000 (UTC) 01:86:83


Need help with Shippable? File an Issue


[ master ] Build TIMEOUT for zephyrproject-rtos/ci-test ( ci: Update sdk to 0.11.3 Update sdk to 0.11.3 release and update docker image to get that SDK version. Signed-off-by: Kumar Gala <kumar.gala@linaro.org> ) on Shippable.com #builds

Shippable.com <noreply@...>
 

SHIPPABLE BUILD REPORT

3514
ci-test
Branch : master Sha : 5f9e0cfc3c
Builder : Kumar Gala Triggered By : Kumar Gala
Custom Environment Variables:
JOB_TRIGGERED_BY_NAME="daily-verify"
JOB_TRIGGERED_BY_ID="23790"
# Runtime Status Tests Branch Coverage Sequence Coverage Triggered at Duration
3514.1 none succeeded 1385/1603 N/A N/A Tue Jun 09 2020 02:05:19 GMT+0000 (UTC) 01:88:80
3514.2 none succeeded 904/1603 N/A N/A Tue Jun 09 2020 02:05:19 GMT+0000 (UTC) 01:70:17
3514.3 none timeout 0/0 N/A N/A Tue Jun 09 2020 02:05:19 GMT+0000 (UTC) 02:23:61
3514.4 none timeout 0/0 N/A N/A Tue Jun 09 2020 02:05:19 GMT+0000 (UTC) 02:22:50
3514.5 none succeeded 1595/1602 N/A N/A Tue Jun 09 2020 02:05:19 GMT+0000 (UTC) 02:95:12
3514.6 none succeeded 1600/1602 N/A N/A Tue Jun 09 2020 02:05:19 GMT+0000 (UTC) 02:05:84
3514.7 none succeeded 1133/1602 N/A N/A Tue Jun 09 2020 02:05:19 GMT+0000 (UTC) 02:92:33
3514.8 none succeeded 867/1602 N/A N/A Tue Jun 09 2020 02:05:19 GMT+0000 (UTC) 01:66:68
3514.9 none succeeded 1357/1602 N/A N/A Tue Jun 09 2020 02:05:19 GMT+0000 (UTC) 02:00:89
3514.10 none succeeded 1382/1602 N/A N/A Tue Jun 09 2020 02:05:19 GMT+0000 (UTC) 02:03:79
3514.11 none succeeded 1499/1602 N/A N/A Tue Jun 09 2020 02:05:19 GMT+0000 (UTC) 02:09:38
3514.12 none succeeded 1449/1602 N/A N/A Tue Jun 09 2020 02:05:20 GMT+0000 (UTC) 02:10:88
3514.13 none succeeded 1250/1602 N/A N/A Tue Jun 09 2020 02:05:20 GMT+0000 (UTC) 01:86:85
3514.14 none succeeded 1240/1602 N/A N/A Tue Jun 09 2020 02:05:20 GMT+0000 (UTC) 02:91:74
3514.15 none succeeded 1089/1602 N/A N/A Tue Jun 09 2020 02:05:20 GMT+0000 (UTC) 01:90:88
3514.16 none succeeded 1263/1602 N/A N/A Tue Jun 09 2020 02:05:20 GMT+0000 (UTC) 01:87:38
3514.17 none succeeded 1147/1602 N/A N/A Tue Jun 09 2020 02:05:20 GMT+0000 (UTC) 02:94:15
3514.18 none succeeded 1515/1602 N/A N/A Tue Jun 09 2020 02:05:20 GMT+0000 (UTC) 02:95:73
3514.19 none succeeded 1091/1602 N/A N/A Tue Jun 09 2020 02:05:20 GMT+0000 (UTC) 01:78:57
3514.20 none succeeded 1602/1602 N/A N/A Tue Jun 09 2020 02:05:20 GMT+0000 (UTC) 02:07:10
3514.21 none succeeded 1572/1602 N/A N/A Tue Jun 09 2020 02:05:20 GMT+0000 (UTC) 02:01:50
3514.22 none succeeded 1074/1602 N/A N/A Tue Jun 09 2020 02:05:20 GMT+0000 (UTC) 02:93:55
3514.23 none succeeded 1266/1602 N/A N/A Tue Jun 09 2020 02:05:20 GMT+0000 (UTC) 02:92:94
3514.24 none succeeded 1277/1602 N/A N/A Tue Jun 09 2020 02:05:20 GMT+0000 (UTC) 02:94:65
3514.25 none timeout 1592/1602 N/A N/A Tue Jun 09 2020 02:05:20 GMT+0000 (UTC) 02:23:74
3514.26 none timeout 0/0 N/A N/A Tue Jun 09 2020 02:05:20 GMT+0000 (UTC) 02:22:21
3514.27 none succeeded 1003/1602 N/A N/A Tue Jun 09 2020 02:05:20 GMT+0000 (UTC) 01:86:88
3514.28 none succeeded 1371/1602 N/A N/A Tue Jun 09 2020 02:05:20 GMT+0000 (UTC) 02:99:62
3514.29 none succeeded 1318/1602 N/A N/A Tue Jun 09 2020 02:05:20 GMT+0000 (UTC) 02:93:94
3514.30 none succeeded 1591/1602 N/A N/A Tue Jun 09 2020 02:05:20 GMT+0000 (UTC) 02:10:06
3514.31 none succeeded 1593/1602 N/A N/A Tue Jun 09 2020 02:05:21 GMT+0000 (UTC) 02:07:31
3514.32 none timeout 0/0 N/A N/A Tue Jun 09 2020 02:05:21 GMT+0000 (UTC) 02:22:24
3514.33 none timeout 0/0 N/A N/A Tue Jun 09 2020 02:05:21 GMT+0000 (UTC) 02:24:17
3514.34 none succeeded 1593/1602 N/A N/A Tue Jun 09 2020 02:05:21 GMT+0000 (UTC) 02:02:93
3514.35 none succeeded 1602/1602 N/A N/A Tue Jun 09 2020 02:05:21 GMT+0000 (UTC) 02:99:63


Need help with Shippable? File an Issue


[ master ] Build UNSTABLE for zephyrproject-rtos/test_results ( install forked junit2html ) on Shippable.com #builds

Shippable.com <noreply@...>
 

SHIPPABLE BUILD REPORT

82
test_results
Branch : master Sha : 9f3b31aa24
Builder : Anas Nashif Triggered By : Anas Nashif
Custom Environment Variables:
JOB_TRIGGERED_BY_NAME="create_test_commit"
JOB_TRIGGERED_BY_ID="125148"
# Runtime Status Tests Branch Coverage Sequence Coverage Triggered at Duration
82.1 none succeeded 838/971 N/A N/A Mon Jun 08 2020 04:07:23 GMT+0000 (UTC) 01:49:60
82.2 none unstable 1654/2274 N/A N/A Mon Jun 08 2020 04:07:23 GMT+0000 (UTC) 01:55:28
82.3 none unstable 2873/4792 N/A N/A Mon Jun 08 2020 04:07:24 GMT+0000 (UTC) 01:66:79
82.4 none unstable 5581/6130 N/A N/A Mon Jun 08 2020 04:07:24 GMT+0000 (UTC) 01:79:62
82.5 none unstable 5899/5946 N/A N/A Mon Jun 08 2020 04:07:24 GMT+0000 (UTC) 01:87:29


Need help with Shippable? File an Issue


[ master ] Build TIMEOUT for zephyrproject-rtos/ci-test ( ci: Update sdk to 0.11.3 Update sdk to 0.11.3 release and update docker image to get that SDK version. Signed-off-by: Kumar Gala <kumar.gala@linaro.org> ) on Shippable.com #builds

Shippable.com <noreply@...>
 

SHIPPABLE BUILD REPORT

3513
ci-test
Branch : master Sha : 5f9e0cfc3c
Builder : Kumar Gala Triggered By : Kumar Gala
Custom Environment Variables:
JOB_TRIGGERED_BY_NAME="daily-verify"
JOB_TRIGGERED_BY_ID="23790"
# Runtime Status Tests Branch Coverage Sequence Coverage Triggered at Duration
3513.1 none succeeded 1367/1585 N/A N/A Mon Jun 08 2020 02:05:54 GMT+0000 (UTC) 01:90:77
3513.2 none succeeded 912/1585 N/A N/A Mon Jun 08 2020 02:05:55 GMT+0000 (UTC) 01:74:55
3513.3 none timeout 0/0 N/A N/A Mon Jun 08 2020 02:05:55 GMT+0000 (UTC) 02:20:04
3513.4 none timeout 0/0 N/A N/A Mon Jun 08 2020 02:05:55 GMT+0000 (UTC) 02:20:03
3513.5 none succeeded 1578/1585 N/A N/A Mon Jun 08 2020 02:05:55 GMT+0000 (UTC) 02:98:52
3513.6 none succeeded 1583/1585 N/A N/A Mon Jun 08 2020 02:05:55 GMT+0000 (UTC) 02:04:47
3513.7 none succeeded 1186/1585 N/A N/A Mon Jun 08 2020 02:05:55 GMT+0000 (UTC) 02:98:51
3513.8 none succeeded 787/1585 N/A N/A Mon Jun 08 2020 02:05:55 GMT+0000 (UTC) 01:65:73
3513.9 none succeeded 1344/1585 N/A N/A Mon Jun 08 2020 02:05:55 GMT+0000 (UTC) 02:97:01
3513.10 none succeeded 1400/1585 N/A N/A Mon Jun 08 2020 02:05:55 GMT+0000 (UTC) 02:02:05
3513.11 none succeeded 1452/1585 N/A N/A Mon Jun 08 2020 02:05:55 GMT+0000 (UTC) 02:07:15
3513.12 none succeeded 1432/1585 N/A N/A Mon Jun 08 2020 02:05:55 GMT+0000 (UTC) 02:14:17
3513.13 none succeeded 1283/1585 N/A N/A Mon Jun 08 2020 02:05:55 GMT+0000 (UTC) 01:88:91
3513.14 none succeeded 1177/1585 N/A N/A Mon Jun 08 2020 02:05:55 GMT+0000 (UTC) 02:07:07
3513.15 none succeeded 1044/1585 N/A N/A Mon Jun 08 2020 02:06:01 GMT+0000 (UTC) 01:89:70
3513.16 none succeeded 1274/1585 N/A N/A Mon Jun 08 2020 02:06:01 GMT+0000 (UTC) 02:91:68
3513.17 none succeeded 1095/1585 N/A N/A Mon Jun 08 2020 02:06:01 GMT+0000 (UTC) 02:93:01
3513.18 none succeeded 1540/1585 N/A N/A Mon Jun 08 2020 02:06:01 GMT+0000 (UTC) 02:99:60
3513.19 none succeeded 1082/1585 N/A N/A Mon Jun 08 2020 02:06:01 GMT+0000 (UTC) 01:81:59
3513.20 none succeeded 1585/1585 N/A N/A Mon Jun 08 2020 02:06:01 GMT+0000 (UTC) 02:01:53
3513.21 none succeeded 1533/1585 N/A N/A Mon Jun 08 2020 02:06:01 GMT+0000 (UTC) 02:08:89
3513.22 none succeeded 1089/1585 N/A N/A Mon Jun 08 2020 02:06:01 GMT+0000 (UTC) 02:94:66
3513.23 none succeeded 1255/1585 N/A N/A Mon Jun 08 2020 02:06:01 GMT+0000 (UTC) 02:93:75
3513.24 none succeeded 1264/1585 N/A N/A Mon Jun 08 2020 02:06:01 GMT+0000 (UTC) 02:97:06
3513.25 none succeeded 1574/1584 N/A N/A Mon Jun 08 2020 02:06:01 GMT+0000 (UTC) 02:19:49
3513.26 none succeeded 1568/1584 N/A N/A Mon Jun 08 2020 02:06:01 GMT+0000 (UTC) 02:24:13
3513.27 none succeeded 991/1584 N/A N/A Mon Jun 08 2020 02:06:01 GMT+0000 (UTC) 01:86:66
3513.28 none succeeded 1355/1584 N/A N/A Mon Jun 08 2020 02:06:01 GMT+0000 (UTC) 02:11:68
3513.29 none succeeded 1299/1584 N/A N/A Mon Jun 08 2020 02:06:01 GMT+0000 (UTC) 02:94:40
3513.30 none succeeded 1576/1584 N/A N/A Mon Jun 08 2020 02:06:01 GMT+0000 (UTC) 02:12:29
3513.31 none succeeded 1575/1584 N/A N/A Mon Jun 08 2020 02:06:02 GMT+0000 (UTC) 02:05:25
3513.32 none timeout 0/0 N/A N/A Mon Jun 08 2020 02:06:02 GMT+0000 (UTC) 02:21:47
3513.33 none timeout 0/0 N/A N/A Mon Jun 08 2020 02:06:02 GMT+0000 (UTC) 02:23:08
3513.34 none succeeded 1575/1584 N/A N/A Mon Jun 08 2020 02:06:02 GMT+0000 (UTC) 02:02:98
3513.35 none succeeded 1584/1584 N/A N/A Mon Jun 08 2020 02:06:02 GMT+0000 (UTC) 02:99:16


Need help with Shippable? File an Issue


[ master ] Build FAILED for zephyrproject-rtos/test_results ( install forked junit2html ) on Shippable.com #builds

Shippable.com <noreply@...>
 

SHIPPABLE BUILD REPORT

81
test_results
Branch : master Sha : 9f3b31aa24
Builder : Anas Nashif Triggered By : Anas Nashif
Custom Environment Variables:
JOB_TRIGGERED_BY_NAME="create_test_commit"
JOB_TRIGGERED_BY_ID="125148"
# Runtime Status Tests Branch Coverage Sequence Coverage Triggered at Duration
81.1 none succeeded 838/971 N/A N/A Sun Jun 07 2020 04:06:25 GMT+0000 (UTC) 01:50:80
81.2 none unstable 1654/2274 N/A N/A Sun Jun 07 2020 04:06:25 GMT+0000 (UTC) 01:56:32
81.3 none failed 2872/4792 N/A N/A Sun Jun 07 2020 04:06:25 GMT+0000 (UTC) 04:31:61
81.4 none failed 5581/6130 N/A N/A Sun Jun 07 2020 04:06:25 GMT+0000 (UTC) 05:71:79
81.5 none succeeded 5900/5946 N/A N/A Sun Jun 07 2020 04:06:25 GMT+0000 (UTC) 01:87:02


Need help with Shippable? File an Issue


[ master ] Build TIMEOUT for zephyrproject-rtos/ci-test ( ci: Update sdk to 0.11.3 Update sdk to 0.11.3 release and update docker image to get that SDK version. Signed-off-by: Kumar Gala <kumar.gala@linaro.org> ) on Shippable.com #builds

Shippable.com <noreply@...>
 

SHIPPABLE BUILD REPORT

3512
ci-test
Branch : master Sha : 5f9e0cfc3c
Builder : Kumar Gala Triggered By : Kumar Gala
Custom Environment Variables:
JOB_TRIGGERED_BY_NAME="daily-verify"
JOB_TRIGGERED_BY_ID="23790"
# Runtime Status Tests Branch Coverage Sequence Coverage Triggered at Duration
3512.1 none succeeded 1367/1585 N/A N/A Sun Jun 07 2020 02:05:52 GMT+0000 (UTC) 02:91:52
3512.2 none succeeded 912/1585 N/A N/A Sun Jun 07 2020 02:05:52 GMT+0000 (UTC) 01:75:11
3512.3 none timeout 0/0 N/A N/A Sun Jun 07 2020 02:05:52 GMT+0000 (UTC) 02:25:79
3512.4 none timeout 0/0 N/A N/A Sun Jun 07 2020 02:05:52 GMT+0000 (UTC) 02:25:79
3512.5 none succeeded 1578/1585 N/A N/A Sun Jun 07 2020 02:05:52 GMT+0000 (UTC) 02:99:28
3512.6 none succeeded 1583/1585 N/A N/A Sun Jun 07 2020 02:05:52 GMT+0000 (UTC) 02:10:73
3512.7 none succeeded 1186/1585 N/A N/A Sun Jun 07 2020 02:05:52 GMT+0000 (UTC) 02:99:57
3512.8 none succeeded 787/1585 N/A N/A Sun Jun 07 2020 02:05:52 GMT+0000 (UTC) 01:69:59
3512.9 none succeeded 1344/1585 N/A N/A Sun Jun 07 2020 02:05:53 GMT+0000 (UTC) 02:01:61
3512.10 none succeeded 1400/1585 N/A N/A Sun Jun 07 2020 02:05:53 GMT+0000 (UTC) 02:12:27
3512.11 none succeeded 1452/1585 N/A N/A Sun Jun 07 2020 02:05:53 GMT+0000 (UTC) 02:09:44
3512.12 none succeeded 1432/1585 N/A N/A Sun Jun 07 2020 02:05:53 GMT+0000 (UTC) 02:13:67
3512.13 none succeeded 1283/1585 N/A N/A Sun Jun 07 2020 02:05:53 GMT+0000 (UTC) 01:89:33
3512.14 none succeeded 1177/1585 N/A N/A Sun Jun 07 2020 02:05:53 GMT+0000 (UTC) 02:99:12
3512.15 none succeeded 1044/1585 N/A N/A Sun Jun 07 2020 02:05:53 GMT+0000 (UTC) 02:92:97
3512.16 none succeeded 1274/1585 N/A N/A Sun Jun 07 2020 02:05:53 GMT+0000 (UTC) 02:91:52
3512.17 none succeeded 1095/1585 N/A N/A Sun Jun 07 2020 02:05:53 GMT+0000 (UTC) 02:94:42
3512.18 none succeeded 1540/1585 N/A N/A Sun Jun 07 2020 02:05:53 GMT+0000 (UTC) 02:00:99
3512.19 none succeeded 1082/1585 N/A N/A Sun Jun 07 2020 02:05:53 GMT+0000 (UTC) 01:80:19
3512.20 none succeeded 1585/1585 N/A N/A Sun Jun 07 2020 02:05:53 GMT+0000 (UTC) 02:99:49
3512.21 none succeeded 1533/1585 N/A N/A Sun Jun 07 2020 02:05:53 GMT+0000 (UTC) 02:08:72
3512.22 none succeeded 1089/1585 N/A N/A Sun Jun 07 2020 02:05:53 GMT+0000 (UTC) 02:95:30
3512.23 none succeeded 1255/1585 N/A N/A Sun Jun 07 2020 02:05:53 GMT+0000 (UTC) 02:92:18
3512.24 none succeeded 1264/1585 N/A N/A Sun Jun 07 2020 02:05:53 GMT+0000 (UTC) 02:95:71
3512.25 none succeeded 1574/1584 N/A N/A Sun Jun 07 2020 02:05:54 GMT+0000 (UTC) 02:17:11
3512.26 none succeeded 1568/1584 N/A N/A Sun Jun 07 2020 02:05:54 GMT+0000 (UTC) 02:23:78
3512.27 none succeeded 991/1584 N/A N/A Sun Jun 07 2020 02:05:54 GMT+0000 (UTC) 01:85:25
3512.28 none succeeded 1355/1584 N/A N/A Sun Jun 07 2020 02:05:54 GMT+0000 (UTC) 02:05:97
3512.29 none succeeded 1299/1584 N/A N/A Sun Jun 07 2020 02:05:54 GMT+0000 (UTC) 02:95:06
3512.30 none succeeded 1576/1584 N/A N/A Sun Jun 07 2020 02:05:54 GMT+0000 (UTC) 02:11:44
3512.31 none succeeded 1575/1584 N/A N/A Sun Jun 07 2020 02:05:54 GMT+0000 (UTC) 02:12:16
3512.32 none timeout 0/0 N/A N/A Sun Jun 07 2020 02:05:54 GMT+0000 (UTC) 02:24:30
3512.33 none timeout 1573/1584 N/A N/A Sun Jun 07 2020 02:05:54 GMT+0000 (UTC) 02:24:52
3512.34 none succeeded 1575/1584 N/A N/A Sun Jun 07 2020 02:05:54 GMT+0000 (UTC) 02:01:48
3512.35 none succeeded 1584/1584 N/A N/A Sun Jun 07 2020 02:05:54 GMT+0000 (UTC) 02:99:56


Need help with Shippable? File an Issue


[ master ] Build UNSTABLE for zephyrproject-rtos/test_results ( install forked junit2html ) on Shippable.com #builds

Shippable.com <noreply@...>
 

SHIPPABLE BUILD REPORT

80
test_results
Branch : master Sha : 9f3b31aa24
Builder : Anas Nashif Triggered By : Anas Nashif
Custom Environment Variables:
JOB_TRIGGERED_BY_NAME="create_test_commit"
JOB_TRIGGERED_BY_ID="125148"
# Runtime Status Tests Branch Coverage Sequence Coverage Triggered at Duration
80.1 none succeeded 838/971 N/A N/A Sat Jun 06 2020 04:07:11 GMT+0000 (UTC) 01:49:43
80.2 none unstable 1653/2274 N/A N/A Sat Jun 06 2020 04:07:11 GMT+0000 (UTC) 01:56:77
80.3 none unstable 2873/4792 N/A N/A Sat Jun 06 2020 04:07:11 GMT+0000 (UTC) 01:67:12
80.4 none unstable 5578/6130 N/A N/A Sat Jun 06 2020 04:07:11 GMT+0000 (UTC) 01:79:55
80.5 none unstable 5898/5946 N/A N/A Sat Jun 06 2020 04:07:11 GMT+0000 (UTC) 01:88:88


Need help with Shippable? File an Issue


[ master ] Build CANCELED for zephyrproject-rtos/ci-test ( ci: Update sdk to 0.11.3 Update sdk to 0.11.3 release and update docker image to get that SDK version. Signed-off-by: Kumar Gala <kumar.gala@linaro.org> ) on Shippable.com #builds

Shippable.com <noreply@...>
 

SHIPPABLE BUILD REPORT

3511
ci-test
Branch : master Sha : 5f9e0cfc3c
Builder : Kumar Gala Triggered By : Kumar Gala
Custom Environment Variables:
JOB_TRIGGERED_BY_NAME="daily-verify"
JOB_TRIGGERED_BY_ID="23790"
# Runtime Status Tests Branch Coverage Sequence Coverage Triggered at Duration
3511.1 none canceled 0/0 N/A N/A Sat Jun 06 2020 02:05:44 GMT+0000 (UTC) 00:02:19
3511.2 none canceled 0/0 N/A N/A Sat Jun 06 2020 02:05:44 GMT+0000 (UTC) 00:02:18
3511.3 none canceled 0/0 N/A N/A Sat Jun 06 2020 02:05:44 GMT+0000 (UTC) 00:02:18
3511.4 none canceled 0/0 N/A N/A Sat Jun 06 2020 02:05:44 GMT+0000 (UTC) 00:02:17
3511.5 none canceled 0/0 N/A N/A Sat Jun 06 2020 02:05:44 GMT+0000 (UTC) 00:02:16
3511.6 none canceled 0/0 N/A N/A Sat Jun 06 2020 02:05:44 GMT+0000 (UTC) 00:02:16
3511.7 none canceled 0/0 N/A N/A Sat Jun 06 2020 02:05:44 GMT+0000 (UTC) 00:02:15
3511.8 none canceled 0/0 N/A N/A Sat Jun 06 2020 02:05:44 GMT+0000 (UTC) 00:02:15
3511.9 none canceled 0/0 N/A N/A Sat Jun 06 2020 02:05:44 GMT+0000 (UTC) 00:02:14
3511.10 none canceled 0/0 N/A N/A Sat Jun 06 2020 02:05:44 GMT+0000 (UTC) 00:02:13
3511.11 none canceled 0/0 N/A N/A Sat Jun 06 2020 02:05:44 GMT+0000 (UTC) 00:02:13
3511.12 none canceled 0/0 N/A N/A Sat Jun 06 2020 02:05:44 GMT+0000 (UTC) 00:02:12
3511.13 none canceled 0/0 N/A N/A Sat Jun 06 2020 02:05:44 GMT+0000 (UTC) 00:02:12
3511.14 none canceled 0/0 N/A N/A Sat Jun 06 2020 02:05:44 GMT+0000 (UTC) 00:02:11
3511.15 none canceled 0/0 N/A N/A Sat Jun 06 2020 02:05:44 GMT+0000 (UTC) 00:02:11
3511.16 none canceled 0/0 N/A N/A Sat Jun 06 2020 02:05:44 GMT+0000 (UTC) 00:02:10
3511.17 none canceled 0/0 N/A N/A Sat Jun 06 2020 02:05:45 GMT+0000 (UTC) 00:02:09
3511.18 none canceled 0/0 N/A N/A Sat Jun 06 2020 02:05:45 GMT+0000 (UTC) 00:02:09
3511.19 none canceled 0/0 N/A N/A Sat Jun 06 2020 02:05:45 GMT+0000 (UTC) 00:02:08
3511.20 none canceled 0/0 N/A N/A Sat Jun 06 2020 02:05:45 GMT+0000 (UTC) 00:02:08
3511.21 none canceled 0/0 N/A N/A Sat Jun 06 2020 02:05:45 GMT+0000 (UTC) 00:02:07
3511.22 none canceled 0/0 N/A N/A Sat Jun 06 2020 02:05:45 GMT+0000 (UTC) 00:02:07
3511.23 none canceled 0/0 N/A N/A Sat Jun 06 2020 02:05:45 GMT+0000 (UTC) 00:02:06
3511.24 none canceled 0/0 N/A N/A Sat Jun 06 2020 02:05:45 GMT+0000 (UTC) 00:02:06
3511.25 none canceled 0/0 N/A N/A Sat Jun 06 2020 02:05:45 GMT+0000 (UTC) 00:02:05
3511.26 none canceled 0/0 N/A N/A Sat Jun 06 2020 02:05:45 GMT+0000 (UTC) 00:02:04
3511.27 none canceled 0/0 N/A N/A Sat Jun 06 2020 02:05:45 GMT+0000 (UTC) 00:02:04
3511.28 none canceled 0/0 N/A N/A Sat Jun 06 2020 02:05:45 GMT+0000 (UTC) 00:02:03
3511.29 none canceled 0/0 N/A N/A Sat Jun 06 2020 02:05:45 GMT+0000 (UTC) 00:02:03
3511.30 none canceled 0/0 N/A N/A Sat Jun 06 2020 02:05:45 GMT+0000 (UTC) 00:02:02
3511.31 none canceled 0/0 N/A N/A Sat Jun 06 2020 02:05:45 GMT+0000 (UTC) 00:00:00
3511.32 none canceled 0/0 N/A N/A Sat Jun 06 2020 02:05:45 GMT+0000 (UTC) 00:00:00
3511.33 none canceled 0/0 N/A N/A Sat Jun 06 2020 02:05:46 GMT+0000 (UTC) 00:00:00
3511.34 none canceled 0/0 N/A N/A Sat Jun 06 2020 02:05:46 GMT+0000 (UTC) 00:00:00
3511.35 none canceled 0/0 N/A N/A Sat Jun 06 2020 02:05:46 GMT+0000 (UTC) 00:00:00


Need help with Shippable? File an Issue


[ master ] Build UNSTABLE for zephyrproject-rtos/test_results ( tests: reel board test results Testing CI system, run tests on hardware reel board v1 Signed-off-by: Maksim Masalski <maksim.masalski@intel.com> ) on Shippable.com #builds

Shippable.com <noreply@...>
 

SHIPPABLE BUILD REPORT

79
test_results
Branch : master Sha : a145b3b290
Builder : Maksim Masalski Triggered By : Anas Nashif
Custom Environment Variables:
JOB_TRIGGERED_BY_NAME="create_test_commit"
JOB_TRIGGERED_BY_ID="125148"
# Runtime Status Tests Branch Coverage Sequence Coverage Triggered at Duration
79.1 none succeeded 838/971 N/A N/A Fri Jun 05 2020 04:07:20 GMT+0000 (UTC) 01:49:36
79.2 none unstable 1654/2274 N/A N/A Fri Jun 05 2020 04:07:20 GMT+0000 (UTC) 01:57:13
79.3 none unstable 2872/4792 N/A N/A Fri Jun 05 2020 04:07:20 GMT+0000 (UTC) 01:67:91
79.4 none unstable 5580/6130 N/A N/A Fri Jun 05 2020 04:07:20 GMT+0000 (UTC) 01:80:88
79.5 none unstable 5899/5946 N/A N/A Fri Jun 05 2020 04:07:20 GMT+0000 (UTC) 01:88:59


Need help with Shippable? File an Issue


[ master ] Build TIMEOUT for zephyrproject-rtos/ci-test ( ci: Update sdk to 0.11.3 Update sdk to 0.11.3 release and update docker image to get that SDK version. Signed-off-by: Kumar Gala <kumar.gala@linaro.org> ) on Shippable.com #builds

Shippable.com <noreply@...>
 

SHIPPABLE BUILD REPORT

3510
ci-test
Branch : master Sha : 5f9e0cfc3c
Builder : Kumar Gala Triggered By : Kumar Gala
Custom Environment Variables:
JOB_TRIGGERED_BY_NAME="daily-verify"
JOB_TRIGGERED_BY_ID="23790"
# Runtime Status Tests Branch Coverage Sequence Coverage Triggered at Duration
3510.1 none succeeded 1367/1585 N/A N/A Fri Jun 05 2020 02:05:47 GMT+0000 (UTC) 01:85:00
3510.2 none succeeded 912/1585 N/A N/A Fri Jun 05 2020 02:05:47 GMT+0000 (UTC) 01:73:62
3510.3 none timeout 0/0 N/A N/A Fri Jun 05 2020 02:05:47 GMT+0000 (UTC) 02:25:81
3510.4 none timeout 0/0 N/A N/A Fri Jun 05 2020 02:05:47 GMT+0000 (UTC) 02:25:80
3510.5 none succeeded 1578/1585 N/A N/A Fri Jun 05 2020 02:05:47 GMT+0000 (UTC) 02:99:51
3510.6 none succeeded 1583/1585 N/A N/A Fri Jun 05 2020 02:05:47 GMT+0000 (UTC) 02:07:97
3510.7 none succeeded 1186/1585 N/A N/A Fri Jun 05 2020 02:05:47 GMT+0000 (UTC) 02:98:09
3510.8 none succeeded 787/1585 N/A N/A Fri Jun 05 2020 02:05:47 GMT+0000 (UTC) 01:66:62
3510.9 none succeeded 1344/1585 N/A N/A Fri Jun 05 2020 02:05:47 GMT+0000 (UTC) 02:06:33
3510.10 none succeeded 1400/1585 N/A N/A Fri Jun 05 2020 02:05:47 GMT+0000 (UTC) 02:05:78
3510.11 none succeeded 1452/1585 N/A N/A Fri Jun 05 2020 02:05:47 GMT+0000 (UTC) 02:08:79
3510.12 none succeeded 1432/1585 N/A N/A Fri Jun 05 2020 02:05:47 GMT+0000 (UTC) 02:16:65
3510.13 none succeeded 1283/1585 N/A N/A Fri Jun 05 2020 02:05:47 GMT+0000 (UTC) 01:88:00
3510.14 none succeeded 1177/1585 N/A N/A Fri Jun 05 2020 02:05:47 GMT+0000 (UTC) 02:02:45
3510.15 none succeeded 1044/1585 N/A N/A Fri Jun 05 2020 02:05:47 GMT+0000 (UTC) 01:89:35
3510.16 none succeeded 1274/1585 N/A N/A Fri Jun 05 2020 02:05:47 GMT+0000 (UTC) 02:91:63
3510.17 none succeeded 1095/1585 N/A N/A Fri Jun 05 2020 02:05:47 GMT+0000 (UTC) 02:93:69
3510.18 none succeeded 1540/1585 N/A N/A Fri Jun 05 2020 02:05:48 GMT+0000 (UTC) 02:98:79
3510.19 none succeeded 1082/1585 N/A N/A Fri Jun 05 2020 02:05:48 GMT+0000 (UTC) 01:82:19
3510.20 none succeeded 1585/1585 N/A N/A Fri Jun 05 2020 02:05:48 GMT+0000 (UTC) 02:00:94
3510.21 none succeeded 1533/1585 N/A N/A Fri Jun 05 2020 02:05:48 GMT+0000 (UTC) 02:05:20
3510.22 none succeeded 1089/1585 N/A N/A Fri Jun 05 2020 02:05:48 GMT+0000 (UTC) 02:96:40
3510.23 none succeeded 1255/1585 N/A N/A Fri Jun 05 2020 02:05:48 GMT+0000 (UTC) 02:92:37
3510.24 none succeeded 1264/1585 N/A N/A Fri Jun 05 2020 02:05:48 GMT+0000 (UTC) 02:98:88
3510.25 none succeeded 1574/1584 N/A N/A Fri Jun 05 2020 02:05:48 GMT+0000 (UTC) 02:18:68
3510.26 none succeeded 1568/1584 N/A N/A Fri Jun 05 2020 02:05:48 GMT+0000 (UTC) 02:20:12
3510.27 none succeeded 991/1584 N/A N/A Fri Jun 05 2020 02:05:48 GMT+0000 (UTC) 01:85:11
3510.28 none succeeded 1355/1584 N/A N/A Fri Jun 05 2020 02:05:48 GMT+0000 (UTC) 02:03:97
3510.29 none succeeded 1299/1584 N/A N/A Fri Jun 05 2020 02:05:48 GMT+0000 (UTC) 02:95:90
3510.30 none succeeded 1576/1584 N/A N/A Fri Jun 05 2020 02:05:48 GMT+0000 (UTC) 02:12:26
3510.31 none succeeded 1575/1584 N/A N/A Fri Jun 05 2020 02:05:48 GMT+0000 (UTC) 02:08:95
3510.32 none timeout 0/0 N/A N/A Fri Jun 05 2020 02:05:48 GMT+0000 (UTC) 02:22:18
3510.33 none timeout 0/0 N/A N/A Fri Jun 05 2020 02:05:48 GMT+0000 (UTC) 02:23:53
3510.34 none succeeded 1575/1584 N/A N/A Fri Jun 05 2020 02:05:48 GMT+0000 (UTC) 02:00:05
3510.35 none succeeded 1584/1584 N/A N/A Fri Jun 05 2020 02:05:48 GMT+0000 (UTC) 02:98:89


Need help with Shippable? File an Issue


[ master ] Build FAILED for zephyrproject-rtos/test_results ( tests: reel board test results Testing CI system, run tests on hardware reel board v1 Signed-off-by: Maksim Masalski <maksim.masalski@intel.com> ) on Shippable.com #builds

Shippable.com <noreply@...>
 

SHIPPABLE BUILD REPORT

78
test_results
Branch : master Sha : a145b3b290
Builder : Maksim Masalski Triggered By : Anas Nashif
Custom Environment Variables:
JOB_TRIGGERED_BY_NAME="create_test_commit"
JOB_TRIGGERED_BY_ID="125148"
# Runtime Status Tests Branch Coverage Sequence Coverage Triggered at Duration
78.1 none succeeded 838/971 N/A N/A Thu Jun 04 2020 04:07:18 GMT+0000 (UTC) 01:48:02
78.2 none unstable 1654/2274 N/A N/A Thu Jun 04 2020 04:07:18 GMT+0000 (UTC) 01:56:55
78.3 none failed 2866/4786 N/A N/A Thu Jun 04 2020 04:07:18 GMT+0000 (UTC) 04:31:61
78.4 none failed 5581/6130 N/A N/A Thu Jun 04 2020 04:07:18 GMT+0000 (UTC) 04:69:68
78.5 none succeeded 5900/5946 N/A N/A Thu Jun 04 2020 04:07:18 GMT+0000 (UTC) 01:87:96


Need help with Shippable? File an Issue


[ master ] Build TIMEOUT for zephyrproject-rtos/ci-test ( ci: Update sdk to 0.11.3 Update sdk to 0.11.3 release and update docker image to get that SDK version. Signed-off-by: Kumar Gala <kumar.gala@linaro.org> ) on Shippable.com #builds

Shippable.com <noreply@...>
 

SHIPPABLE BUILD REPORT

3509
ci-test
Branch : master Sha : 5f9e0cfc3c
Builder : Kumar Gala Triggered By : Kumar Gala
Custom Environment Variables:
JOB_TRIGGERED_BY_NAME="daily-verify"
JOB_TRIGGERED_BY_ID="23790"
# Runtime Status Tests Branch Coverage Sequence Coverage Triggered at Duration
3509.1 none succeeded 1367/1585 N/A N/A Thu Jun 04 2020 02:05:22 GMT+0000 (UTC) 01:85:23
3509.2 none succeeded 912/1585 N/A N/A Thu Jun 04 2020 02:05:22 GMT+0000 (UTC) 01:73:09
3509.3 none timeout 0/0 N/A N/A Thu Jun 04 2020 02:05:22 GMT+0000 (UTC) 02:25:74
3509.4 none timeout 0/0 N/A N/A Thu Jun 04 2020 02:05:22 GMT+0000 (UTC) 02:25:74
3509.5 none succeeded 1578/1585 N/A N/A Thu Jun 04 2020 02:05:22 GMT+0000 (UTC) 02:98:82
3509.6 none succeeded 1583/1585 N/A N/A Thu Jun 04 2020 02:05:23 GMT+0000 (UTC) 02:06:33
3509.7 none succeeded 1186/1585 N/A N/A Thu Jun 04 2020 02:05:23 GMT+0000 (UTC) 02:00:75
3509.8 none succeeded 787/1585 N/A N/A Thu Jun 04 2020 02:05:23 GMT+0000 (UTC) 01:67:11
3509.9 none succeeded 1344/1585 N/A N/A Thu Jun 04 2020 02:05:23 GMT+0000 (UTC) 02:98:82
3509.10 none succeeded 1400/1585 N/A N/A Thu Jun 04 2020 02:05:23 GMT+0000 (UTC) 02:04:30
3509.11 none succeeded 1452/1585 N/A N/A Thu Jun 04 2020 02:05:23 GMT+0000 (UTC) 02:07:14
3509.12 none succeeded 1432/1585 N/A N/A Thu Jun 04 2020 02:05:23 GMT+0000 (UTC) 02:18:67
3509.13 none succeeded 1283/1585 N/A N/A Thu Jun 04 2020 02:05:23 GMT+0000 (UTC) 01:88:74
3509.14 none succeeded 1177/1585 N/A N/A Thu Jun 04 2020 02:05:23 GMT+0000 (UTC) 02:99:48
3509.15 none succeeded 1044/1585 N/A N/A Thu Jun 04 2020 02:05:23 GMT+0000 (UTC) 02:91:47
3509.16 none succeeded 1274/1585 N/A N/A Thu Jun 04 2020 02:05:23 GMT+0000 (UTC) 02:91:65
3509.17 none succeeded 1095/1585 N/A N/A Thu Jun 04 2020 02:05:23 GMT+0000 (UTC) 02:92:32
3509.18 none succeeded 1540/1585 N/A N/A Thu Jun 04 2020 02:05:23 GMT+0000 (UTC) 02:99:33
3509.19 none succeeded 1082/1585 N/A N/A Thu Jun 04 2020 02:05:23 GMT+0000 (UTC) 01:82:93
3509.20 none succeeded 1585/1585 N/A N/A Thu Jun 04 2020 02:05:23 GMT+0000 (UTC) 02:01:57
3509.21 none succeeded 1533/1585 N/A N/A Thu Jun 04 2020 02:05:23 GMT+0000 (UTC) 02:06:59
3509.22 none succeeded 1089/1585 N/A N/A Thu Jun 04 2020 02:05:24 GMT+0000 (UTC) 02:93:03
3509.23 none succeeded 1255/1585 N/A N/A Thu Jun 04 2020 02:05:24 GMT+0000 (UTC) 02:94:23
3509.24 none succeeded 1264/1585 N/A N/A Thu Jun 04 2020 02:05:24 GMT+0000 (UTC) 02:98:68
3509.25 none succeeded 1574/1584 N/A N/A Thu Jun 04 2020 02:05:24 GMT+0000 (UTC) 02:20:88
3509.26 none timeout 1568/1584 N/A N/A Thu Jun 04 2020 02:05:24 GMT+0000 (UTC) 02:24:63
3509.27 none succeeded 991/1584 N/A N/A Thu Jun 04 2020 02:05:24 GMT+0000 (UTC) 01:81:32
3509.28 none succeeded 1355/1584 N/A N/A Thu Jun 04 2020 02:05:24 GMT+0000 (UTC) 02:99:18
3509.29 none succeeded 1299/1584 N/A N/A Thu Jun 04 2020 02:05:24 GMT+0000 (UTC) 01:88:95
3509.30 none succeeded 1576/1584 N/A N/A Thu Jun 04 2020 02:05:24 GMT+0000 (UTC) 02:06:54
3509.31 none succeeded 1575/1584 N/A N/A Thu Jun 04 2020 02:05:24 GMT+0000 (UTC) 02:08:09
3509.32 none timeout 0/0 N/A N/A Thu Jun 04 2020 02:05:24 GMT+0000 (UTC) 02:21:36
3509.33 none timeout 0/0 N/A N/A Thu Jun 04 2020 02:05:24 GMT+0000 (UTC) 02:23:67
3509.34 none succeeded 1575/1584 N/A N/A Thu Jun 04 2020 02:05:24 GMT+0000 (UTC) 02:01:75
3509.35 none succeeded 1584/1584 N/A N/A Thu Jun 04 2020 02:05:24 GMT+0000 (UTC) 02:98:73


Need help with Shippable? File an Issue


[ master ] Build FAILED for zephyrproject-rtos/test_results ( tests: reel board test results Testing CI system, run tests on hardware reel board v1 Signed-off-by: Maksim Masalski <maksim.masalski@intel.com> ) on Shippable.com #builds

Shippable.com <noreply@...>
 

SHIPPABLE BUILD REPORT

77
test_results
Branch : master Sha : a145b3b290
Builder : Maksim Masalski Triggered By : Anas Nashif
Custom Environment Variables:
JOB_TRIGGERED_BY_NAME="create_test_commit"
JOB_TRIGGERED_BY_ID="125148"
# Runtime Status Tests Branch Coverage Sequence Coverage Triggered at Duration
77.1 none succeeded 838/971 N/A N/A Wed Jun 03 2020 04:06:14 GMT+0000 (UTC) 01:49:60
77.2 none unstable 1654/2274 N/A N/A Wed Jun 03 2020 04:06:14 GMT+0000 (UTC) 01:56:32
77.3 none failed 2868/4778 N/A N/A Wed Jun 03 2020 04:06:14 GMT+0000 (UTC) 04:29:24
77.4 none unstable 5581/6130 N/A N/A Wed Jun 03 2020 04:06:14 GMT+0000 (UTC) 01:79:15
77.5 none succeeded 5896/5941 N/A N/A Wed Jun 03 2020 04:06:14 GMT+0000 (UTC) 01:86:75


Need help with Shippable? File an Issue


[ master ] Build TIMEOUT for zephyrproject-rtos/ci-test ( ci: Update sdk to 0.11.3 Update sdk to 0.11.3 release and update docker image to get that SDK version. Signed-off-by: Kumar Gala <kumar.gala@linaro.org> ) on Shippable.com #builds

Shippable.com <noreply@...>
 

SHIPPABLE BUILD REPORT

3508
ci-test
Branch : master Sha : 5f9e0cfc3c
Builder : Kumar Gala Triggered By : Kumar Gala
Custom Environment Variables:
JOB_TRIGGERED_BY_NAME="daily-verify"
JOB_TRIGGERED_BY_ID="23790"
# Runtime Status Tests Branch Coverage Sequence Coverage Triggered at Duration
3508.1 none succeeded 1367/1585 N/A N/A Wed Jun 03 2020 02:05:45 GMT+0000 (UTC) 01:89:44
3508.2 none succeeded 912/1585 N/A N/A Wed Jun 03 2020 02:05:45 GMT+0000 (UTC) 01:74:30
3508.3 none timeout 0/0 N/A N/A Wed Jun 03 2020 02:05:46 GMT+0000 (UTC) 02:24:23
3508.4 none timeout 0/0 N/A N/A Wed Jun 03 2020 02:05:46 GMT+0000 (UTC) 02:24:23
3508.5 none succeeded 1578/1585 N/A N/A Wed Jun 03 2020 02:05:46 GMT+0000 (UTC) 02:95:98
3508.6 none succeeded 1583/1585 N/A N/A Wed Jun 03 2020 02:05:46 GMT+0000 (UTC) 02:03:75
3508.7 none succeeded 1186/1585 N/A N/A Wed Jun 03 2020 02:05:46 GMT+0000 (UTC) 02:96:74
3508.8 none succeeded 787/1585 N/A N/A Wed Jun 03 2020 02:05:46 GMT+0000 (UTC) 01:66:58
3508.9 none succeeded 1344/1585 N/A N/A Wed Jun 03 2020 02:05:46 GMT+0000 (UTC) 02:98:06
3508.10 none succeeded 1400/1585 N/A N/A Wed Jun 03 2020 02:05:46 GMT+0000 (UTC) 02:07:96
3508.11 none succeeded 1452/1585 N/A N/A Wed Jun 03 2020 02:05:46 GMT+0000 (UTC) 02:06:46
3508.12 none succeeded 1432/1585 N/A N/A Wed Jun 03 2020 02:05:46 GMT+0000 (UTC) 02:20:76
3508.13 none succeeded 1283/1585 N/A N/A Wed Jun 03 2020 02:05:46 GMT+0000 (UTC) 01:89:37
3508.14 none succeeded 1177/1585 N/A N/A Wed Jun 03 2020 02:05:46 GMT+0000 (UTC) 02:98:98
3508.15 none succeeded 1044/1585 N/A N/A Wed Jun 03 2020 02:05:46 GMT+0000 (UTC) 02:95:82
3508.16 none succeeded 1274/1585 N/A N/A Wed Jun 03 2020 02:05:46 GMT+0000 (UTC) 02:92:97
3508.17 none succeeded 1095/1585 N/A N/A Wed Jun 03 2020 02:05:46 GMT+0000 (UTC) 02:95:73
3508.18 none succeeded 1540/1585 N/A N/A Wed Jun 03 2020 02:05:46 GMT+0000 (UTC) 02:99:56
3508.19 none succeeded 1082/1585 N/A N/A Wed Jun 03 2020 02:05:47 GMT+0000 (UTC) 01:81:83
3508.20 none succeeded 1585/1585 N/A N/A Wed Jun 03 2020 02:05:47 GMT+0000 (UTC) 02:01:41
3508.21 none succeeded 1533/1585 N/A N/A Wed Jun 03 2020 02:05:47 GMT+0000 (UTC) 02:07:15
3508.22 none succeeded 1089/1585 N/A N/A Wed Jun 03 2020 02:05:47 GMT+0000 (UTC) 02:93:91
3508.23 none succeeded 1255/1585 N/A N/A Wed Jun 03 2020 02:05:47 GMT+0000 (UTC) 02:92:38
3508.24 none succeeded 1264/1585 N/A N/A Wed Jun 03 2020 02:05:47 GMT+0000 (UTC) 02:98:82
3508.25 none succeeded 1574/1584 N/A N/A Wed Jun 03 2020 02:05:47 GMT+0000 (UTC) 02:21:57
3508.26 none succeeded 1568/1584 N/A N/A Wed Jun 03 2020 02:05:47 GMT+0000 (UTC) 02:18:09
3508.27 none succeeded 991/1584 N/A N/A Wed Jun 03 2020 02:05:47 GMT+0000 (UTC) 01:81:80
3508.28 none succeeded 1355/1584 N/A N/A Wed Jun 03 2020 02:05:47 GMT+0000 (UTC) 02:01:44
3508.29 none succeeded 1299/1584 N/A N/A Wed Jun 03 2020 02:05:47 GMT+0000 (UTC) 01:89:61
3508.30 none succeeded 1576/1584 N/A N/A Wed Jun 03 2020 02:05:47 GMT+0000 (UTC) 02:07:30
3508.31 none succeeded 1575/1584 N/A N/A Wed Jun 03 2020 02:05:47 GMT+0000 (UTC) 02:08:83
3508.32 none timeout 0/0 N/A N/A Wed Jun 03 2020 02:05:47 GMT+0000 (UTC) 02:25:78
3508.33 none timeout 0/0 N/A N/A Wed Jun 03 2020 02:05:47 GMT+0000 (UTC) 02:22:28
3508.34 none succeeded 1575/1584 N/A N/A Wed Jun 03 2020 02:05:47 GMT+0000 (UTC) 02:03:51
3508.35 none succeeded 1584/1584 N/A N/A Wed Jun 03 2020 02:05:47 GMT+0000 (UTC) 02:97:27


Need help with Shippable? File an Issue


[ master ] Build FAILED for zephyrproject-rtos/test_results ( tests: reel board test results Testing CI system, run tests on hardware reel board v1 Signed-off-by: Maksim Masalski <maksim.masalski@intel.com> ) on Shippable.com #builds

Shippable.com <noreply@...>
 

SHIPPABLE BUILD REPORT

76
test_results
Branch : master Sha : a145b3b290
Builder : Maksim Masalski Triggered By : Anas Nashif
Custom Environment Variables:
JOB_TRIGGERED_BY_NAME="create_test_commit"
JOB_TRIGGERED_BY_ID="125148"
# Runtime Status Tests Branch Coverage Sequence Coverage Triggered at Duration
76.1 none succeeded 838/971 N/A N/A Tue Jun 02 2020 04:07:05 GMT+0000 (UTC) 01:48:04
76.2 none failed 1653/2274 N/A N/A Tue Jun 02 2020 04:07:05 GMT+0000 (UTC) 03:73:98
76.3 none unstable 2869/4778 N/A N/A Tue Jun 02 2020 04:07:05 GMT+0000 (UTC) 01:66:82
76.4 none failed 5546/6096 N/A N/A Tue Jun 02 2020 04:07:05 GMT+0000 (UTC) 05:70:00
76.5 none unstable 5894/5940 N/A N/A Tue Jun 02 2020 04:07:05 GMT+0000 (UTC) 01:87:16


Need help with Shippable? File an Issue


[ master ] Build TIMEOUT for zephyrproject-rtos/ci-test ( ci: Update sdk to 0.11.3 Update sdk to 0.11.3 release and update docker image to get that SDK version. Signed-off-by: Kumar Gala <kumar.gala@linaro.org> ) on Shippable.com #builds

Shippable.com <noreply@...>
 

SHIPPABLE BUILD REPORT

3507
ci-test
Branch : master Sha : 5f9e0cfc3c
Builder : Kumar Gala Triggered By : Kumar Gala
Custom Environment Variables:
JOB_TRIGGERED_BY_NAME="daily-verify"
JOB_TRIGGERED_BY_ID="23790"
# Runtime Status Tests Branch Coverage Sequence Coverage Triggered at Duration
3507.1 none succeeded 1367/1585 N/A N/A Tue Jun 02 2020 02:05:35 GMT+0000 (UTC) 01:90:83
3507.2 none succeeded 912/1585 N/A N/A Tue Jun 02 2020 02:05:35 GMT+0000 (UTC) 01:75:73
3507.3 none timeout 0/0 N/A N/A Tue Jun 02 2020 02:05:35 GMT+0000 (UTC) 02:24:17
3507.4 none timeout 0/0 N/A N/A Tue Jun 02 2020 02:05:35 GMT+0000 (UTC) 02:24:17
3507.5 none succeeded 1578/1585 N/A N/A Tue Jun 02 2020 02:05:35 GMT+0000 (UTC) 02:96:52
3507.6 none succeeded 1583/1585 N/A N/A Tue Jun 02 2020 02:05:35 GMT+0000 (UTC) 02:12:48
3507.7 none succeeded 1186/1585 N/A N/A Tue Jun 02 2020 02:05:35 GMT+0000 (UTC) 02:98:70
3507.8 none succeeded 787/1585 N/A N/A Tue Jun 02 2020 02:05:35 GMT+0000 (UTC) 01:65:92
3507.9 none succeeded 1344/1585 N/A N/A Tue Jun 02 2020 02:05:35 GMT+0000 (UTC) 02:98:67
3507.10 none succeeded 1400/1585 N/A N/A Tue Jun 02 2020 02:05:35 GMT+0000 (UTC) 02:03:99
3507.11 none succeeded 1452/1585 N/A N/A Tue Jun 02 2020 02:05:35 GMT+0000 (UTC) 02:10:00
3507.12 none succeeded 1432/1585 N/A N/A Tue Jun 02 2020 02:05:35 GMT+0000 (UTC) 02:14:30
3507.13 none succeeded 1283/1585 N/A N/A Tue Jun 02 2020 02:05:36 GMT+0000 (UTC) 01:87:29
3507.14 none failed 0/0 N/A N/A Tue Jun 02 2020 02:05:36 GMT+0000 (UTC) 00:06:69
3507.15 none succeeded 1044/1585 N/A N/A Tue Jun 02 2020 02:05:36 GMT+0000 (UTC) 01:88:92
3507.16 none succeeded 1274/1585 N/A N/A Tue Jun 02 2020 02:05:36 GMT+0000 (UTC) 02:91:71
3507.17 none succeeded 1095/1585 N/A N/A Tue Jun 02 2020 02:05:36 GMT+0000 (UTC) 02:93:02
3507.18 none succeeded 1540/1585 N/A N/A Tue Jun 02 2020 02:05:36 GMT+0000 (UTC) 02:99:24
3507.19 none succeeded 1082/1585 N/A N/A Tue Jun 02 2020 02:05:36 GMT+0000 (UTC) 01:81:44
3507.20 none succeeded 1585/1585 N/A N/A Tue Jun 02 2020 02:05:36 GMT+0000 (UTC) 02:02:36
3507.21 none succeeded 1533/1585 N/A N/A Tue Jun 02 2020 02:05:36 GMT+0000 (UTC) 02:02:00
3507.22 none succeeded 1089/1585 N/A N/A Tue Jun 02 2020 02:05:36 GMT+0000 (UTC) 01:90:74
3507.23 none succeeded 1255/1585 N/A N/A Tue Jun 02 2020 02:05:36 GMT+0000 (UTC) 01:87:21
3507.24 none succeeded 1264/1585 N/A N/A Tue Jun 02 2020 02:05:36 GMT+0000 (UTC) 02:92:35
3507.25 none timeout 0/0 N/A N/A Tue Jun 02 2020 02:05:36 GMT+0000 (UTC) 02:22:07
3507.26 none succeeded 1568/1584 N/A N/A Tue Jun 02 2020 02:05:36 GMT+0000 (UTC) 02:21:37
3507.27 none succeeded 991/1584 N/A N/A Tue Jun 02 2020 02:05:36 GMT+0000 (UTC) 01:81:50
3507.28 none succeeded 1355/1584 N/A N/A Tue Jun 02 2020 02:05:36 GMT+0000 (UTC) 02:97:15
3507.29 none succeeded 1299/1584 N/A N/A Tue Jun 02 2020 02:05:36 GMT+0000 (UTC) 02:93:96
3507.30 none succeeded 1576/1584 N/A N/A Tue Jun 02 2020 02:05:37 GMT+0000 (UTC) 02:09:68
3507.31 none succeeded 1575/1584 N/A N/A Tue Jun 02 2020 02:05:37 GMT+0000 (UTC) 02:07:90
3507.32 none timeout 0/0 N/A N/A Tue Jun 02 2020 02:05:37 GMT+0000 (UTC) 02:24:28
3507.33 none timeout 0/0 N/A N/A Tue Jun 02 2020 02:05:37 GMT+0000 (UTC) 02:23:59
3507.34 none succeeded 1575/1584 N/A N/A Tue Jun 02 2020 02:05:37 GMT+0000 (UTC) 02:11:57
3507.35 none succeeded 1584/1584 N/A N/A Tue Jun 02 2020 02:05:37 GMT+0000 (UTC) 02:97:46


Need help with Shippable? File an Issue

241 - 260 of 2728