Date   

[ master ] Build TIMEOUT for zephyrproject-rtos/ci-test ( ci: Update sdk to 0.11.3 Update sdk to 0.11.3 release and update docker image to get that SDK version. Signed-off-by: Kumar Gala <kumar.gala@linaro.org> ) on Shippable.com #builds

Shippable.com <noreply@...>
 

SHIPPABLE BUILD REPORT

3523
ci-test
Branch : master Sha : 5f9e0cfc3c
Builder : Kumar Gala Triggered By : Kumar Gala
Custom Environment Variables:
JOB_TRIGGERED_BY_NAME="daily-verify"
JOB_TRIGGERED_BY_ID="23790"
# Runtime Status Tests Branch Coverage Sequence Coverage Triggered at Duration
3523.1 none succeeded 1462/1682 N/A N/A Thu Jun 18 2020 02:05:15 GMT+0000 (UTC) 02:94:57
3523.2 none succeeded 974/1682 N/A N/A Thu Jun 18 2020 02:05:15 GMT+0000 (UTC) 01:78:53
3523.3 none timeout 0/0 N/A N/A Thu Jun 18 2020 02:05:15 GMT+0000 (UTC) 02:21:88
3523.4 none timeout 0/0 N/A N/A Thu Jun 18 2020 02:05:15 GMT+0000 (UTC) 02:21:88
3523.5 none succeeded 1675/1682 N/A N/A Thu Jun 18 2020 02:05:15 GMT+0000 (UTC) 02:05:07
3523.6 none succeeded 1681/1682 N/A N/A Thu Jun 18 2020 02:05:15 GMT+0000 (UTC) 02:15:28
3523.7 none succeeded 1068/1681 N/A N/A Thu Jun 18 2020 02:05:15 GMT+0000 (UTC) 02:03:71
3523.8 none succeeded 997/1681 N/A N/A Thu Jun 18 2020 02:05:15 GMT+0000 (UTC) 01:77:98
3523.9 none succeeded 1404/1681 N/A N/A Thu Jun 18 2020 02:05:15 GMT+0000 (UTC) 02:06:41
3523.10 none succeeded 1431/1681 N/A N/A Thu Jun 18 2020 02:05:15 GMT+0000 (UTC) 02:11:52
3523.11 none succeeded 1662/1681 N/A N/A Thu Jun 18 2020 02:05:16 GMT+0000 (UTC) 02:18:89
3523.12 none succeeded 1470/1681 N/A N/A Thu Jun 18 2020 02:05:16 GMT+0000 (UTC) 02:19:25
3523.13 none succeeded 1345/1681 N/A N/A Thu Jun 18 2020 02:05:16 GMT+0000 (UTC) 02:06:37
3523.14 none succeeded 1253/1681 N/A N/A Thu Jun 18 2020 02:05:16 GMT+0000 (UTC) 02:95:09
3523.15 none succeeded 1159/1681 N/A N/A Thu Jun 18 2020 02:05:16 GMT+0000 (UTC) 01:86:34
3523.16 none succeeded 1438/1681 N/A N/A Thu Jun 18 2020 02:05:16 GMT+0000 (UTC) 02:06:57
3523.17 none succeeded 1140/1681 N/A N/A Thu Jun 18 2020 02:05:16 GMT+0000 (UTC) 02:93:76
3523.18 none succeeded 1657/1681 N/A N/A Thu Jun 18 2020 02:05:16 GMT+0000 (UTC) 02:13:65
3523.19 none succeeded 1155/1681 N/A N/A Thu Jun 18 2020 02:05:16 GMT+0000 (UTC) 01:89:57
3523.20 none succeeded 1652/1681 N/A N/A Thu Jun 18 2020 02:05:16 GMT+0000 (UTC) 02:06:86
3523.21 none succeeded 1482/1681 N/A N/A Thu Jun 18 2020 02:05:16 GMT+0000 (UTC) 02:09:69
3523.22 none succeeded 1205/1681 N/A N/A Thu Jun 18 2020 02:05:16 GMT+0000 (UTC) 02:98:03
3523.23 none succeeded 1220/1681 N/A N/A Thu Jun 18 2020 02:05:16 GMT+0000 (UTC) 02:95:85
3523.24 none succeeded 1303/1681 N/A N/A Thu Jun 18 2020 02:05:16 GMT+0000 (UTC) 02:03:52
3523.25 none timeout 0/0 N/A N/A Thu Jun 18 2020 02:05:16 GMT+0000 (UTC) 02:21:77
3523.26 none timeout 0/0 N/A N/A Thu Jun 18 2020 02:05:16 GMT+0000 (UTC) 02:21:76
3523.27 none succeeded 1067/1681 N/A N/A Thu Jun 18 2020 02:05:16 GMT+0000 (UTC) 02:95:04
3523.28 none succeeded 1447/1681 N/A N/A Thu Jun 18 2020 02:05:16 GMT+0000 (UTC) 02:12:99
3523.29 none succeeded 1391/1681 N/A N/A Thu Jun 18 2020 02:05:17 GMT+0000 (UTC) 02:99:56
3523.30 none succeeded 1673/1681 N/A N/A Thu Jun 18 2020 02:05:17 GMT+0000 (UTC) 02:18:91
3523.31 none succeeded 1672/1681 N/A N/A Thu Jun 18 2020 02:05:17 GMT+0000 (UTC) 02:24:35
3523.32 none timeout 0/0 N/A N/A Thu Jun 18 2020 02:05:17 GMT+0000 (UTC) 02:24:35
3523.33 none timeout 0/0 N/A N/A Thu Jun 18 2020 02:05:17 GMT+0000 (UTC) 02:21:48
3523.34 none succeeded 1671/1681 N/A N/A Thu Jun 18 2020 02:05:17 GMT+0000 (UTC) 02:13:03
3523.35 none succeeded 1681/1681 N/A N/A Thu Jun 18 2020 02:05:17 GMT+0000 (UTC) 02:04:24


Need help with Shippable? File an Issue


[ master ] Build SUCCEEDED for zephyrproject-rtos/test_results ( zephyr-v2.3.0-361-gcf72fe8fe9: stm32 results Non reg result analysis on last run: (verdicts: T/p: Passed, F/f: Failed, t:timeout) samples/subsys/nvs/sample.nvs.basic, nucleo_l4r5zi (instable: pptptttttpppttttt) tests/subsys/logging/log_immediate/logging.log_immediate.clean_output, nucleo_f207zg tests/subsys/logging/log_immediate/logging.log_immediate.clean_output, nucleo_f429zi (instable: ppppptpppppptppppp) Total: 19 test(s) failed out of 1522 tests run 1 regression(s) on stable test Signed-off-by: Erwan Gouriou <erwan.gouriou@linaro.org> ) on Shippable.com #builds

Shippable.com <noreply@...>
 

SHIPPABLE BUILD REPORT

97
test_results
Branch : master Sha : 970d1a13d2
Builder : Erwan Gouriou Triggered By : Anas Nashif
Custom Environment Variables:
JOB_TRIGGERED_BY_NAME="create_test_commit"
JOB_TRIGGERED_BY_ID="125148"
# Runtime Status Tests Branch Coverage Sequence Coverage Triggered at Duration
97.1 none succeeded 0/0 N/A N/A Thu Jun 18 2020 04:06:47 GMT+0000 (UTC) 00:26:68
97.2 none succeeded 0/0 N/A N/A Thu Jun 18 2020 04:06:47 GMT+0000 (UTC) 00:22:15
97.3 none succeeded 0/0 N/A N/A Thu Jun 18 2020 04:06:48 GMT+0000 (UTC) 00:20:89
97.4 none succeeded 0/0 N/A N/A Thu Jun 18 2020 04:06:48 GMT+0000 (UTC) 00:22:08
97.5 none succeeded 0/0 N/A N/A Thu Jun 18 2020 04:06:48 GMT+0000 (UTC) 00:21:61
97.6 none succeeded 0/0 N/A N/A Thu Jun 18 2020 04:06:48 GMT+0000 (UTC) 00:23:74
97.7 none succeeded 0/0 N/A N/A Thu Jun 18 2020 04:06:48 GMT+0000 (UTC) 00:22:10
97.8 none succeeded 0/0 N/A N/A Thu Jun 18 2020 04:06:48 GMT+0000 (UTC) 00:27:13
97.9 none succeeded 0/0 N/A N/A Thu Jun 18 2020 04:06:48 GMT+0000 (UTC) 00:29:32
97.10 none succeeded 0/0 N/A N/A Thu Jun 18 2020 04:06:48 GMT+0000 (UTC) 00:27:30


Need help with Shippable? File an Issue


[ master ] Build TIMEOUT for zephyrproject-rtos/ci-test ( ci: Update sdk to 0.11.3 Update sdk to 0.11.3 release and update docker image to get that SDK version. Signed-off-by: Kumar Gala <kumar.gala@linaro.org> ) on Shippable.com #builds

Shippable.com <noreply@...>
 

SHIPPABLE BUILD REPORT

3522
ci-test
Branch : master Sha : 5f9e0cfc3c
Builder : Kumar Gala Triggered By : Kumar Gala
Custom Environment Variables:
JOB_TRIGGERED_BY_NAME="daily-verify"
JOB_TRIGGERED_BY_ID="23790"
# Runtime Status Tests Branch Coverage Sequence Coverage Triggered at Duration
3522.1 none succeeded 1455/1675 N/A N/A Wed Jun 17 2020 02:05:41 GMT+0000 (UTC) 02:93:76
3522.2 none succeeded 970/1675 N/A N/A Wed Jun 17 2020 02:05:41 GMT+0000 (UTC) 01:75:70
3522.3 none timeout 0/0 N/A N/A Wed Jun 17 2020 02:05:41 GMT+0000 (UTC) 02:21:33
3522.4 none timeout 0/0 N/A N/A Wed Jun 17 2020 02:05:41 GMT+0000 (UTC) 02:21:32
3522.5 none succeeded 1668/1675 N/A N/A Wed Jun 17 2020 02:05:42 GMT+0000 (UTC) 02:92:44
3522.6 none succeeded 1674/1675 N/A N/A Wed Jun 17 2020 02:05:42 GMT+0000 (UTC) 02:15:91
3522.7 none succeeded 1065/1675 N/A N/A Wed Jun 17 2020 02:05:42 GMT+0000 (UTC) 02:09:25
3522.8 none succeeded 997/1675 N/A N/A Wed Jun 17 2020 02:05:42 GMT+0000 (UTC) 01:78:01
3522.9 none succeeded 1399/1675 N/A N/A Wed Jun 17 2020 02:05:42 GMT+0000 (UTC) 02:05:86
3522.10 none succeeded 1425/1675 N/A N/A Wed Jun 17 2020 02:05:42 GMT+0000 (UTC) 02:13:69
3522.11 none succeeded 1656/1675 N/A N/A Wed Jun 17 2020 02:05:42 GMT+0000 (UTC) 02:18:95
3522.12 none succeeded 1464/1675 N/A N/A Wed Jun 17 2020 02:05:42 GMT+0000 (UTC) 02:18:84
3522.13 none succeeded 1341/1675 N/A N/A Wed Jun 17 2020 02:05:42 GMT+0000 (UTC) 02:07:11
3522.14 none succeeded 1241/1675 N/A N/A Wed Jun 17 2020 02:05:42 GMT+0000 (UTC) 02:05:79
3522.15 none succeeded 1162/1675 N/A N/A Wed Jun 17 2020 02:05:42 GMT+0000 (UTC) 01:88:56
3522.16 none succeeded 1434/1674 N/A N/A Wed Jun 17 2020 02:05:42 GMT+0000 (UTC) 02:08:60
3522.17 none succeeded 1136/1674 N/A N/A Wed Jun 17 2020 02:05:42 GMT+0000 (UTC) 02:95:92
3522.18 none succeeded 1649/1674 N/A N/A Wed Jun 17 2020 02:05:42 GMT+0000 (UTC) 02:09:39
3522.19 none succeeded 1150/1674 N/A N/A Wed Jun 17 2020 02:05:42 GMT+0000 (UTC) 01:88:89
3522.20 none succeeded 1645/1674 N/A N/A Wed Jun 17 2020 02:05:42 GMT+0000 (UTC) 02:07:12
3522.21 none succeeded 1472/1674 N/A N/A Wed Jun 17 2020 02:05:42 GMT+0000 (UTC) 02:13:84
3522.22 none succeeded 1202/1674 N/A N/A Wed Jun 17 2020 02:05:42 GMT+0000 (UTC) 02:96:75
3522.23 none succeeded 1214/1674 N/A N/A Wed Jun 17 2020 02:05:42 GMT+0000 (UTC) 02:93:03
3522.24 none succeeded 1297/1674 N/A N/A Wed Jun 17 2020 02:05:42 GMT+0000 (UTC) 02:02:06
3522.25 none timeout 0/0 N/A N/A Wed Jun 17 2020 02:05:43 GMT+0000 (UTC) 02:20:17
3522.26 none timeout 0/0 N/A N/A Wed Jun 17 2020 02:05:43 GMT+0000 (UTC) 02:20:16
3522.27 none succeeded 1064/1674 N/A N/A Wed Jun 17 2020 02:05:43 GMT+0000 (UTC) 02:92:26
3522.28 none succeeded 1441/1674 N/A N/A Wed Jun 17 2020 02:05:43 GMT+0000 (UTC) 02:11:65
3522.29 none succeeded 1385/1674 N/A N/A Wed Jun 17 2020 02:05:43 GMT+0000 (UTC) 02:99:12
3522.30 none succeeded 1666/1674 N/A N/A Wed Jun 17 2020 02:05:43 GMT+0000 (UTC) 02:19:12
3522.31 none timeout 0/0 N/A N/A Wed Jun 17 2020 02:05:43 GMT+0000 (UTC) 02:21:63
3522.32 none timeout 0/0 N/A N/A Wed Jun 17 2020 02:05:43 GMT+0000 (UTC) 02:22:25
3522.33 none timeout 0/0 N/A N/A Wed Jun 17 2020 02:05:43 GMT+0000 (UTC) 02:23:70
3522.34 none succeeded 1664/1674 N/A N/A Wed Jun 17 2020 02:05:43 GMT+0000 (UTC) 02:13:58
3522.35 none succeeded 1674/1674 N/A N/A Wed Jun 17 2020 02:05:43 GMT+0000 (UTC) 02:03:86


Need help with Shippable? File an Issue


[ master ] Build SUCCEEDED for zephyrproject-rtos/test_results ( zephyr-v2.3.0-361-gcf72fe8fe9: stm32 results Non reg result analysis on last run: (verdicts: T/p: Passed, F/f: Failed, t:timeout) samples/subsys/nvs/sample.nvs.basic, nucleo_l4r5zi (instable: pptptttttpppttttt) tests/subsys/logging/log_immediate/logging.log_immediate.clean_output, nucleo_f207zg tests/subsys/logging/log_immediate/logging.log_immediate.clean_output, nucleo_f429zi (instable: ppppptpppppptppppp) Total: 19 test(s) failed out of 1522 tests run 1 regression(s) on stable test Signed-off-by: Erwan Gouriou <erwan.gouriou@linaro.org> ) on Shippable.com #builds

Shippable.com <noreply@...>
 

SHIPPABLE BUILD REPORT

96
test_results
Branch : master Sha : 970d1a13d2
Builder : Erwan Gouriou Triggered By : Anas Nashif
Custom Environment Variables:
JOB_TRIGGERED_BY_NAME="create_test_commit"
JOB_TRIGGERED_BY_ID="125148"
# Runtime Status Tests Branch Coverage Sequence Coverage Triggered at Duration
96.1 none succeeded 0/0 N/A N/A Wed Jun 17 2020 04:07:11 GMT+0000 (UTC) 00:22:25
96.2 none succeeded 0/0 N/A N/A Wed Jun 17 2020 04:07:11 GMT+0000 (UTC) 00:19:39
96.3 none succeeded 0/0 N/A N/A Wed Jun 17 2020 04:07:11 GMT+0000 (UTC) 00:16:81
96.4 none succeeded 0/0 N/A N/A Wed Jun 17 2020 04:07:12 GMT+0000 (UTC) 00:20:75
96.5 none succeeded 0/0 N/A N/A Wed Jun 17 2020 04:07:12 GMT+0000 (UTC) 00:22:13
96.6 none succeeded 0/0 N/A N/A Wed Jun 17 2020 04:07:12 GMT+0000 (UTC) 00:21:33
96.7 none succeeded 0/0 N/A N/A Wed Jun 17 2020 04:07:12 GMT+0000 (UTC) 00:25:78
96.8 none succeeded 0/0 N/A N/A Wed Jun 17 2020 04:07:12 GMT+0000 (UTC) 00:22:35
96.9 none succeeded 0/0 N/A N/A Wed Jun 17 2020 04:07:12 GMT+0000 (UTC) 01:30:17
96.10 none succeeded 0/0 N/A N/A Wed Jun 17 2020 04:07:12 GMT+0000 (UTC) 00:25:07


Need help with Shippable? File an Issue


[ master ] Build TIMEOUT for zephyrproject-rtos/ci-test ( ci: Update sdk to 0.11.3 Update sdk to 0.11.3 release and update docker image to get that SDK version. Signed-off-by: Kumar Gala <kumar.gala@linaro.org> ) on Shippable.com #builds

Shippable.com <noreply@...>
 

SHIPPABLE BUILD REPORT

3521
ci-test
Branch : master Sha : 5f9e0cfc3c
Builder : Kumar Gala Triggered By : Kumar Gala
Custom Environment Variables:
JOB_TRIGGERED_BY_NAME="daily-verify"
JOB_TRIGGERED_BY_ID="23790"
# Runtime Status Tests Branch Coverage Sequence Coverage Triggered at Duration
3521.1 none failed 1448/1667 N/A N/A Tue Jun 16 2020 02:05:11 GMT+0000 (UTC) 02:99:56
3521.2 none succeeded 966/1667 N/A N/A Tue Jun 16 2020 02:05:11 GMT+0000 (UTC) 01:77:31
3521.3 none timeout 0/0 N/A N/A Tue Jun 16 2020 02:05:11 GMT+0000 (UTC) 02:20:07
3521.4 none timeout 0/0 N/A N/A Tue Jun 16 2020 02:05:11 GMT+0000 (UTC) 02:20:06
3521.5 none succeeded 1660/1667 N/A N/A Tue Jun 16 2020 02:05:11 GMT+0000 (UTC) 02:06:48
3521.6 none succeeded 1666/1667 N/A N/A Tue Jun 16 2020 02:05:11 GMT+0000 (UTC) 02:13:69
3521.7 none succeeded 1051/1667 N/A N/A Tue Jun 16 2020 02:05:11 GMT+0000 (UTC) 02:00:95
3521.8 none succeeded 1003/1667 N/A N/A Tue Jun 16 2020 02:05:11 GMT+0000 (UTC) 01:76:84
3521.9 none succeeded 1387/1667 N/A N/A Tue Jun 16 2020 02:05:11 GMT+0000 (UTC) 02:04:53
3521.10 none succeeded 1426/1667 N/A N/A Tue Jun 16 2020 02:05:11 GMT+0000 (UTC) 02:11:51
3521.11 none succeeded 1647/1667 N/A N/A Tue Jun 16 2020 02:05:11 GMT+0000 (UTC) 02:17:23
3521.12 none succeeded 1450/1667 N/A N/A Tue Jun 16 2020 02:05:11 GMT+0000 (UTC) 02:16:48
3521.13 none succeeded 1342/1667 N/A N/A Tue Jun 16 2020 02:05:12 GMT+0000 (UTC) 02:06:36
3521.14 none succeeded 1218/1667 N/A N/A Tue Jun 16 2020 02:05:12 GMT+0000 (UTC) 02:99:35
3521.15 none succeeded 1170/1667 N/A N/A Tue Jun 16 2020 02:05:12 GMT+0000 (UTC) 01:84:18
3521.16 none succeeded 1425/1667 N/A N/A Tue Jun 16 2020 02:05:12 GMT+0000 (UTC) 02:05:93
3521.17 none succeeded 1136/1667 N/A N/A Tue Jun 16 2020 02:05:12 GMT+0000 (UTC) 02:92:14
3521.18 none succeeded 1636/1667 N/A N/A Tue Jun 16 2020 02:05:12 GMT+0000 (UTC) 02:06:87
3521.19 none succeeded 1150/1667 N/A N/A Tue Jun 16 2020 02:05:12 GMT+0000 (UTC) 01:85:82
3521.20 none succeeded 1638/1667 N/A N/A Tue Jun 16 2020 02:05:12 GMT+0000 (UTC) 02:09:43
3521.21 none succeeded 1460/1667 N/A N/A Tue Jun 16 2020 02:05:12 GMT+0000 (UTC) 02:08:99
3521.22 none succeeded 1205/1667 N/A N/A Tue Jun 16 2020 02:05:12 GMT+0000 (UTC) 02:97:43
3521.23 none succeeded 1210/1667 N/A N/A Tue Jun 16 2020 02:05:12 GMT+0000 (UTC) 02:94:13
3521.24 none succeeded 1292/1667 N/A N/A Tue Jun 16 2020 02:05:12 GMT+0000 (UTC) 02:99:63
3521.25 none timeout 0/0 N/A N/A Tue Jun 16 2020 02:05:12 GMT+0000 (UTC) 02:25:96
3521.26 none succeeded 1580/1667 N/A N/A Tue Jun 16 2020 02:05:12 GMT+0000 (UTC) 02:24:21
3521.27 none succeeded 1060/1667 N/A N/A Tue Jun 16 2020 02:05:12 GMT+0000 (UTC) 02:92:02
3521.28 none succeeded 1435/1667 N/A N/A Tue Jun 16 2020 02:05:12 GMT+0000 (UTC) 02:11:38
3521.29 none succeeded 1378/1666 N/A N/A Tue Jun 16 2020 02:05:12 GMT+0000 (UTC) 02:98:75
3521.30 none succeeded 1658/1666 N/A N/A Tue Jun 16 2020 02:05:12 GMT+0000 (UTC) 02:14:17
3521.31 none timeout 1657/1666 N/A N/A Tue Jun 16 2020 02:05:13 GMT+0000 (UTC) 02:23:82
3521.32 none timeout 0/0 N/A N/A Tue Jun 16 2020 02:05:13 GMT+0000 (UTC) 02:23:76
3521.33 none timeout 0/0 N/A N/A Tue Jun 16 2020 02:05:13 GMT+0000 (UTC) 02:21:69
3521.34 none succeeded 1656/1666 N/A N/A Tue Jun 16 2020 02:05:13 GMT+0000 (UTC) 02:08:92
3521.35 none succeeded 1666/1666 N/A N/A Tue Jun 16 2020 02:05:13 GMT+0000 (UTC) 02:03:53


Need help with Shippable? File an Issue


[ master ] Build SUCCEEDED for zephyrproject-rtos/test_results ( cleanup: Do not upload sanitycheck*.xml files Those files are not needed. Signed-off-by: Anas Nashif <anas.nashif@intel.com> ) on Shippable.com #builds

Shippable.com <noreply@...>
 

SHIPPABLE BUILD REPORT

95
test_results
Branch : master Sha : 28125a23e7
Builder : Anas Nashif Triggered By : Anas Nashif
Custom Environment Variables:
JOB_TRIGGERED_BY_NAME="create_test_commit"
JOB_TRIGGERED_BY_ID="125148"
# Runtime Status Tests Branch Coverage Sequence Coverage Triggered at Duration
95.1 none succeeded 0/0 N/A N/A Tue Jun 16 2020 04:07:53 GMT+0000 (UTC) 00:21:84
95.2 none succeeded 0/0 N/A N/A Tue Jun 16 2020 04:07:53 GMT+0000 (UTC) 00:17:43
95.3 none succeeded 0/0 N/A N/A Tue Jun 16 2020 04:07:53 GMT+0000 (UTC) 00:19:33
95.4 none succeeded 0/0 N/A N/A Tue Jun 16 2020 04:07:53 GMT+0000 (UTC) 00:22:96
95.5 none succeeded 0/0 N/A N/A Tue Jun 16 2020 04:07:53 GMT+0000 (UTC) 00:21:72
95.6 none succeeded 0/0 N/A N/A Tue Jun 16 2020 04:07:53 GMT+0000 (UTC) 00:19:65
95.7 none succeeded 0/0 N/A N/A Tue Jun 16 2020 04:07:53 GMT+0000 (UTC) 00:25:05
95.8 none succeeded 0/0 N/A N/A Tue Jun 16 2020 04:07:53 GMT+0000 (UTC) 00:25:22
95.9 none succeeded 0/0 N/A N/A Tue Jun 16 2020 04:07:53 GMT+0000 (UTC) 00:28:03
95.10 none succeeded 0/0 N/A N/A Tue Jun 16 2020 04:07:53 GMT+0000 (UTC) 00:29:10


Need help with Shippable? File an Issue


[ master ] Build TIMEOUT for zephyrproject-rtos/ci-test ( ci: Update sdk to 0.11.3 Update sdk to 0.11.3 release and update docker image to get that SDK version. Signed-off-by: Kumar Gala <kumar.gala@linaro.org> ) on Shippable.com #builds

Shippable.com <noreply@...>
 

SHIPPABLE BUILD REPORT

3520
ci-test
Branch : master Sha : 5f9e0cfc3c
Builder : Kumar Gala Triggered By : Kumar Gala
Custom Environment Variables:
JOB_TRIGGERED_BY_NAME="daily-verify"
JOB_TRIGGERED_BY_ID="23790"
# Runtime Status Tests Branch Coverage Sequence Coverage Triggered at Duration
3520.1 none failed 1436/1655 N/A N/A Mon Jun 15 2020 02:05:08 GMT+0000 (UTC) 02:01:56
3520.2 none succeeded 954/1655 N/A N/A Mon Jun 15 2020 02:05:08 GMT+0000 (UTC) 01:80:24
3520.3 none timeout 0/0 N/A N/A Mon Jun 15 2020 02:05:08 GMT+0000 (UTC) 02:25:73
3520.4 none timeout 0/0 N/A N/A Mon Jun 15 2020 02:05:08 GMT+0000 (UTC) 02:25:73
3520.5 none succeeded 1648/1655 N/A N/A Mon Jun 15 2020 02:05:08 GMT+0000 (UTC) 02:03:86
3520.6 none succeeded 1654/1655 N/A N/A Mon Jun 15 2020 02:05:08 GMT+0000 (UTC) 02:14:45
3520.7 none succeeded 1121/1655 N/A N/A Mon Jun 15 2020 02:05:09 GMT+0000 (UTC) 02:06:55
3520.8 none succeeded 921/1655 N/A N/A Mon Jun 15 2020 02:05:09 GMT+0000 (UTC) 01:73:94
3520.9 none succeeded 1415/1655 N/A N/A Mon Jun 15 2020 02:05:09 GMT+0000 (UTC) 02:03:74
3520.10 none succeeded 1376/1655 N/A N/A Mon Jun 15 2020 02:05:09 GMT+0000 (UTC) 02:10:76
3520.11 none succeeded 1623/1655 N/A N/A Mon Jun 15 2020 02:05:09 GMT+0000 (UTC) 02:16:45
3520.12 none succeeded 1475/1655 N/A N/A Mon Jun 15 2020 02:05:09 GMT+0000 (UTC) 02:18:90
3520.13 none succeeded 1291/1655 N/A N/A Mon Jun 15 2020 02:05:09 GMT+0000 (UTC) 02:99:60
3520.14 none succeeded 1339/1655 N/A N/A Mon Jun 15 2020 02:05:09 GMT+0000 (UTC) 02:14:53
3520.15 none succeeded 1068/1655 N/A N/A Mon Jun 15 2020 02:05:09 GMT+0000 (UTC) 01:80:89
3520.16 none succeeded 1379/1655 N/A N/A Mon Jun 15 2020 02:05:09 GMT+0000 (UTC) 02:00:77
3520.17 none succeeded 1159/1655 N/A N/A Mon Jun 15 2020 02:05:09 GMT+0000 (UTC) 02:99:14
3520.18 none succeeded 1597/1655 N/A N/A Mon Jun 15 2020 02:05:09 GMT+0000 (UTC) 02:04:67
3520.19 none succeeded 1143/1655 N/A N/A Mon Jun 15 2020 02:05:09 GMT+0000 (UTC) 01:86:75
3520.20 none succeeded 1604/1655 N/A N/A Mon Jun 15 2020 02:05:09 GMT+0000 (UTC) 02:06:40
3520.21 none succeeded 1560/1655 N/A N/A Mon Jun 15 2020 02:05:10 GMT+0000 (UTC) 02:10:29
3520.22 none succeeded 1082/1655 N/A N/A Mon Jun 15 2020 02:05:10 GMT+0000 (UTC) 02:95:13
3520.23 none succeeded 1197/1655 N/A N/A Mon Jun 15 2020 02:05:10 GMT+0000 (UTC) 02:99:37
3520.24 none succeeded 1302/1655 N/A N/A Mon Jun 15 2020 02:05:10 GMT+0000 (UTC) 02:01:76
3520.25 none succeeded 1607/1654 N/A N/A Mon Jun 15 2020 02:05:10 GMT+0000 (UTC) 02:22:94
3520.26 none succeeded 1595/1654 N/A N/A Mon Jun 15 2020 02:05:10 GMT+0000 (UTC) 02:24:32
3520.27 none succeeded 1104/1654 N/A N/A Mon Jun 15 2020 02:05:10 GMT+0000 (UTC) 02:00:00
3520.28 none succeeded 1336/1654 N/A N/A Mon Jun 15 2020 02:05:10 GMT+0000 (UTC) 02:05:74
3520.29 none succeeded 1402/1654 N/A N/A Mon Jun 15 2020 02:05:10 GMT+0000 (UTC) 02:06:83
3520.30 none succeeded 1613/1654 N/A N/A Mon Jun 15 2020 02:05:10 GMT+0000 (UTC) 02:15:75
3520.31 none succeeded 1642/1654 N/A N/A Mon Jun 15 2020 02:05:10 GMT+0000 (UTC) 02:08:64
3520.32 none timeout 0/0 N/A N/A Mon Jun 15 2020 02:05:10 GMT+0000 (UTC) 02:25:79
3520.33 none timeout 0/0 N/A N/A Mon Jun 15 2020 02:05:10 GMT+0000 (UTC) 02:24:23
3520.34 none succeeded 1644/1654 N/A N/A Mon Jun 15 2020 02:05:10 GMT+0000 (UTC) 02:09:40
3520.35 none succeeded 1654/1654 N/A N/A Mon Jun 15 2020 02:05:10 GMT+0000 (UTC) 02:05:83


Need help with Shippable? File an Issue


[ master ] Build SUCCEEDED for zephyrproject-rtos/test_results ( zephyr-v2.3.0-327-g636d6cd9cd: stm32 results Non reg result analysis on last run: (verdicts: T/p: Passed, F/f: Failed, t:timeout) Total: 16 test(s) failed out of 1506 tests run 0 regression(s) on stable test Signed-off-by: Erwan Gouriou <erwan.gouriou@linaro.org> ) on Shippable.com #builds

Shippable.com <noreply@...>
 

SHIPPABLE BUILD REPORT

94
test_results
Branch : master Sha : 8cbeed36ef
Builder : Erwan Gouriou Triggered By : Anas Nashif
Custom Environment Variables:
JOB_TRIGGERED_BY_NAME="create_test_commit"
JOB_TRIGGERED_BY_ID="125148"
# Runtime Status Tests Branch Coverage Sequence Coverage Triggered at Duration
94.1 none succeeded 0/0 N/A N/A Mon Jun 15 2020 04:07:34 GMT+0000 (UTC) 00:21:87
94.2 none succeeded 0/0 N/A N/A Mon Jun 15 2020 04:07:34 GMT+0000 (UTC) 00:22:04
94.3 none succeeded 0/0 N/A N/A Mon Jun 15 2020 04:07:34 GMT+0000 (UTC) 00:18:07
94.4 none succeeded 0/0 N/A N/A Mon Jun 15 2020 04:07:34 GMT+0000 (UTC) 00:22:13
94.5 none succeeded 0/0 N/A N/A Mon Jun 15 2020 04:07:34 GMT+0000 (UTC) 00:21:44
94.6 none succeeded 0/0 N/A N/A Mon Jun 15 2020 04:07:34 GMT+0000 (UTC) 00:21:65
94.7 none succeeded 0/0 N/A N/A Mon Jun 15 2020 04:07:34 GMT+0000 (UTC) 00:25:24
94.8 none succeeded 0/0 N/A N/A Mon Jun 15 2020 04:07:34 GMT+0000 (UTC) 00:25:81
94.9 none succeeded 0/0 N/A N/A Mon Jun 15 2020 04:07:34 GMT+0000 (UTC) 00:28:00
94.10 none succeeded 0/0 N/A N/A Mon Jun 15 2020 04:07:34 GMT+0000 (UTC) 00:30:86


Need help with Shippable? File an Issue


[ master ] Build TIMEOUT for zephyrproject-rtos/ci-test ( ci: Update sdk to 0.11.3 Update sdk to 0.11.3 release and update docker image to get that SDK version. Signed-off-by: Kumar Gala <kumar.gala@linaro.org> ) on Shippable.com #builds

Shippable.com <noreply@...>
 

SHIPPABLE BUILD REPORT

3519
ci-test
Branch : master Sha : 5f9e0cfc3c
Builder : Kumar Gala Triggered By : Kumar Gala
Custom Environment Variables:
JOB_TRIGGERED_BY_NAME="daily-verify"
JOB_TRIGGERED_BY_ID="23790"
# Runtime Status Tests Branch Coverage Sequence Coverage Triggered at Duration
3519.1 none failed 1436/1655 N/A N/A Sun Jun 14 2020 02:05:21 GMT+0000 (UTC) 02:01:31
3519.2 none succeeded 954/1655 N/A N/A Sun Jun 14 2020 02:05:21 GMT+0000 (UTC) 01:77:32
3519.3 none timeout 0/0 N/A N/A Sun Jun 14 2020 02:05:21 GMT+0000 (UTC) 02:24:61
3519.4 none timeout 0/0 N/A N/A Sun Jun 14 2020 02:05:21 GMT+0000 (UTC) 02:24:60
3519.5 none succeeded 1648/1655 N/A N/A Sun Jun 14 2020 02:05:21 GMT+0000 (UTC) 02:01:82
3519.6 none succeeded 1654/1655 N/A N/A Sun Jun 14 2020 02:05:21 GMT+0000 (UTC) 02:19:40
3519.7 none succeeded 1121/1655 N/A N/A Sun Jun 14 2020 02:05:21 GMT+0000 (UTC) 02:06:33
3519.8 none succeeded 921/1655 N/A N/A Sun Jun 14 2020 02:05:21 GMT+0000 (UTC) 01:72:38
3519.9 none succeeded 1415/1655 N/A N/A Sun Jun 14 2020 02:05:21 GMT+0000 (UTC) 02:06:89
3519.10 none succeeded 1376/1655 N/A N/A Sun Jun 14 2020 02:05:21 GMT+0000 (UTC) 02:07:05
3519.11 none succeeded 1623/1655 N/A N/A Sun Jun 14 2020 02:05:21 GMT+0000 (UTC) 02:16:33
3519.12 none succeeded 1475/1655 N/A N/A Sun Jun 14 2020 02:05:21 GMT+0000 (UTC) 02:19:12
3519.13 none succeeded 1291/1655 N/A N/A Sun Jun 14 2020 02:05:21 GMT+0000 (UTC) 02:98:72
3519.14 none succeeded 1339/1655 N/A N/A Sun Jun 14 2020 02:05:22 GMT+0000 (UTC) 02:14:28
3519.15 none succeeded 1068/1655 N/A N/A Sun Jun 14 2020 02:05:22 GMT+0000 (UTC) 01:80:23
3519.16 none succeeded 1379/1655 N/A N/A Sun Jun 14 2020 02:05:22 GMT+0000 (UTC) 02:08:91
3519.17 none succeeded 1159/1655 N/A N/A Sun Jun 14 2020 02:05:22 GMT+0000 (UTC) 02:99:28
3519.18 none succeeded 1597/1655 N/A N/A Sun Jun 14 2020 02:05:22 GMT+0000 (UTC) 02:04:31
3519.19 none succeeded 1143/1655 N/A N/A Sun Jun 14 2020 02:05:22 GMT+0000 (UTC) 01:88:80
3519.20 none succeeded 1604/1655 N/A N/A Sun Jun 14 2020 02:05:22 GMT+0000 (UTC) 02:06:64
3519.21 none succeeded 1560/1655 N/A N/A Sun Jun 14 2020 02:05:22 GMT+0000 (UTC) 02:11:32
3519.22 none succeeded 1082/1655 N/A N/A Sun Jun 14 2020 02:05:22 GMT+0000 (UTC) 02:95:24
3519.23 none succeeded 1197/1655 N/A N/A Sun Jun 14 2020 02:05:22 GMT+0000 (UTC) 02:99:44
3519.24 none succeeded 1302/1655 N/A N/A Sun Jun 14 2020 02:05:22 GMT+0000 (UTC) 02:04:21
3519.25 none succeeded 1607/1654 N/A N/A Sun Jun 14 2020 02:05:22 GMT+0000 (UTC) 02:20:11
3519.26 none timeout 0/0 N/A N/A Sun Jun 14 2020 02:05:22 GMT+0000 (UTC) 02:24:48
3519.27 none succeeded 1104/1654 N/A N/A Sun Jun 14 2020 02:05:22 GMT+0000 (UTC) 02:98:91
3519.28 none succeeded 1336/1654 N/A N/A Sun Jun 14 2020 02:05:23 GMT+0000 (UTC) 02:03:78
3519.29 none succeeded 1402/1654 N/A N/A Sun Jun 14 2020 02:05:23 GMT+0000 (UTC) 02:05:05
3519.30 none succeeded 1613/1654 N/A N/A Sun Jun 14 2020 02:05:23 GMT+0000 (UTC) 02:11:38
3519.31 none succeeded 1642/1654 N/A N/A Sun Jun 14 2020 02:05:23 GMT+0000 (UTC) 02:07:21
3519.32 none timeout 0/0 N/A N/A Sun Jun 14 2020 02:05:23 GMT+0000 (UTC) 02:22:24
3519.33 none timeout 0/0 N/A N/A Sun Jun 14 2020 02:05:23 GMT+0000 (UTC) 02:24:32
3519.34 none succeeded 1644/1654 N/A N/A Sun Jun 14 2020 02:05:23 GMT+0000 (UTC) 02:12:31
3519.35 none succeeded 1654/1654 N/A N/A Sun Jun 14 2020 02:05:23 GMT+0000 (UTC) 02:04:44


Need help with Shippable? File an Issue


[ master ] Build SUCCEEDED for zephyrproject-rtos/test_results ( zephyr-v2.3.0-155-g7f9b85e8c3: stm32 results Sanitycheck results for STM32 platforms on tag zephyr-v2.3.0-155-g7f9b85e8c3 Signed-off-by: Erwan Gouriou <erwan.gouriou@linaro.org> ) on Shippable.com #builds

Shippable.com <noreply@...>
 

SHIPPABLE BUILD REPORT

93
test_results
Branch : master Sha : 6ce3f291b2
Builder : Erwan Gouriou Triggered By : Anas Nashif
Custom Environment Variables:
JOB_TRIGGERED_BY_NAME="create_test_commit"
JOB_TRIGGERED_BY_ID="125148"
# Runtime Status Tests Branch Coverage Sequence Coverage Triggered at Duration
93.1 none succeeded 0/0 N/A N/A Sun Jun 14 2020 04:06:53 GMT+0000 (UTC) 00:21:58
93.2 none succeeded 0/0 N/A N/A Sun Jun 14 2020 04:06:53 GMT+0000 (UTC) 00:18:69
93.3 none succeeded 0/0 N/A N/A Sun Jun 14 2020 04:06:53 GMT+0000 (UTC) 00:18:91
93.4 none succeeded 0/0 N/A N/A Sun Jun 14 2020 04:06:53 GMT+0000 (UTC) 00:22:96
93.5 none succeeded 0/0 N/A N/A Sun Jun 14 2020 04:06:53 GMT+0000 (UTC) 00:19:58
93.6 none succeeded 0/0 N/A N/A Sun Jun 14 2020 04:06:53 GMT+0000 (UTC) 00:21:82
93.7 none succeeded 0/0 N/A N/A Sun Jun 14 2020 04:06:53 GMT+0000 (UTC) 00:28:70
93.8 none succeeded 0/0 N/A N/A Sun Jun 14 2020 04:06:53 GMT+0000 (UTC) 00:24:58
93.9 none succeeded 0/0 N/A N/A Sun Jun 14 2020 04:06:53 GMT+0000 (UTC) 01:30:13
93.10 none succeeded 0/0 N/A N/A Sun Jun 14 2020 04:06:53 GMT+0000 (UTC) 00:25:94


Need help with Shippable? File an Issue


[ master ] Build SUCCEEDED for zephyrproject-rtos/test_results ( ci: copy only summary test results ) on Shippable.com #builds

Shippable.com <noreply@...>
 

SHIPPABLE BUILD REPORT

92
test_results
Branch : master Sha : b0ef858cfa
Builder : Anas Nashif Triggered By : Anas Nashif
# Runtime Status Tests Branch Coverage Sequence Coverage Triggered at Duration
92.1 none succeeded 0/0 N/A N/A Sat Jun 13 2020 13:11:30 GMT+0000 (UTC) 00:22:35
92.2 none succeeded 0/0 N/A N/A Sat Jun 13 2020 13:11:30 GMT+0000 (UTC) 00:17:12
92.3 none succeeded 0/0 N/A N/A Sat Jun 13 2020 13:11:30 GMT+0000 (UTC) 00:14:60
92.4 none succeeded 0/0 N/A N/A Sat Jun 13 2020 13:11:30 GMT+0000 (UTC) 00:18:00
92.5 none succeeded 0/0 N/A N/A Sat Jun 13 2020 13:11:30 GMT+0000 (UTC) 00:16:88
92.6 none succeeded 0/0 N/A N/A Sat Jun 13 2020 13:11:30 GMT+0000 (UTC) 00:14:48
92.7 none succeeded 0/0 N/A N/A Sat Jun 13 2020 13:11:30 GMT+0000 (UTC) 00:21:43
92.8 none succeeded 0/0 N/A N/A Sat Jun 13 2020 13:11:30 GMT+0000 (UTC) 00:23:84
92.9 none succeeded 0/0 N/A N/A Sat Jun 13 2020 13:11:30 GMT+0000 (UTC) 00:26:32
92.10 none succeeded 0/0 N/A N/A Sat Jun 13 2020 13:11:30 GMT+0000 (UTC) 00:23:63


Need help with Shippable? File an Issue


[ master ] Build UNSTABLE for zephyrproject-rtos/test_results ( ci: use latest docker image ) on Shippable.com #builds

Shippable.com <noreply@...>
 

SHIPPABLE BUILD REPORT

91
test_results
Branch : master Sha : 52eefb9f12
Builder : Anas Nashif Triggered By : Anas Nashif
# Runtime Status Tests Branch Coverage Sequence Coverage Triggered at Duration
91.1 none succeeded 448/530 N/A N/A Sat Jun 13 2020 12:32:33 GMT+0000 (UTC) 00:21:79
91.2 none unstable 507/620 N/A N/A Sat Jun 13 2020 12:32:33 GMT+0000 (UTC) 00:17:08
91.3 none unstable 694/904 N/A N/A Sat Jun 13 2020 12:32:34 GMT+0000 (UTC) 00:14:52
91.4 none succeeded 1737/2204 N/A N/A Sat Jun 13 2020 12:32:34 GMT+0000 (UTC) 00:21:72
91.5 none unstable 1865/2132 N/A N/A Sat Jun 13 2020 12:32:34 GMT+0000 (UTC) 00:20:81
91.6 none unstable 1765/4252 N/A N/A Sat Jun 13 2020 12:32:34 GMT+0000 (UTC) 00:21:43
91.7 none unstable 3306/3752 N/A N/A Sat Jun 13 2020 12:32:34 GMT+0000 (UTC) 00:24:66
91.8 none unstable 3518/3837 N/A N/A Sat Jun 13 2020 12:32:34 GMT+0000 (UTC) 00:23:07
91.9 none unstable 4609/4639 N/A N/A Sat Jun 13 2020 12:32:34 GMT+0000 (UTC) 00:27:04
91.10 none unstable 2959/3012 N/A N/A Sat Jun 13 2020 12:32:34 GMT+0000 (UTC) 00:24:27


Need help with Shippable? File an Issue


[ master ] Build CANCELED for zephyrproject-rtos/test_results ( ci: fix sdk version and add minions Signed-off-by: Anas Nashif <anas.nashif@intel.com> ) on Shippable.com #builds

Shippable.com <noreply@...>
 

SHIPPABLE BUILD REPORT

90
test_results
Branch : master Sha : 7ea719dcdb
Builder : Anas Nashif Triggered By : Anas Nashif
Custom Environment Variables:
JOB_TRIGGERED_BY_NAME="create_test_commit"
JOB_TRIGGERED_BY_ID="125148"
# Runtime Status Tests Branch Coverage Sequence Coverage Triggered at Duration
90.1 none canceled 0/0 N/A N/A Sat Jun 13 2020 12:25:43 GMT+0000 (UTC) 00:05:08
90.2 none canceled 0/0 N/A N/A Sat Jun 13 2020 12:25:43 GMT+0000 (UTC) 00:05:07
90.3 none canceled 0/0 N/A N/A Sat Jun 13 2020 12:25:44 GMT+0000 (UTC) 00:05:07
90.4 none canceled 0/0 N/A N/A Sat Jun 13 2020 12:25:44 GMT+0000 (UTC) 00:05:06
90.5 none canceled 0/0 N/A N/A Sat Jun 13 2020 12:25:44 GMT+0000 (UTC) 00:05:06
90.6 none canceled 0/0 N/A N/A Sat Jun 13 2020 12:25:44 GMT+0000 (UTC) 00:05:05
90.7 none canceled 0/0 N/A N/A Sat Jun 13 2020 12:25:44 GMT+0000 (UTC) 00:05:04
90.8 none canceled 0/0 N/A N/A Sat Jun 13 2020 12:25:44 GMT+0000 (UTC) 00:05:04
90.9 none canceled 0/0 N/A N/A Sat Jun 13 2020 12:25:44 GMT+0000 (UTC) 00:05:03
90.10 none canceled 0/0 N/A N/A Sat Jun 13 2020 12:25:44 GMT+0000 (UTC) 00:05:03


Need help with Shippable? File an Issue


[ master ] Build TIMEOUT for zephyrproject-rtos/ci-test ( ci: Update sdk to 0.11.3 Update sdk to 0.11.3 release and update docker image to get that SDK version. Signed-off-by: Kumar Gala <kumar.gala@linaro.org> ) on Shippable.com #builds

Shippable.com <noreply@...>
 

SHIPPABLE BUILD REPORT

3518
ci-test
Branch : master Sha : 5f9e0cfc3c
Builder : Kumar Gala Triggered By : Kumar Gala
Custom Environment Variables:
JOB_TRIGGERED_BY_NAME="daily-verify"
JOB_TRIGGERED_BY_ID="23790"
# Runtime Status Tests Branch Coverage Sequence Coverage Triggered at Duration
3518.1 none failed 0/0 N/A N/A Sat Jun 13 2020 02:05:14 GMT+0000 (UTC) 00:01:85
3518.2 none succeeded 954/1655 N/A N/A Sat Jun 13 2020 02:05:14 GMT+0000 (UTC) 01:77:07
3518.3 none timeout 0/0 N/A N/A Sat Jun 13 2020 02:05:14 GMT+0000 (UTC) 02:24:43
3518.4 none timeout 0/0 N/A N/A Sat Jun 13 2020 02:05:14 GMT+0000 (UTC) 02:24:43
3518.5 none succeeded 1648/1655 N/A N/A Sat Jun 13 2020 02:05:15 GMT+0000 (UTC) 02:00:08
3518.6 none succeeded 1654/1655 N/A N/A Sat Jun 13 2020 02:05:15 GMT+0000 (UTC) 02:09:64
3518.7 none succeeded 1121/1655 N/A N/A Sat Jun 13 2020 02:05:15 GMT+0000 (UTC) 02:04:52
3518.8 none succeeded 921/1655 N/A N/A Sat Jun 13 2020 02:05:15 GMT+0000 (UTC) 01:77:41
3518.9 none succeeded 1415/1655 N/A N/A Sat Jun 13 2020 02:05:15 GMT+0000 (UTC) 02:04:68
3518.10 none succeeded 1376/1655 N/A N/A Sat Jun 13 2020 02:05:15 GMT+0000 (UTC) 02:09:27
3518.11 none succeeded 1623/1655 N/A N/A Sat Jun 13 2020 02:05:15 GMT+0000 (UTC) 02:16:85
3518.12 none succeeded 1475/1655 N/A N/A Sat Jun 13 2020 02:05:15 GMT+0000 (UTC) 02:17:16
3518.13 none succeeded 1291/1655 N/A N/A Sat Jun 13 2020 02:05:15 GMT+0000 (UTC) 02:00:02
3518.14 none succeeded 1339/1655 N/A N/A Sat Jun 13 2020 02:05:15 GMT+0000 (UTC) 02:15:25
3518.15 none succeeded 1068/1655 N/A N/A Sat Jun 13 2020 02:05:15 GMT+0000 (UTC) 01:79:10
3518.16 none succeeded 1379/1655 N/A N/A Sat Jun 13 2020 02:05:15 GMT+0000 (UTC) 02:00:09
3518.17 none succeeded 1159/1655 N/A N/A Sat Jun 13 2020 02:05:16 GMT+0000 (UTC) 02:99:60
3518.18 none succeeded 1597/1655 N/A N/A Sat Jun 13 2020 02:05:16 GMT+0000 (UTC) 02:06:64
3518.19 none succeeded 1143/1655 N/A N/A Sat Jun 13 2020 02:05:16 GMT+0000 (UTC) 01:87:08
3518.20 none succeeded 1604/1655 N/A N/A Sat Jun 13 2020 02:05:16 GMT+0000 (UTC) 02:20:96
3518.21 none succeeded 1560/1655 N/A N/A Sat Jun 13 2020 02:05:16 GMT+0000 (UTC) 02:09:67
3518.22 none succeeded 1082/1655 N/A N/A Sat Jun 13 2020 02:05:16 GMT+0000 (UTC) 02:99:41
3518.23 none succeeded 1197/1655 N/A N/A Sat Jun 13 2020 02:05:16 GMT+0000 (UTC) 02:92:24
3518.24 none succeeded 1302/1655 N/A N/A Sat Jun 13 2020 02:05:16 GMT+0000 (UTC) 02:99:30
3518.25 none succeeded 1608/1655 N/A N/A Sat Jun 13 2020 02:05:16 GMT+0000 (UTC) 02:21:60
3518.26 none timeout 0/0 N/A N/A Sat Jun 13 2020 02:05:16 GMT+0000 (UTC) 02:20:29
3518.27 none succeeded 1104/1654 N/A N/A Sat Jun 13 2020 02:05:16 GMT+0000 (UTC) 02:99:53
3518.28 none succeeded 1336/1654 N/A N/A Sat Jun 13 2020 02:05:16 GMT+0000 (UTC) 02:97:48
3518.29 none succeeded 1402/1654 N/A N/A Sat Jun 13 2020 02:05:16 GMT+0000 (UTC) 02:02:28
3518.30 none succeeded 1613/1654 N/A N/A Sat Jun 13 2020 02:05:16 GMT+0000 (UTC) 02:17:27
3518.31 none succeeded 1642/1654 N/A N/A Sat Jun 13 2020 02:05:16 GMT+0000 (UTC) 02:10:26
3518.32 none timeout 0/0 N/A N/A Sat Jun 13 2020 02:05:16 GMT+0000 (UTC) 02:22:17
3518.33 none timeout 0/0 N/A N/A Sat Jun 13 2020 02:05:16 GMT+0000 (UTC) 02:22:98
3518.34 none succeeded 1644/1654 N/A N/A Sat Jun 13 2020 02:05:17 GMT+0000 (UTC) 02:07:18
3518.35 none succeeded 1654/1654 N/A N/A Sat Jun 13 2020 02:05:17 GMT+0000 (UTC) 02:05:18


Need help with Shippable? File an Issue


[ master ] Build TIMEOUT for zephyrproject-rtos/ci-test ( ci: Update sdk to 0.11.3 Update sdk to 0.11.3 release and update docker image to get that SDK version. Signed-off-by: Kumar Gala <kumar.gala@linaro.org> ) on Shippable.com #builds

Shippable.com <noreply@...>
 

SHIPPABLE BUILD REPORT

3518
ci-test
Branch : master Sha : 5f9e0cfc3c
Builder : Kumar Gala Triggered By : Kumar Gala
Custom Environment Variables:
JOB_TRIGGERED_BY_NAME="daily-verify"
JOB_TRIGGERED_BY_ID="23790"
# Runtime Status Tests Branch Coverage Sequence Coverage Triggered at Duration
3518.1 none failed 0/0 N/A N/A Sat Jun 13 2020 02:05:14 GMT+0000 (UTC) 00:01:85
3518.2 none succeeded 954/1655 N/A N/A Sat Jun 13 2020 02:05:14 GMT+0000 (UTC) 01:77:07
3518.3 none timeout 0/0 N/A N/A Sat Jun 13 2020 02:05:14 GMT+0000 (UTC) 02:24:43
3518.4 none timeout 0/0 N/A N/A Sat Jun 13 2020 02:05:14 GMT+0000 (UTC) 02:24:43
3518.5 none succeeded 1648/1655 N/A N/A Sat Jun 13 2020 02:05:15 GMT+0000 (UTC) 02:00:08
3518.6 none succeeded 1654/1655 N/A N/A Sat Jun 13 2020 02:05:15 GMT+0000 (UTC) 02:09:64
3518.7 none succeeded 1121/1655 N/A N/A Sat Jun 13 2020 02:05:15 GMT+0000 (UTC) 02:04:52
3518.8 none succeeded 921/1655 N/A N/A Sat Jun 13 2020 02:05:15 GMT+0000 (UTC) 01:77:41
3518.9 none succeeded 1415/1655 N/A N/A Sat Jun 13 2020 02:05:15 GMT+0000 (UTC) 02:04:68
3518.10 none succeeded 1376/1655 N/A N/A Sat Jun 13 2020 02:05:15 GMT+0000 (UTC) 02:09:27
3518.11 none succeeded 1623/1655 N/A N/A Sat Jun 13 2020 02:05:15 GMT+0000 (UTC) 02:16:85
3518.12 none succeeded 1475/1655 N/A N/A Sat Jun 13 2020 02:05:15 GMT+0000 (UTC) 02:17:16
3518.13 none succeeded 1291/1655 N/A N/A Sat Jun 13 2020 02:05:15 GMT+0000 (UTC) 02:00:02
3518.14 none succeeded 1339/1655 N/A N/A Sat Jun 13 2020 02:05:15 GMT+0000 (UTC) 02:15:25
3518.15 none succeeded 1068/1655 N/A N/A Sat Jun 13 2020 02:05:15 GMT+0000 (UTC) 01:79:10
3518.16 none succeeded 1379/1655 N/A N/A Sat Jun 13 2020 02:05:15 GMT+0000 (UTC) 02:00:09
3518.17 none succeeded 1159/1655 N/A N/A Sat Jun 13 2020 02:05:16 GMT+0000 (UTC) 02:99:60
3518.18 none succeeded 1597/1655 N/A N/A Sat Jun 13 2020 02:05:16 GMT+0000 (UTC) 02:06:64
3518.19 none succeeded 1143/1655 N/A N/A Sat Jun 13 2020 02:05:16 GMT+0000 (UTC) 01:87:08
3518.20 none succeeded 1604/1655 N/A N/A Sat Jun 13 2020 02:05:16 GMT+0000 (UTC) 02:20:96
3518.21 none succeeded 1560/1655 N/A N/A Sat Jun 13 2020 02:05:16 GMT+0000 (UTC) 02:09:67
3518.22 none succeeded 1082/1655 N/A N/A Sat Jun 13 2020 02:05:16 GMT+0000 (UTC) 02:99:41
3518.23 none succeeded 1197/1655 N/A N/A Sat Jun 13 2020 02:05:16 GMT+0000 (UTC) 02:92:24
3518.24 none succeeded 1302/1655 N/A N/A Sat Jun 13 2020 02:05:16 GMT+0000 (UTC) 02:99:30
3518.25 none succeeded 1608/1655 N/A N/A Sat Jun 13 2020 02:05:16 GMT+0000 (UTC) 02:21:60
3518.26 none timeout 0/0 N/A N/A Sat Jun 13 2020 02:05:16 GMT+0000 (UTC) 02:20:29
3518.27 none succeeded 1104/1654 N/A N/A Sat Jun 13 2020 02:05:16 GMT+0000 (UTC) 02:99:53
3518.28 none succeeded 1336/1654 N/A N/A Sat Jun 13 2020 02:05:16 GMT+0000 (UTC) 02:97:48
3518.29 none succeeded 1402/1654 N/A N/A Sat Jun 13 2020 02:05:16 GMT+0000 (UTC) 02:02:28
3518.30 none succeeded 1613/1654 N/A N/A Sat Jun 13 2020 02:05:16 GMT+0000 (UTC) 02:17:27
3518.31 none succeeded 1642/1654 N/A N/A Sat Jun 13 2020 02:05:16 GMT+0000 (UTC) 02:10:26
3518.32 none timeout 0/0 N/A N/A Sat Jun 13 2020 02:05:16 GMT+0000 (UTC) 02:22:17
3518.33 none timeout 0/0 N/A N/A Sat Jun 13 2020 02:05:16 GMT+0000 (UTC) 02:22:98
3518.34 none succeeded 1644/1654 N/A N/A Sat Jun 13 2020 02:05:17 GMT+0000 (UTC) 02:07:18
3518.35 none succeeded 1654/1654 N/A N/A Sat Jun 13 2020 02:05:17 GMT+0000 (UTC) 02:05:18


Need help with Shippable? File an Issue


[ master ] Build FAILED for zephyrproject-rtos/test_results ( ci: fix sdk version and add minions Signed-off-by: Anas Nashif <anas.nashif@intel.com> ) on Shippable.com #builds

Shippable.com <noreply@...>
 

SHIPPABLE BUILD REPORT

89
test_results
Branch : master Sha : 7ea719dcdb
Builder : Anas Nashif Triggered By : Anas Nashif
Custom Environment Variables:
JOB_TRIGGERED_BY_NAME="create_test_commit"
JOB_TRIGGERED_BY_ID="125148"
# Runtime Status Tests Branch Coverage Sequence Coverage Triggered at Duration
89.1 none failed 0/348 N/A N/A Sat Jun 13 2020 04:07:51 GMT+0000 (UTC) 00:15:71
89.2 none failed 0/348 N/A N/A Sat Jun 13 2020 04:07:51 GMT+0000 (UTC) 00:15:74
89.3 none failed 0/348 N/A N/A Sat Jun 13 2020 04:07:51 GMT+0000 (UTC) 00:14:66
89.4 none failed 0/348 N/A N/A Sat Jun 13 2020 04:07:51 GMT+0000 (UTC) 00:14:70
89.5 none failed 0/347 N/A N/A Sat Jun 13 2020 04:07:51 GMT+0000 (UTC) 00:14:69
89.6 none failed 0/347 N/A N/A Sat Jun 13 2020 04:07:52 GMT+0000 (UTC) 00:14:62
89.7 none failed 0/347 N/A N/A Sat Jun 13 2020 04:07:52 GMT+0000 (UTC) 00:14:66
89.8 none failed 0/347 N/A N/A Sat Jun 13 2020 04:07:52 GMT+0000 (UTC) 00:14:11
89.9 none failed 0/347 N/A N/A Sat Jun 13 2020 04:07:52 GMT+0000 (UTC) 00:14:33
89.10 none failed 0/347 N/A N/A Sat Jun 13 2020 04:07:52 GMT+0000 (UTC) 00:13:51


Need help with Shippable? File an Issue


[ master ] Build FAILED for zephyrproject-rtos/test_results ( ci: fix sdk version and add minions Signed-off-by: Anas Nashif <anas.nashif@intel.com> ) on Shippable.com #builds

Shippable.com <noreply@...>
 

SHIPPABLE BUILD REPORT

88
test_results
Branch : master Sha : 7ea719dcdb
Builder : Anas Nashif Triggered By : Anas Nashif
Custom Environment Variables:
JOB_TRIGGERED_BY_NAME="create_test_commit"
JOB_TRIGGERED_BY_ID="125148"
# Runtime Status Tests Branch Coverage Sequence Coverage Triggered at Duration
88.1 none failed 0/348 N/A N/A Fri Jun 12 2020 12:44:13 GMT+0000 (UTC) 00:14:14
88.2 none failed 0/348 N/A N/A Fri Jun 12 2020 12:44:13 GMT+0000 (UTC) 00:13:00
88.3 none failed 0/348 N/A N/A Fri Jun 12 2020 12:44:13 GMT+0000 (UTC) 00:13:96
88.4 none failed 0/348 N/A N/A Fri Jun 12 2020 12:44:13 GMT+0000 (UTC) 00:13:68
88.5 none failed 0/348 N/A N/A Fri Jun 12 2020 12:44:13 GMT+0000 (UTC) 00:09:47
88.6 none failed 0/347 N/A N/A Fri Jun 12 2020 12:44:13 GMT+0000 (UTC) 00:13:54
88.7 none failed 0/347 N/A N/A Fri Jun 12 2020 12:44:13 GMT+0000 (UTC) 00:09:26
88.8 none failed 0/347 N/A N/A Fri Jun 12 2020 12:44:13 GMT+0000 (UTC) 00:09:25
88.9 none failed 0/347 N/A N/A Fri Jun 12 2020 12:44:13 GMT+0000 (UTC) 00:12:26
88.10 none failed 0/347 N/A N/A Fri Jun 12 2020 12:44:13 GMT+0000 (UTC) 00:09:18


Need help with Shippable? File an Issue


[ master ] Build CANCELED for zephyrproject-rtos/test_results ( config: add .gitignore ignore generated files. Signed-off-by: Anas Nashif <anas.nashif@intel.com> ) on Shippable.com #builds

Shippable.com <noreply@...>
 

SHIPPABLE BUILD REPORT

87
test_results
Branch : master Sha : ccecaa7602
Builder : Anas Nashif Triggered By : Anas Nashif
Custom Environment Variables:
JOB_TRIGGERED_BY_NAME="create_test_commit"
JOB_TRIGGERED_BY_ID="125148"
# Runtime Status Tests Branch Coverage Sequence Coverage Triggered at Duration
87.1 none canceled 0/0 N/A N/A Fri Jun 12 2020 12:41:24 GMT+0000 (UTC) 00:00:00
87.2 none canceled 0/0 N/A N/A Fri Jun 12 2020 12:41:24 GMT+0000 (UTC) 00:00:00
87.3 none canceled 0/0 N/A N/A Fri Jun 12 2020 12:41:24 GMT+0000 (UTC) 00:00:00
87.4 none canceled 0/0 N/A N/A Fri Jun 12 2020 12:41:24 GMT+0000 (UTC) 00:00:00
87.5 none canceled 0/0 N/A N/A Fri Jun 12 2020 12:41:25 GMT+0000 (UTC) 00:00:00


Need help with Shippable? File an Issue


[ master ] Build FAILED for zephyrproject-rtos/test_results ( config: add .gitignore ignore generated files. Signed-off-by: Anas Nashif <anas.nashif@intel.com> ) on Shippable.com #builds

Shippable.com <noreply@...>
 

SHIPPABLE BUILD REPORT

86
test_results
Branch : master Sha : ccecaa7602
Builder : Anas Nashif Triggered By : Anas Nashif
Custom Environment Variables:
JOB_TRIGGERED_BY_NAME="create_test_commit"
JOB_TRIGGERED_BY_ID="125148"
# Runtime Status Tests Branch Coverage Sequence Coverage Triggered at Duration
86.1 none failed 858/1086 N/A N/A Fri Jun 12 2020 04:07:27 GMT+0000 (UTC) 02:19:17
86.2 none failed 1921/2636 N/A N/A Fri Jun 12 2020 04:07:27 GMT+0000 (UTC) 03:88:71
86.3 none failed 2812/5612 N/A N/A Fri Jun 12 2020 04:07:27 GMT+0000 (UTC) 04:34:20
86.4 none failed 5609/6380 N/A N/A Fri Jun 12 2020 04:07:27 GMT+0000 (UTC) 05:70:13
86.5 none failed 6272/6388 N/A N/A Fri Jun 12 2020 04:07:27 GMT+0000 (UTC) 05:10:18


Need help with Shippable? File an Issue


[ master ] Build TIMEOUT for zephyrproject-rtos/ci-test ( ci: Update sdk to 0.11.3 Update sdk to 0.11.3 release and update docker image to get that SDK version. Signed-off-by: Kumar Gala <kumar.gala@linaro.org> ) on Shippable.com #builds

Shippable.com <noreply@...>
 

SHIPPABLE BUILD REPORT

3517
ci-test
Branch : master Sha : 5f9e0cfc3c
Builder : Kumar Gala Triggered By : Kumar Gala
Custom Environment Variables:
JOB_TRIGGERED_BY_NAME="daily-verify"
JOB_TRIGGERED_BY_ID="23790"
# Runtime Status Tests Branch Coverage Sequence Coverage Triggered at Duration
3517.1 none succeeded 1439/1655 N/A N/A Fri Jun 12 2020 02:06:01 GMT+0000 (UTC) 02:95:09
3517.2 none succeeded 954/1655 N/A N/A Fri Jun 12 2020 02:06:01 GMT+0000 (UTC) 01:76:83
3517.3 none timeout 0/0 N/A N/A Fri Jun 12 2020 02:06:01 GMT+0000 (UTC) 02:21:73
3517.4 none timeout 0/0 N/A N/A Fri Jun 12 2020 02:06:01 GMT+0000 (UTC) 02:21:44
3517.5 none succeeded 1648/1655 N/A N/A Fri Jun 12 2020 02:06:01 GMT+0000 (UTC) 02:03:65
3517.6 none succeeded 1654/1655 N/A N/A Fri Jun 12 2020 02:06:01 GMT+0000 (UTC) 02:14:15
3517.7 none succeeded 1120/1655 N/A N/A Fri Jun 12 2020 02:06:01 GMT+0000 (UTC) 02:09:46
3517.8 none succeeded 922/1655 N/A N/A Fri Jun 12 2020 02:06:01 GMT+0000 (UTC) 01:73:75
3517.9 none succeeded 1415/1655 N/A N/A Fri Jun 12 2020 02:06:02 GMT+0000 (UTC) 02:00:02
3517.10 none succeeded 1376/1655 N/A N/A Fri Jun 12 2020 02:06:02 GMT+0000 (UTC) 02:05:98
3517.11 none succeeded 1623/1655 N/A N/A Fri Jun 12 2020 02:06:02 GMT+0000 (UTC) 02:18:62
3517.12 none succeeded 1475/1655 N/A N/A Fri Jun 12 2020 02:06:02 GMT+0000 (UTC) 02:15:75
3517.13 none succeeded 1291/1655 N/A N/A Fri Jun 12 2020 02:06:02 GMT+0000 (UTC) 02:96:35
3517.14 none succeeded 1339/1655 N/A N/A Fri Jun 12 2020 02:06:02 GMT+0000 (UTC) 02:12:37
3517.15 none succeeded 1068/1655 N/A N/A Fri Jun 12 2020 02:06:02 GMT+0000 (UTC) 01:82:18
3517.16 none succeeded 1379/1655 N/A N/A Fri Jun 12 2020 02:06:02 GMT+0000 (UTC) 02:98:07
3517.17 none succeeded 1157/1655 N/A N/A Fri Jun 12 2020 02:06:02 GMT+0000 (UTC) 02:97:36
3517.18 none succeeded 1599/1655 N/A N/A Fri Jun 12 2020 02:06:02 GMT+0000 (UTC) 02:14:20
3517.19 none succeeded 1139/1655 N/A N/A Fri Jun 12 2020 02:06:02 GMT+0000 (UTC) 01:81:89
3517.20 none succeeded 1607/1654 N/A N/A Fri Jun 12 2020 02:06:02 GMT+0000 (UTC) 02:05:23
3517.21 none succeeded 1558/1654 N/A N/A Fri Jun 12 2020 02:06:02 GMT+0000 (UTC) 02:10:94
3517.22 none succeeded 1082/1654 N/A N/A Fri Jun 12 2020 02:06:02 GMT+0000 (UTC) 02:96:39
3517.23 none succeeded 1196/1654 N/A N/A Fri Jun 12 2020 02:06:02 GMT+0000 (UTC) 02:95:75
3517.24 none succeeded 1301/1654 N/A N/A Fri Jun 12 2020 02:06:02 GMT+0000 (UTC) 02:00:16
3517.25 none succeeded 1607/1654 N/A N/A Fri Jun 12 2020 02:06:03 GMT+0000 (UTC) 02:19:45
3517.26 none timeout 0/0 N/A N/A Fri Jun 12 2020 02:06:03 GMT+0000 (UTC) 02:20:28
3517.27 none succeeded 1104/1654 N/A N/A Fri Jun 12 2020 02:06:03 GMT+0000 (UTC) 01:89:62
3517.28 none succeeded 1336/1654 N/A N/A Fri Jun 12 2020 02:06:03 GMT+0000 (UTC) 02:05:01
3517.29 none succeeded 1402/1654 N/A N/A Fri Jun 12 2020 02:06:03 GMT+0000 (UTC) 02:02:18
3517.30 none succeeded 1613/1654 N/A N/A Fri Jun 12 2020 02:06:03 GMT+0000 (UTC) 02:10:03
3517.31 none succeeded 1642/1654 N/A N/A Fri Jun 12 2020 02:06:03 GMT+0000 (UTC) 02:14:69
3517.32 none timeout 0/0 N/A N/A Fri Jun 12 2020 02:06:03 GMT+0000 (UTC) 02:21:76
3517.33 none timeout 0/0 N/A N/A Fri Jun 12 2020 02:06:03 GMT+0000 (UTC) 02:23:96
3517.34 none succeeded 1644/1654 N/A N/A Fri Jun 12 2020 02:06:03 GMT+0000 (UTC) 02:13:05
3517.35 none succeeded 1654/1654 N/A N/A Fri Jun 12 2020 02:06:03 GMT+0000 (UTC) 02:06:37


Need help with Shippable? File an Issue

221 - 240 of 2728