Date   

zephyr/refs/tags/v1.5.0: tag build zephyr-kernel-1.5.0 Successful

donotreply@...
 

zephyr/refs/tags/v1.5.0: tag build zephyr-kernel-1.5.0 Successful

Check console output at https://jenkins.zephyrproject.org/job/zephyr-tag/18/ to view the results.


zephyr/refs/tags/v1.4.0: tag build zephyr-kernel-1.4.0 Successful

donotreply@...
 

zephyr/refs/tags/v1.4.0: tag build zephyr-kernel-1.4.0 Successful

Check console output at https://jenkins.zephyrproject.org/job/zephyr-tag/17/ to view the results.


zephyr/refs/tags/v1.3.0: tag build zephyr-kernel-1.3.0 Successful

donotreply@...
 

zephyr/refs/tags/v1.3.0: tag build zephyr-kernel-1.3.0 Successful

Check console output at https://jenkins.zephyrproject.org/job/zephyr-tag/16/ to view the results.


zephyr/refs/tags/v1.2.0: tag build zephyr-kernel-1.2.0 Successful

donotreply@...
 

zephyr/refs/tags/v1.2.0: tag build zephyr-kernel-1.2.0 Successful

Check console output at https://jenkins.zephyrproject.org/job/zephyr-tag/15/ to view the results.


zephyr/refs/tags/v1.1.0: tag build zephyr-kernel-1.1.0 Successful

donotreply@...
 

zephyr/refs/tags/v1.1.0: tag build zephyr-kernel-1.1.0 Successful

Check console output at https://jenkins.zephyrproject.org/job/zephyr-tag/14/ to view the results.


zephyr/master: daily build zephyr-kernel-1.7.99-170220-fe118c4 Still Failing

donotreply@...
 

zephyr/master: daily build zephyr-kernel-1.7.99-170220-fe118c4 Still Failing



job zephyr-sanity build number 504 failed
see: https://jenkins.zephyrproject.org/job/zephyr-sanity/504/

make[7]: Target `__build' not remade because of errors.
make[6]: *** [ext/lib/crypto/mbedtls] Error 2
make[6]: Target `__build' not remade because of errors.
make[5]: *** [ext/lib/crypto] Error 2
make[5]: Target `__build' not remade because of errors.
make[4]: *** [ext/lib] Error 2
make[4]: Target `__build' not remade because of errors.
make[3]: *** [ext] Error 2
AR kernel/lib.a
make[3]: Target `all' not remade because of errors.
make[3]: Leaving directory `/w/workspace/zephyr-sanity/sanity-out/stm32_mini_a15/tests/crypto/test_mbedtls/test'
make[2]: *** [sub-make] Error 2
make[2]: Target `all' not remade because of errors.
make[2]: Leaving directory `/w/workspace/zephyr-sanity'
make[1]: *** [all] Error 2
make[1]: Leaving directory `/w/workspace/zephyr-sanity/tests/crypto/test_mbedtls'
Generating LALR tables
-----------------sanity-out/stm32_mini_a15/tests/crypto/test_mbedtls/test/build.log-----------------
qemu_x86 tests/net/udp/test FAILED: timeout
--------------------------sanity-out/qemu_x86/tests/net/udp/test/qemu.log---------------------------
***** BOOTING ZEPHYR OS v1.7.99 - BUILD: Feb 21 2017 01:52:53 *****
Timeout, packet not received
ASSERTION FAIL [_is_prio_higher(thread->base.prio, 15) || ((thread->base.prio == 15) && (thread == _idle_thread))] @ /w/workspace/zephyr-sanity/kernel/include/ksched.h:397:
--------------------------sanity-out/qemu_x86/tests/net/udp/test/qemu.log---------------------------
1 of 31 tests passed with 0 warnings in 97 seconds
Extra environment setting:
CONFIG_ASSERT=y
CONFIG_DEBUG=y
Build step 'Execute shell' marked build as failure


job zephyr-sanity build number 503 failed
see: https://jenkins.zephyrproject.org/job/zephyr-sanity/503/

CC kernel/sem.o
CC kernel/stack.o
CC kernel/sys_clock.o
CC kernel/system_work_q.o
CC kernel/thread.o
CC kernel/thread_abort.o
CC kernel/timer.o
CC kernel/work_q.o
LD kernel/built-in.o
AR kernel/lib.a
AR libzephyr.a
LINK zephyr.lnk
/opt/zephyr-sdk-0.9/sysroots/x86_64-pokysdk-linux/usr/libexec/i586-zephyr-elf/gcc/i586-zephyr-elf/6.2.0/real-ld: zephyr_prebuilt.elf section `bss' will not fit in region `RAM'
/opt/zephyr-sdk-0.9/sysroots/x86_64-pokysdk-linux/usr/libexec/i586-zephyr-elf/gcc/i586-zephyr-elf/6.2.0/real-ld: region `RAM' overflowed by 28576 bytes
collect2: error: ld returned 1 exit status
make[3]: *** [zephyr_prebuilt.elf] Error 1
make[3]: Target `all' not remade because of errors.
make[3]: Leaving directory `/w/workspace/zephyr-sanity/sanity-out/qemu_x86/samples/net/http_server/test'
make[2]: *** [sub-make] Error 2
make[2]: Target `all' not remade because of errors.
make[2]: Leaving directory `/w/workspace/zephyr-sanity'
make[1]: *** [all] Error 2
make[1]: Leaving directory `/w/workspace/zephyr-sanity/samples/net/http_server'
Generating LALR tables
---------------------sanity-out/qemu_x86/samples/net/http_server/test/build.log---------------------
0 of 30 tests passed with 0 warnings in 32 seconds
Extra environment setting:
CONFIG_DEBUG=y
Build step 'Execute shell' marked build as failure


job zephyr-sanity build number 502 failed
see: https://jenkins.zephyrproject.org/job/zephyr-sanity/502/

CC ext/lib/crypto/mbedtls/library/x509_crl.o
CC ext/lib/crypto/mbedtls/library/x509_crt.o
CC ext/lib/crypto/mbedtls/library/x509_csr.o
CC ext/lib/crypto/mbedtls/library/x509write_crt.o
CC ext/lib/crypto/mbedtls/library/x509write_csr.o
CC ext/lib/crypto/mbedtls/library/xtea.o
LD ext/lib/crypto/mbedtls/built-in.o
LD ext/lib/crypto/built-in.o
LD ext/lib/built-in.o
LD ext/built-in.o
AR libzephyr.a
LINK zephyr.lnk
/opt/zephyr-sdk-0.9/sysroots/x86_64-pokysdk-linux/usr/libexec/i586-zephyr-elf/gcc/i586-zephyr-elf/6.2.0/real-ld: zephyr_prebuilt.elf section `noinit' will not fit in region `RAM'
/opt/zephyr-sdk-0.9/sysroots/x86_64-pokysdk-linux/usr/libexec/i586-zephyr-elf/gcc/i586-zephyr-elf/6.2.0/real-ld: region `RAM' overflowed by 2080 bytes
collect2: error: ld returned 1 exit status
make[3]: *** [zephyr_prebuilt.elf] Error 1
make[3]: Target `all' not remade because of errors.
make[3]: Leaving directory `/w/workspace/zephyr-sanity/sanity-out/qemu_x86/samples/net/http_server/test'
make[2]: *** [sub-make] Error 2
make[2]: Target `all' not remade because of errors.
make[2]: Leaving directory `/w/workspace/zephyr-sanity'
make[1]: *** [all] Error 2
make[1]: Leaving directory `/w/workspace/zephyr-sanity/samples/net/http_server'
Generating LALR tables
---------------------sanity-out/qemu_x86/samples/net/http_server/test/build.log---------------------
0 of 1 tests passed with 0 warnings in 4 seconds
Extra environment setting:
CONFIG_ASSERT=y
Build step 'Execute shell' marked build as failure


zephyr/master: daily build zephyr-kernel-1.7.99-170220-fe118c4 Failure

donotreply@...
 

zephyr/master: daily build zephyr-kernel-1.7.99-170220-fe118c4 Failure



job zephyr-sanity build number 504 failed
see: https://jenkins.zephyrproject.org/job/zephyr-sanity/504/

make[7]: Target `__build' not remade because of errors.
make[6]: *** [ext/lib/crypto/mbedtls] Error 2
make[6]: Target `__build' not remade because of errors.
make[5]: *** [ext/lib/crypto] Error 2
make[5]: Target `__build' not remade because of errors.
make[4]: *** [ext/lib] Error 2
make[4]: Target `__build' not remade because of errors.
make[3]: *** [ext] Error 2
AR kernel/lib.a
make[3]: Target `all' not remade because of errors.
make[3]: Leaving directory `/w/workspace/zephyr-sanity/sanity-out/stm32_mini_a15/tests/crypto/test_mbedtls/test'
make[2]: *** [sub-make] Error 2
make[2]: Target `all' not remade because of errors.
make[2]: Leaving directory `/w/workspace/zephyr-sanity'
make[1]: *** [all] Error 2
make[1]: Leaving directory `/w/workspace/zephyr-sanity/tests/crypto/test_mbedtls'
Generating LALR tables
-----------------sanity-out/stm32_mini_a15/tests/crypto/test_mbedtls/test/build.log-----------------
qemu_x86 tests/net/udp/test FAILED: timeout
--------------------------sanity-out/qemu_x86/tests/net/udp/test/qemu.log---------------------------
***** BOOTING ZEPHYR OS v1.7.99 - BUILD: Feb 21 2017 01:52:53 *****
Timeout, packet not received
ASSERTION FAIL [_is_prio_higher(thread->base.prio, 15) || ((thread->base.prio == 15) && (thread == _idle_thread))] @ /w/workspace/zephyr-sanity/kernel/include/ksched.h:397:
--------------------------sanity-out/qemu_x86/tests/net/udp/test/qemu.log---------------------------
1 of 31 tests passed with 0 warnings in 97 seconds
Extra environment setting:
CONFIG_ASSERT=y
CONFIG_DEBUG=y
Build step 'Execute shell' marked build as failure


job zephyr-sanity build number 503 failed
see: https://jenkins.zephyrproject.org/job/zephyr-sanity/503/

CC kernel/sem.o
CC kernel/stack.o
CC kernel/sys_clock.o
CC kernel/system_work_q.o
CC kernel/thread.o
CC kernel/thread_abort.o
CC kernel/timer.o
CC kernel/work_q.o
LD kernel/built-in.o
AR kernel/lib.a
AR libzephyr.a
LINK zephyr.lnk
/opt/zephyr-sdk-0.9/sysroots/x86_64-pokysdk-linux/usr/libexec/i586-zephyr-elf/gcc/i586-zephyr-elf/6.2.0/real-ld: zephyr_prebuilt.elf section `bss' will not fit in region `RAM'
/opt/zephyr-sdk-0.9/sysroots/x86_64-pokysdk-linux/usr/libexec/i586-zephyr-elf/gcc/i586-zephyr-elf/6.2.0/real-ld: region `RAM' overflowed by 28576 bytes
collect2: error: ld returned 1 exit status
make[3]: *** [zephyr_prebuilt.elf] Error 1
make[3]: Target `all' not remade because of errors.
make[3]: Leaving directory `/w/workspace/zephyr-sanity/sanity-out/qemu_x86/samples/net/http_server/test'
make[2]: *** [sub-make] Error 2
make[2]: Target `all' not remade because of errors.
make[2]: Leaving directory `/w/workspace/zephyr-sanity'
make[1]: *** [all] Error 2
make[1]: Leaving directory `/w/workspace/zephyr-sanity/samples/net/http_server'
Generating LALR tables
---------------------sanity-out/qemu_x86/samples/net/http_server/test/build.log---------------------
0 of 30 tests passed with 0 warnings in 32 seconds
Extra environment setting:
CONFIG_DEBUG=y
Build step 'Execute shell' marked build as failure


job zephyr-sanity build number 502 failed
see: https://jenkins.zephyrproject.org/job/zephyr-sanity/502/

CC ext/lib/crypto/mbedtls/library/x509_crl.o
CC ext/lib/crypto/mbedtls/library/x509_crt.o
CC ext/lib/crypto/mbedtls/library/x509_csr.o
CC ext/lib/crypto/mbedtls/library/x509write_crt.o
CC ext/lib/crypto/mbedtls/library/x509write_csr.o
CC ext/lib/crypto/mbedtls/library/xtea.o
LD ext/lib/crypto/mbedtls/built-in.o
LD ext/lib/crypto/built-in.o
LD ext/lib/built-in.o
LD ext/built-in.o
AR libzephyr.a
LINK zephyr.lnk
/opt/zephyr-sdk-0.9/sysroots/x86_64-pokysdk-linux/usr/libexec/i586-zephyr-elf/gcc/i586-zephyr-elf/6.2.0/real-ld: zephyr_prebuilt.elf section `noinit' will not fit in region `RAM'
/opt/zephyr-sdk-0.9/sysroots/x86_64-pokysdk-linux/usr/libexec/i586-zephyr-elf/gcc/i586-zephyr-elf/6.2.0/real-ld: region `RAM' overflowed by 2080 bytes
collect2: error: ld returned 1 exit status
make[3]: *** [zephyr_prebuilt.elf] Error 1
make[3]: Target `all' not remade because of errors.
make[3]: Leaving directory `/w/workspace/zephyr-sanity/sanity-out/qemu_x86/samples/net/http_server/test'
make[2]: *** [sub-make] Error 2
make[2]: Target `all' not remade because of errors.
make[2]: Leaving directory `/w/workspace/zephyr-sanity'
make[1]: *** [all] Error 2
make[1]: Leaving directory `/w/workspace/zephyr-sanity/samples/net/http_server'
Generating LALR tables
---------------------sanity-out/qemu_x86/samples/net/http_server/test/build.log---------------------
0 of 1 tests passed with 0 warnings in 4 seconds
Extra environment setting:
CONFIG_ASSERT=y
Build step 'Execute shell' marked build as failure


zephyr/master: daily build zephyr-kernel-1.7.99-170219-4d096a4 Failure

donotreply@...
 

zephyr/master: daily build zephyr-kernel-1.7.99-170219-4d096a4 Failure



job zephyr-sanity build number 500 failed
see: https://jenkins.zephyrproject.org/job/zephyr-sanity/500/

AR libzephyr.a
LINK zephyr.lnk
/opt/zephyr-sdk-0.9/sysroots/x86_64-pokysdk-linux/usr/libexec/i586-zephyr-elf/gcc/i586-zephyr-elf/6.2.0/real-ld: zephyr_prebuilt.elf section `bss' will not fit in region `RAM'
/opt/zephyr-sdk-0.9/sysroots/x86_64-pokysdk-linux/usr/libexec/i586-zephyr-elf/gcc/i586-zephyr-elf/6.2.0/real-ld: region `RAM' overflowed by 33632 bytes
collect2: error: ld returned 1 exit status
make[3]: *** [zephyr_prebuilt.elf] Error 1
make[3]: Target `all' not remade because of errors.
make[3]: Leaving directory `/w/workspace/zephyr-sanity/sanity-out/qemu_x86/samples/net/http_server/test'
make[2]: *** [sub-make] Error 2
make[2]: Target `all' not remade because of errors.
make[2]: Leaving directory `/w/workspace/zephyr-sanity'
make[1]: *** [all] Error 2
make[1]: Leaving directory `/w/workspace/zephyr-sanity/samples/net/http_server'
Generating LALR tables
Platform 'panther' not specified in any arch .ini file and will not be tested
Platform 'panther_ss' not specified in any arch .ini file and will not be tested
---------------------sanity-out/qemu_x86/samples/net/http_server/test/build.log---------------------
qemu_x86 tests/net/udp/test FAILED: timeout
--------------------------sanity-out/qemu_x86/tests/net/udp/test/qemu.log---------------------------
***** BOOTING ZEPHYR OS v1.7.99 - BUILD: Feb 20 2017 01:47:26 *****
Timeout, packet not received
Timeout, packet not received
ASSERTION FAIL [_is_prio_higher(thread->base.prio, 15) || ((thread->base.prio == 15) && (thread == _idle_thread))] @ /w/workspace/zephyr-sanity/kernel/include/ksched.h:397:
--------------------------sanity-out/qemu_x86/tests/net/udp/test/qemu.log---------------------------
0 of 30 tests passed with 0 warnings in 83 seconds
Extra environment setting:
CONFIG_ASSERT=y
CONFIG_DEBUG=y
Build step 'Execute shell' marked build as failure


job zephyr-sanity build number 499 failed
see: https://jenkins.zephyrproject.org/job/zephyr-sanity/499/

make[3]: *** [run] Aborted (core dumped)
make[3]: Leaving directory `/w/workspace/zephyr-sanity/sanity-out/qemu_x86/tests/legacy/kernel/test_sleep/test'
make[2]: *** [sub-make] Error 2
make[2]: Target `run' not remade because of errors.
make[2]: Leaving directory `/w/workspace/zephyr-sanity'
make[1]: *** [run] Error 2
make[1]: Leaving directory `/w/workspace/zephyr-sanity/tests/legacy/kernel/test_sleep'
Generating LALR tables
Platform 'panther' not specified in any arch .ini file and will not be tested
Platform 'panther_ss' not specified in any arch .ini file and will not be tested
------------------sanity-out/qemu_x86/tests/legacy/kernel/test_sleep/test/run.log-------------------
qemu_x86 tests/net/udp/test FAILED: failed
--------------------------sanity-out/qemu_x86/tests/net/udp/test/qemu.log---------------------------
***** BOOTING ZEPHYR OS v1.7.99 - BUILD: Feb 20 2017 01:34:36 *****
Timeout, packet not received
Timeout, packet not received
Timeout, packet not received
Timeout, packet not received
Cannot recv buf 0xff53f000, ret -78
Timeout, packet not received
IPv6 wrong user data 0x0010df08 returned, expected 0x0010dee0
514: UDP test "&any_addr6-NULL-1234-4242" fail
===================================================================
PROJECT EXECUTION FAILED
--------------------------sanity-out/qemu_x86/tests/net/udp/test/qemu.log---------------------------
0 of 29 tests passed with 0 warnings in 33 seconds
Extra environment setting:
CONFIG_DEBUG=y
Build step 'Execute shell' marked build as failure


job zephyr-sanity build number 498 failed
see: https://jenkins.zephyrproject.org/job/zephyr-sanity/498/

CC ext/lib/crypto/mbedtls/library/x509_csr.o
CC ext/lib/crypto/mbedtls/library/x509write_crt.o
CC ext/lib/crypto/mbedtls/library/x509write_csr.o
CC ext/lib/crypto/mbedtls/library/xtea.o
LD ext/lib/crypto/mbedtls/built-in.o
LD ext/lib/crypto/built-in.o
LD ext/lib/built-in.o
LD ext/built-in.o
AR libzephyr.a
LINK zephyr.lnk
/opt/zephyr-sdk-0.9/sysroots/x86_64-pokysdk-linux/usr/libexec/i586-zephyr-elf/gcc/i586-zephyr-elf/6.2.0/real-ld: zephyr_prebuilt.elf section `noinit' will not fit in region `RAM'
/opt/zephyr-sdk-0.9/sysroots/x86_64-pokysdk-linux/usr/libexec/i586-zephyr-elf/gcc/i586-zephyr-elf/6.2.0/real-ld: region `RAM' overflowed by 2080 bytes
collect2: error: ld returned 1 exit status
make[3]: *** [zephyr_prebuilt.elf] Error 1
make[3]: Target `all' not remade because of errors.
make[3]: Leaving directory `/w/workspace/zephyr-sanity/sanity-out/qemu_x86/samples/net/http_server/test'
make[2]: *** [sub-make] Error 2
make[2]: Target `all' not remade because of errors.
make[2]: Leaving directory `/w/workspace/zephyr-sanity'
make[1]: *** [all] Error 2
make[1]: Leaving directory `/w/workspace/zephyr-sanity/samples/net/http_server'
Generating LALR tables
Platform 'panther' not specified in any arch .ini file and will not be tested
Platform 'panther_ss' not specified in any arch .ini file and will not be tested
---------------------sanity-out/qemu_x86/samples/net/http_server/test/build.log---------------------
0 of 1 tests passed with 0 warnings in 3 seconds
Extra environment setting:
CONFIG_ASSERT=y
Build step 'Execute shell' marked build as failure


zephyr/master: daily build zephyr-kernel-1.7.99-170218-4d096a4 Failure

donotreply@...
 

zephyr/master: daily build zephyr-kernel-1.7.99-170218-4d096a4 Failure



job zephyr-sanity build number 496 failed
see: https://jenkins.zephyrproject.org/job/zephyr-sanity/496/

FCW=037f FSW=0000 [ST=0] FTW=00 MXCSR=00001f80
FPR0=0000000000000000 0000 FPR1=0000000000000000 0000
FPR2=0000000000000000 0000 FPR3=0000000000000000 0000
FPR4=0000000000000000 0000 FPR5=0000000000000000 0000
FPR6=0000000000000000 0000 FPR7=0000000000000000 0000
XMM00=00000000000000000000000000000000 XMM01=00000000000000000000000000000000
XMM02=00000000000000000000000000000000 XMM03=00000000000000000000000000000000
XMM04=00000000000000000000000000000000 XMM05=00000000000000000000000000000000
XMM06=00000000000000000000000000000000 XMM07=00000000000000000000000000000000
make[3]: *** [run] Aborted (core dumped)
make[3]: Leaving directory `/w/workspace/zephyr-sanity/sanity-out/qemu_x86/tests/legacy/kernel/test_sleep/test'
make[2]: *** [sub-make] Error 2
make[2]: Target `run' not remade because of errors.
make[2]: Leaving directory `/w/workspace/zephyr-sanity'
make[1]: *** [run] Error 2
make[1]: Leaving directory `/w/workspace/zephyr-sanity/tests/legacy/kernel/test_sleep'
------------------sanity-out/qemu_x86/tests/legacy/kernel/test_sleep/test/run.log-------------------
qemu_riscv32 tests/legacy/kernel/test_sleep/test PASSED
qemu_x86 tests/net/udp/test FAILED: timeout
--------------------------sanity-out/qemu_x86/tests/net/udp/test/qemu.log---------------------------
***** BOOTING ZEPHYR OS v1.7.99 - BUILD: Feb 19 2017 01:17:01 *****
Timeout, packet not received
ASSERTION FAIL [_is_prio_higher(thread->base.prio, 15) || ((thread->base.prio == 15) && (thread == _idle_thread))] @ /w/workspace/zephyr-sanity/kernel/include/ksched.h:397:
--------------------------sanity-out/qemu_x86/tests/net/udp/test/qemu.log---------------------------
1 of 30 tests passed with 0 warnings in 78 seconds
Extra environment setting:
CONFIG_ASSERT=y
CONFIG_DEBUG=y
Build step 'Execute shell' marked build as failure


job zephyr-sanity build number 495 failed
see: https://jenkins.zephyrproject.org/job/zephyr-sanity/495/

make[4]: *** [ext/lib] Error 2
make[4]: Target `__build' not remade because of errors.
make[3]: *** [ext] Error 2
make[3]: Target `all' not remade because of errors.
make[3]: Leaving directory `/w/workspace/zephyr-sanity/sanity-out/qemu_nios2/tests/crypto/test_mbedtls/test_nios'
make[2]: *** [sub-make] Error 2
make[2]: Target `all' not remade because of errors.
make[2]: Leaving directory `/w/workspace/zephyr-sanity'
make[1]: *** [all] Error 2
make[1]: Leaving directory `/w/workspace/zephyr-sanity/tests/crypto/test_mbedtls'
Generating LALR tables
Platform 'panther' not specified in any arch .ini file and will not be tested
Platform 'panther_ss' not specified in any arch .ini file and will not be tested
----------------sanity-out/qemu_nios2/tests/crypto/test_mbedtls/test_nios/build.log-----------------
qemu_x86 tests/net/udp/test FAILED: timeout
--------------------------sanity-out/qemu_x86/tests/net/udp/test/qemu.log---------------------------
***** BOOTING ZEPHYR OS v1.7.99 - BUILD: Feb 19 2017 01:32:23 *****
Timeout, packet not received
Timeout, packet not received
Timeout, packet not received
Timeout, packet not received
Cannot recv buf 0xff53f000, ret -78
Timeout, packet not received
Timeout, packet not received
--------------------------sanity-out/qemu_x86/tests/net/udp/test/qemu.log---------------------------
0 of 29 tests passed with 0 warnings in 85 seconds
Extra environment setting:
CONFIG_DEBUG=y
Build step 'Execute shell' marked build as failure


job zephyr-sanity build number 494 failed
see: https://jenkins.zephyrproject.org/job/zephyr-sanity/494/

CC ext/lib/crypto/mbedtls/library/x509_csr.o
CC ext/lib/crypto/mbedtls/library/x509write_crt.o
CC ext/lib/crypto/mbedtls/library/x509write_csr.o
CC ext/lib/crypto/mbedtls/library/xtea.o
LD ext/lib/crypto/mbedtls/built-in.o
LD ext/lib/crypto/built-in.o
LD ext/lib/built-in.o
LD ext/built-in.o
AR libzephyr.a
LINK zephyr.lnk
/opt/zephyr-sdk-0.9/sysroots/x86_64-pokysdk-linux/usr/libexec/i586-zephyr-elf/gcc/i586-zephyr-elf/6.2.0/real-ld: zephyr_prebuilt.elf section `noinit' will not fit in region `RAM'
/opt/zephyr-sdk-0.9/sysroots/x86_64-pokysdk-linux/usr/libexec/i586-zephyr-elf/gcc/i586-zephyr-elf/6.2.0/real-ld: region `RAM' overflowed by 2080 bytes
collect2: error: ld returned 1 exit status
make[3]: *** [zephyr_prebuilt.elf] Error 1
make[3]: Target `all' not remade because of errors.
make[3]: Leaving directory `/w/workspace/zephyr-sanity/sanity-out/qemu_x86/samples/net/http_server/test'
make[2]: *** [sub-make] Error 2
make[2]: Target `all' not remade because of errors.
make[2]: Leaving directory `/w/workspace/zephyr-sanity'
make[1]: *** [all] Error 2
make[1]: Leaving directory `/w/workspace/zephyr-sanity/samples/net/http_server'
Generating LALR tables
Platform 'panther' not specified in any arch .ini file and will not be tested
Platform 'panther_ss' not specified in any arch .ini file and will not be tested
---------------------sanity-out/qemu_x86/samples/net/http_server/test/build.log---------------------
0 of 1 tests passed with 0 warnings in 4 seconds
Extra environment setting:
CONFIG_ASSERT=y
Build step 'Execute shell' marked build as failure


zephyr/refs/tags/v1.7.0-rc1: tag build zephyr-kernel-1.7.0-rc1 Fixed

donotreply@...
 

zephyr/refs/tags/v1.7.0-rc1: tag build zephyr-kernel-1.7.0-rc1 Fixed

Check console output at https://jenkins.zephyrproject.org/job/zephyr-tag/13/ to view the results.


zephyr/refs/tags/v1.7.99: tag build $RELEASE_NAME Still Failing

donotreply@...
 

zephyr/refs/tags/v1.7.99: tag build $RELEASE_NAME Still Failing

Check console output at https://jenkins.zephyrproject.org/job/zephyr-tag/12/ to view the results.


zephyr/refs/tags/v1.7.99: tag build $RELEASE_NAME Still Failing

donotreply@...
 

zephyr/refs/tags/v1.7.99: tag build $RELEASE_NAME Still Failing

Check console output at https://jenkins.zephyrproject.org/job/zephyr-tag/11/ to view the results.


zephyr/master: daily build zephyr-kernel-1.7.99-170217-923560a Failure

donotreply@...
 

zephyr/master: daily build zephyr-kernel-1.7.99-170217-923560a Failure



job zephyr-sanity build number 492 failed
see: https://jenkins.zephyrproject.org/job/zephyr-sanity/492/

EFER=0000000000000000
FCW=037f FSW=0000 [ST=0] FTW=00 MXCSR=00001f80
FPR0=0000000000000000 0000 FPR1=0000000000000000 0000
FPR2=0000000000000000 0000 FPR3=0000000000000000 0000
FPR4=0000000000000000 0000 FPR5=0000000000000000 0000
FPR6=0000000000000000 0000 FPR7=0000000000000000 0000
XMM00=00000000000000000000000000000000 XMM01=00000000000000000000000000000000
XMM02=00000000000000000000000000000000 XMM03=00000000000000000000000000000000
XMM04=00000000000000000000000000000000 XMM05=00000000000000000000000000000000
XMM06=00000000000000000000000000000000 XMM07=00000000000000000000000000000000
make[3]: *** [run] Aborted (core dumped)
make[3]: Leaving directory `/w/workspace/zephyr-sanity/sanity-out/qemu_x86/tests/legacy/kernel/test_sleep/test'
make[2]: *** [sub-make] Error 2
make[2]: Target `run' not remade because of errors.
make[2]: Leaving directory `/w/workspace/zephyr-sanity'
make[1]: *** [run] Error 2
make[1]: Leaving directory `/w/workspace/zephyr-sanity/tests/legacy/kernel/test_sleep'
------------------sanity-out/qemu_x86/tests/legacy/kernel/test_sleep/test/run.log-------------------
qemu_x86 tests/net/udp/test FAILED: timeout
--------------------------sanity-out/qemu_x86/tests/net/udp/test/qemu.log---------------------------
***** BOOTING ZEPHYR OS v1.7.99 - BUILD: Feb 18 2017 01:47:20 *****
Timeout, packet not received
ASSERTION FAIL [_is_prio_higher(thread->base.prio, 15) || ((thread->base.prio == 15) && (thread == _idle_thread))] @ /w/workspace/zephyr-sanity/kernel/include/ksched.h:397:
--------------------------sanity-out/qemu_x86/tests/net/udp/test/qemu.log---------------------------
0 of 29 tests passed with 0 warnings in 84 seconds
Extra environment setting:
CONFIG_ASSERT=y
CONFIG_DEBUG=y
Build step 'Execute shell' marked build as failure


job zephyr-sanity build number 491 failed
see: https://jenkins.zephyrproject.org/job/zephyr-sanity/491/

make[3]: Target `all' not remade because of errors.
make[3]: Leaving directory `/w/workspace/zephyr-sanity/sanity-out/qemu_x86/samples/net/http_server/test'
make[2]: *** [sub-make] Error 2
make[2]: Target `all' not remade because of errors.
make[2]: Leaving directory `/w/workspace/zephyr-sanity'
make[1]: *** [all] Error 2
make[1]: Leaving directory `/w/workspace/zephyr-sanity/samples/net/http_server'
Generating LALR tables
Platform 'panther' not specified in any arch .ini file and will not be tested
Platform 'panther_ss' not specified in any arch .ini file and will not be tested
---------------------sanity-out/qemu_x86/samples/net/http_server/test/build.log---------------------
qemu_x86 tests/net/udp/test FAILED: failed
--------------------------sanity-out/qemu_x86/tests/net/udp/test/qemu.log---------------------------
***** BOOTING ZEPHYR OS v1.7.99 - BUILD: Feb 18 2017 01:37:05 *****
Timeout, packet not received
Timeout, packet not received
Timeout, packet not received
Timeout, packet not received
Cannot recv buf 0xff53f000, ret -78
Timeout, packet not received
IPv6 wrong user data 0x0010df08 returned, expected 0x0010dee0
514: UDP test "&any_addr6-NULL-1234-4242" fail
===================================================================
PROJECT EXECUTION FAILED
--------------------------sanity-out/qemu_x86/tests/net/udp/test/qemu.log---------------------------
0 of 29 tests passed with 0 warnings in 33 seconds
Extra environment setting:
CONFIG_DEBUG=y
Build step 'Execute shell' marked build as failure


job zephyr-sanity build number 490 failed
see: https://jenkins.zephyrproject.org/job/zephyr-sanity/490/

CC ext/lib/crypto/mbedtls/library/x509_csr.o
CC ext/lib/crypto/mbedtls/library/x509write_crt.o
CC ext/lib/crypto/mbedtls/library/x509write_csr.o
CC ext/lib/crypto/mbedtls/library/xtea.o
LD ext/lib/crypto/mbedtls/built-in.o
LD ext/lib/crypto/built-in.o
LD ext/lib/built-in.o
LD ext/built-in.o
AR libzephyr.a
LINK zephyr.lnk
/opt/zephyr-sdk-0.9/sysroots/x86_64-pokysdk-linux/usr/libexec/i586-zephyr-elf/gcc/i586-zephyr-elf/6.2.0/real-ld: zephyr_prebuilt.elf section `noinit' will not fit in region `RAM'
/opt/zephyr-sdk-0.9/sysroots/x86_64-pokysdk-linux/usr/libexec/i586-zephyr-elf/gcc/i586-zephyr-elf/6.2.0/real-ld: region `RAM' overflowed by 2080 bytes
collect2: error: ld returned 1 exit status
make[3]: *** [zephyr_prebuilt.elf] Error 1
make[3]: Target `all' not remade because of errors.
make[3]: Leaving directory `/w/workspace/zephyr-sanity/sanity-out/qemu_x86/samples/net/http_server/test'
make[2]: *** [sub-make] Error 2
make[2]: Target `all' not remade because of errors.
make[2]: Leaving directory `/w/workspace/zephyr-sanity'
make[1]: *** [all] Error 2
make[1]: Leaving directory `/w/workspace/zephyr-sanity/samples/net/http_server'
Generating LALR tables
Platform 'panther' not specified in any arch .ini file and will not be tested
Platform 'panther_ss' not specified in any arch .ini file and will not be tested
---------------------sanity-out/qemu_x86/samples/net/http_server/test/build.log---------------------
0 of 1 tests passed with 0 warnings in 3 seconds
Extra environment setting:
CONFIG_ASSERT=y
Build step 'Execute shell' marked build as failure


zephyr/master: daily build zephyr-kernel-1.7.99-170216-e08d07c Failure

donotreply@...
 

zephyr/master: daily build zephyr-kernel-1.7.99-170216-e08d07c Failure



job zephyr-sanity build number 488 failed
see: https://jenkins.zephyrproject.org/job/zephyr-sanity/488/

EFER=0000000000000000
FCW=037f FSW=0000 [ST=0] FTW=00 MXCSR=00001f80
FPR0=0000000000000000 0000 FPR1=0000000000000000 0000
FPR2=0000000000000000 0000 FPR3=0000000000000000 0000
FPR4=0000000000000000 0000 FPR5=0000000000000000 0000
FPR6=0000000000000000 0000 FPR7=0000000000000000 0000
XMM00=00000000000000000000000000000000 XMM01=00000000000000000000000000000000
XMM02=00000000000000000000000000000000 XMM03=00000000000000000000000000000000
XMM04=00000000000000000000000000000000 XMM05=00000000000000000000000000000000
XMM06=00000000000000000000000000000000 XMM07=00000000000000000000000000000000
make[3]: *** [run] Aborted (core dumped)
make[3]: Leaving directory `/w/workspace/zephyr-sanity/sanity-out/qemu_x86/tests/net/route/test'
make[2]: *** [sub-make] Error 2
make[2]: Target `run' not remade because of errors.
make[2]: Leaving directory `/w/workspace/zephyr-sanity'
make[1]: *** [run] Error 2
make[1]: Leaving directory `/w/workspace/zephyr-sanity/tests/net/route'
--------------------------sanity-out/qemu_x86/tests/net/route/test/run.log--------------------------
qemu_x86 tests/net/udp/test FAILED: timeout
--------------------------sanity-out/qemu_x86/tests/net/udp/test/qemu.log---------------------------
***** BOOTING ZEPHYR OS v1.7.99 - BUILD: Feb 17 2017 01:46:40 *****
Timeout, packet not received
ASSERTION FAIL [_is_prio_higher(thread->base.prio, 15) || ((thread->base.prio == 15) && (thread == _idle_thread))] @ /w/workspace/zephyr-sanity/kernel/include/ksched.h:397:
--------------------------sanity-out/qemu_x86/tests/net/udp/test/qemu.log---------------------------
0 of 30 tests passed with 0 warnings in 83 seconds
Extra environment setting:
CONFIG_ASSERT=y
CONFIG_DEBUG=y
Build step 'Execute shell' marked build as failure


job zephyr-sanity build number 487 failed
see: https://jenkins.zephyrproject.org/job/zephyr-sanity/487/

GDT= 00100070 00000017
IDT= 00102df0 000007ff
CR0=0000003f CR2=00000000 CR3=00000000 CR4=00000000
DR0=00000000 DR1=00000000 DR2=00000000 DR3=00000000
DR6=ffff0ff0 DR7=00000400
CCS=0000000a CCD=0000003c CCO=CLR
EFER=0000000000000000
FCW=037f FSW=0000 [ST=0] FTW=00 MXCSR=00001f80
FPR0=0000000000000000 0000 FPR1=0000000000000000 0000
FPR2=0000000000000000 0000 FPR3=0000000000000000 0000
FPR4=0000000000000000 0000 FPR5=0000000000000000 0000
FPR6=0000000000000000 0000 FPR7=0000000000000000 0000
XMM00=00000000000000000000000000000000 XMM01=00000000000000000000000000000000
XMM02=00000000000000000000000000000000 XMM03=00000000000000000000000000000000
XMM04=00000000000000000000000000000000 XMM05=00000000000000000000000000000000
XMM06=00000000000000000000000000000000 XMM07=00000000000000000000000000000000
make[3]: *** [run] Aborted (core dumped)
make[3]: Leaving directory `/w/workspace/zephyr-sanity/sanity-out/qemu_x86/tests/legacy/kernel/test_sleep/test'
make[2]: *** [sub-make] Error 2
make[2]: Target `run' not remade because of errors.
make[2]: Leaving directory `/w/workspace/zephyr-sanity'
make[1]: *** [run] Error 2
make[1]: Leaving directory `/w/workspace/zephyr-sanity/tests/legacy/kernel/test_sleep'
------------------sanity-out/qemu_x86/tests/legacy/kernel/test_sleep/test/run.log-------------------
qemu_riscv32 tests/legacy/kernel/test_sleep/test PASSED
1 of 30 tests passed with 0 warnings in 32 seconds
Extra environment setting:
CONFIG_DEBUG=y
Build step 'Execute shell' marked build as failure


job zephyr-sanity build number 486 failed
see: https://jenkins.zephyrproject.org/job/zephyr-sanity/486/

CC ext/lib/crypto/mbedtls/library/x509_csr.o
CC ext/lib/crypto/mbedtls/library/x509write_crt.o
CC ext/lib/crypto/mbedtls/library/x509write_csr.o
CC ext/lib/crypto/mbedtls/library/xtea.o
LD ext/lib/crypto/mbedtls/built-in.o
LD ext/lib/crypto/built-in.o
LD ext/lib/built-in.o
LD ext/built-in.o
AR libzephyr.a
LINK zephyr.lnk
/opt/zephyr-sdk-0.9/sysroots/x86_64-pokysdk-linux/usr/libexec/i586-zephyr-elf/gcc/i586-zephyr-elf/6.2.0/real-ld: zephyr_prebuilt.elf section `noinit' will not fit in region `RAM'
/opt/zephyr-sdk-0.9/sysroots/x86_64-pokysdk-linux/usr/libexec/i586-zephyr-elf/gcc/i586-zephyr-elf/6.2.0/real-ld: region `RAM' overflowed by 2080 bytes
collect2: error: ld returned 1 exit status
make[3]: *** [zephyr_prebuilt.elf] Error 1
make[3]: Target `all' not remade because of errors.
make[3]: Leaving directory `/w/workspace/zephyr-sanity/sanity-out/qemu_x86/samples/net/http_server/test'
make[2]: *** [sub-make] Error 2
make[2]: Target `all' not remade because of errors.
make[2]: Leaving directory `/w/workspace/zephyr-sanity'
make[1]: *** [all] Error 2
make[1]: Leaving directory `/w/workspace/zephyr-sanity/samples/net/http_server'
Generating LALR tables
Platform 'panther' not specified in any arch .ini file and will not be tested
Platform 'panther_ss' not specified in any arch .ini file and will not be tested
---------------------sanity-out/qemu_x86/samples/net/http_server/test/build.log---------------------
0 of 1 tests passed with 0 warnings in 4 seconds
Extra environment setting:
CONFIG_ASSERT=y
Build step 'Execute shell' marked build as failure


zephyr/master: daily build zephyr-kernel-1.7.99-170215-161a863 Failure

donotreply@...
 

zephyr/master: daily build zephyr-kernel-1.7.99-170215-161a863 Failure



job zephyr-sanity build number 484 failed
see: https://jenkins.zephyrproject.org/job/zephyr-sanity/484/

LD ext/built-in.o
AR libzephyr.a
LINK zephyr.lnk
/opt/zephyr-sdk-0.9/sysroots/x86_64-pokysdk-linux/usr/libexec/i586-zephyr-elf/gcc/i586-zephyr-elf/6.2.0/real-ld: zephyr_prebuilt.elf section `bss' will not fit in region `RAM'
/opt/zephyr-sdk-0.9/sysroots/x86_64-pokysdk-linux/usr/libexec/i586-zephyr-elf/gcc/i586-zephyr-elf/6.2.0/real-ld: region `RAM' overflowed by 33760 bytes
collect2: error: ld returned 1 exit status
make[3]: *** [zephyr_prebuilt.elf] Error 1
make[3]: Target `all' not remade because of errors.
make[3]: Leaving directory `/w/workspace/zephyr-sanity/sanity-out/qemu_x86/samples/net/http_server/test'
make[2]: *** [sub-make] Error 2
make[2]: Target `all' not remade because of errors.
make[2]: Leaving directory `/w/workspace/zephyr-sanity'
make[1]: *** [all] Error 2
make[1]: Leaving directory `/w/workspace/zephyr-sanity/samples/net/http_server'
Generating LALR tables
Platform 'panther' not specified in any arch .ini file and will not be tested
Platform 'panther_ss' not specified in any arch .ini file and will not be tested
---------------------sanity-out/qemu_x86/samples/net/http_server/test/build.log---------------------
qemu_x86 tests/net/udp/test FAILED: timeout
--------------------------sanity-out/qemu_x86/tests/net/udp/test/qemu.log---------------------------
***** BOOTING ZEPHYR OS v1.7.99 - BUILD: Feb 16 2017 01:52:26 *****
Timeout, packet not received
ASSERTION FAIL [_is_prio_higher(thread->base.prio, 15) || ((thread->base.prio == 15) && (thread == _idle_thread))] @ /w/workspace/zephyr-sanity/kernel/include/ksched.h:388:
--------------------------sanity-out/qemu_x86/tests/net/udp/test/qemu.log---------------------------
0 of 28 tests passed with 0 warnings in 86 seconds
Extra environment setting:
CONFIG_ASSERT=y
CONFIG_DEBUG=y
Build step 'Execute shell' marked build as failure


job zephyr-sanity build number 483 failed
see: https://jenkins.zephyrproject.org/job/zephyr-sanity/483/

TR =0000 00000000 0000ffff 00008b00 DPL=0 TSS32-busy
GDT= 00100070 00000017
IDT= 00102e10 000007ff
CR0=0000003f CR2=00000000 CR3=00000000 CR4=00000000
DR0=00000000 DR1=00000000 DR2=00000000 DR3=00000000
DR6=ffff0ff0 DR7=00000400
CCS=0000000a CCD=0000003c CCO=CLR
EFER=0000000000000000
FCW=037f FSW=0000 [ST=0] FTW=00 MXCSR=00001f80
FPR0=0000000000000000 0000 FPR1=0000000000000000 0000
FPR2=0000000000000000 0000 FPR3=0000000000000000 0000
FPR4=0000000000000000 0000 FPR5=0000000000000000 0000
FPR6=0000000000000000 0000 FPR7=0000000000000000 0000
XMM00=00000000000000000000000000000000 XMM01=00000000000000000000000000000000
XMM02=00000000000000000000000000000000 XMM03=00000000000000000000000000000000
XMM04=00000000000000000000000000000000 XMM05=00000000000000000000000000000000
XMM06=00000000000000000000000000000000 XMM07=00000000000000000000000000000000
make[3]: *** [run] Aborted (core dumped)
make[3]: Leaving directory `/w/workspace/zephyr-sanity/sanity-out/qemu_x86/tests/legacy/kernel/test_sleep/test'
make[2]: *** [sub-make] Error 2
make[2]: Target `run' not remade because of errors.
make[2]: Leaving directory `/w/workspace/zephyr-sanity'
make[1]: *** [run] Error 2
make[1]: Leaving directory `/w/workspace/zephyr-sanity/tests/legacy/kernel/test_sleep'
------------------sanity-out/qemu_x86/tests/legacy/kernel/test_sleep/test/run.log-------------------
0 of 27 tests passed with 0 warnings in 30 seconds
Extra environment setting:
CONFIG_DEBUG=y
Build step 'Execute shell' marked build as failure


job zephyr-sanity build number 482 failed
see: https://jenkins.zephyrproject.org/job/zephyr-sanity/482/

CC ext/lib/crypto/mbedtls/library/x509_csr.o
CC ext/lib/crypto/mbedtls/library/x509write_crt.o
CC ext/lib/crypto/mbedtls/library/x509write_csr.o
CC ext/lib/crypto/mbedtls/library/xtea.o
LD ext/lib/crypto/mbedtls/built-in.o
LD ext/lib/crypto/built-in.o
LD ext/lib/built-in.o
LD ext/built-in.o
AR libzephyr.a
LINK zephyr.lnk
/opt/zephyr-sdk-0.9/sysroots/x86_64-pokysdk-linux/usr/libexec/i586-zephyr-elf/gcc/i586-zephyr-elf/6.2.0/real-ld: zephyr_prebuilt.elf section `noinit' will not fit in region `RAM'
/opt/zephyr-sdk-0.9/sysroots/x86_64-pokysdk-linux/usr/libexec/i586-zephyr-elf/gcc/i586-zephyr-elf/6.2.0/real-ld: region `RAM' overflowed by 2176 bytes
collect2: error: ld returned 1 exit status
make[3]: *** [zephyr_prebuilt.elf] Error 1
make[3]: Target `all' not remade because of errors.
make[3]: Leaving directory `/w/workspace/zephyr-sanity/sanity-out/qemu_x86/samples/net/http_server/test'
make[2]: *** [sub-make] Error 2
make[2]: Target `all' not remade because of errors.
make[2]: Leaving directory `/w/workspace/zephyr-sanity'
make[1]: *** [all] Error 2
make[1]: Leaving directory `/w/workspace/zephyr-sanity/samples/net/http_server'
Generating LALR tables
Platform 'panther' not specified in any arch .ini file and will not be tested
Platform 'panther_ss' not specified in any arch .ini file and will not be tested
---------------------sanity-out/qemu_x86/samples/net/http_server/test/build.log---------------------
0 of 1 tests passed with 0 warnings in 3 seconds
Extra environment setting:
CONFIG_ASSERT=y
Build step 'Execute shell' marked build as failure


zephyr/refs/tags/v1.7.99: tag build $RELEASE_NAME Failure

donotreply@...
 

zephyr/refs/tags/v1.7.99: tag build $RELEASE_NAME Failure

Check console output at https://jenkins.zephyrproject.org/job/zephyr-tag/10/ to view the results.


zephyr/refs/tags/v1.7.0-rc1: tag build zephyr-kernel-1.7.0-rc1 Successful

donotreply@...
 

zephyr/refs/tags/v1.7.0-rc1: tag build zephyr-kernel-1.7.0-rc1 Successful

Check console output at https://jenkins.zephyrproject.org/job/zephyr-tag/9/ to view the results.


zephyr/master: daily build zephyr-kernel-1.6.99-170214-047ae40 Failure

donotreply@...
 

zephyr/master: daily build zephyr-kernel-1.6.99-170214-047ae40 Failure



job zephyr-sanity build number 480 failed
see: https://jenkins.zephyrproject.org/job/zephyr-sanity/480/

FCW=037f FSW=0000 [ST=0] FTW=00 MXCSR=00001f80
FPR0=0000000000000000 0000 FPR1=0000000000000000 0000
FPR2=0000000000000000 0000 FPR3=0000000000000000 0000
FPR4=0000000000000000 0000 FPR5=0000000000000000 0000
FPR6=0000000000000000 0000 FPR7=0000000000000000 0000
XMM00=00000000000000000000000000000000 XMM01=00000000000000000000000000000000
XMM02=00000000000000000000000000000000 XMM03=00000000000000000000000000000000
XMM04=00000000000000000000000000000000 XMM05=00000000000000000000000000000000
XMM06=00000000000000000000000000000000 XMM07=00000000000000000000000000000000
make[3]: *** [run] Aborted (core dumped)
make[3]: Target `qemu' not remade because of errors.
make[3]: Leaving directory `/w/workspace/zephyr-sanity/sanity-out/qemu_x86/tests/legacy/kernel/test_sleep/test'
make[2]: *** [sub-make] Error 2
make[2]: Target `qemu' not remade because of errors.
make[2]: Leaving directory `/w/workspace/zephyr-sanity'
make[1]: *** [qemu] Error 2
make[1]: Leaving directory `/w/workspace/zephyr-sanity/tests/legacy/kernel/test_sleep'
------------------sanity-out/qemu_x86/tests/legacy/kernel/test_sleep/test/run.log-------------------
qemu_x86 tests/net/udp/test FAILED: timeout
--------------------------sanity-out/qemu_x86/tests/net/udp/test/qemu.log---------------------------
***** BOOTING ZEPHYR OS v1.6.99 - BUILD: Feb 15 2017 02:02:37 *****
Timeout, packet not received
ASSERTION FAIL [_is_prio_higher(thread->base.prio, 15) || ((thread->base.prio == 15) && (thread == _idle_thread))] @ /w/workspace/zephyr-sanity/kernel/include/ksched.h:388:
--------------------------sanity-out/qemu_x86/tests/net/udp/test/qemu.log---------------------------
1 of 33 tests passed with 0 warnings in 96 seconds
Extra environment setting:
CONFIG_ASSERT=y
CONFIG_DEBUG=y
Build step 'Execute shell' marked build as failure


job zephyr-sanity build number 479 failed
see: https://jenkins.zephyrproject.org/job/zephyr-sanity/479/

CC ext/lib/crypto/mbedtls/library/x509_csr.o
CC ext/lib/crypto/mbedtls/library/x509write_crt.o
CC ext/lib/crypto/mbedtls/library/x509write_csr.o
CC ext/lib/crypto/mbedtls/library/xtea.o
LD ext/lib/crypto/mbedtls/built-in.o
LD ext/lib/crypto/built-in.o
LD ext/lib/built-in.o
LD ext/built-in.o
AR libzephyr.a
LINK zephyr.lnk
/opt/zephyr-sdk-0.9/sysroots/x86_64-pokysdk-linux/usr/libexec/i586-zephyr-elf/gcc/i586-zephyr-elf/6.2.0/real-ld: zephyr_prebuilt.elf section `bss' will not fit in region `RAM'
/opt/zephyr-sdk-0.9/sysroots/x86_64-pokysdk-linux/usr/libexec/i586-zephyr-elf/gcc/i586-zephyr-elf/6.2.0/real-ld: region `RAM' overflowed by 28832 bytes
collect2: error: ld returned 1 exit status
make[3]: *** [zephyr_prebuilt.elf] Error 1
make[3]: Target `all' not remade because of errors.
make[3]: Leaving directory `/w/workspace/zephyr-sanity/sanity-out/qemu_x86/samples/net/http_server/test'
make[2]: *** [sub-make] Error 2
make[2]: Target `all' not remade because of errors.
make[2]: Leaving directory `/w/workspace/zephyr-sanity'
make[1]: *** [all] Error 2
make[1]: Leaving directory `/w/workspace/zephyr-sanity/samples/net/http_server'
Generating LALR tables
Platform 'panther' not specified in any arch .ini file and will not be tested
Platform 'panther_ss' not specified in any arch .ini file and will not be tested
---------------------sanity-out/qemu_x86/samples/net/http_server/test/build.log---------------------
0 of 32 tests passed with 0 warnings in 34 seconds
Extra environment setting:
CONFIG_DEBUG=y
Build step 'Execute shell' marked build as failure


job zephyr-sanity build number 478 failed
see: https://jenkins.zephyrproject.org/job/zephyr-sanity/478/

CC kernel/mailbox.o
LD arch/built-in.o
CC kernel/mem_pool.o
CC kernel/mem_slab.o
CC kernel/msg_q.o
CC kernel/pipes.o
CC kernel/sched.o
CC kernel/sem.o
CC kernel/mutex.o
CC kernel/stack.o
CC kernel/system_work_q.o
CC kernel/sys_clock.o
CC kernel/thread.o
CC kernel/thread_abort.o
CC kernel/work_q.o
LD kernel/built-in.o
AR kernel/lib.a
make[3]: Target `all' not remade because of errors.
make[3]: Leaving directory `/w/workspace/zephyr-sanity/sanity-out/tinytile/tests/legacy/benchmark/footprint/nanokernel/footprint-min'
make[2]: *** [sub-make] Error 2
make[2]: Target `all' not remade because of errors.
make[2]: Leaving directory `/w/workspace/zephyr-sanity'
make[1]: *** [all] Error 2
make[1]: Leaving directory `/w/workspace/zephyr-sanity/tests/legacy/benchmark/footprint/nanokernel'
------sanity-out/tinytile/tests/legacy/benchmark/footprint/nanokernel/footprint-min/build.log-------
0 of 6 tests passed with 0 warnings in 7 seconds
Extra environment setting:
CONFIG_ASSERT=y
Build step 'Execute shell' marked build as failure


job zephyr-sanity build number 477 failed
see: https://jenkins.zephyrproject.org/job/zephyr-sanity/477/

CC kernel/mailbox.o
LD drivers/built-in.o
CC kernel/mem_pool.o
LD arch/x86/built-in.o
CC kernel/mem_slab.o
CC kernel/msg_q.o
CC kernel/mutex.o
CC kernel/pipes.o
LD arch/built-in.o
CC kernel/sched.o
CC kernel/sem.o
CC kernel/stack.o
CC kernel/sys_clock.o
CC kernel/system_work_q.o
CC kernel/thread.o
CC kernel/thread_abort.o
CC kernel/work_q.o
LD kernel/built-in.o
AR kernel/lib.a
make[3]: Target `all' not remade because of errors.
make[3]: Leaving directory `/w/workspace/zephyr-sanity/sanity-out/tinytile/tests/legacy/benchmark/footprint/nanokernel/footprint-min'
make[2]: *** [sub-make] Error 2
make[2]: Target `all' not remade because of errors.
make[2]: Leaving directory `/w/workspace/zephyr-sanity'
make[1]: *** [all] Error 2
make[1]: Leaving directory `/w/workspace/zephyr-sanity/tests/legacy/benchmark/footprint/nanokernel'
------sanity-out/tinytile/tests/legacy/benchmark/footprint/nanokernel/footprint-min/build.log-------
0 of 5 tests passed with 0 warnings in 7 seconds
Build step 'Execute shell' marked build as failure


zephyr/master: daily build zephyr-kernel-1.6.99-170213-f1260fb Failure

donotreply@...
 

zephyr/master: daily build zephyr-kernel-1.6.99-170213-f1260fb Failure



job zephyr-sanity build number 476 failed
see: https://jenkins.zephyrproject.org/job/zephyr-sanity/476/

CC kernel/work_q.o
LD kernel/built-in.o
AR kernel/lib.a
make[3]: Target `all' not remade because of errors.
make[3]: Leaving directory `/w/workspace/zephyr-sanity/sanity-out/stm32_mini_a15/tests/crypto/test_mbedtls/test'
make[2]: *** [sub-make] Error 2
make[2]: Target `all' not remade because of errors.
make[2]: Leaving directory `/w/workspace/zephyr-sanity'
make[1]: *** [all] Error 2
make[1]: Leaving directory `/w/workspace/zephyr-sanity/tests/crypto/test_mbedtls'
Generating LALR tables
Platform 'panther' not specified in any arch .ini file and will not be tested
Platform 'panther_ss' not specified in any arch .ini file and will not be tested
-----------------sanity-out/stm32_mini_a15/tests/crypto/test_mbedtls/test/build.log-----------------
qemu_x86 tests/net/udp/test FAILED: failed
--------------------------sanity-out/qemu_x86/tests/net/udp/test/qemu.log---------------------------
***** BOOTING ZEPHYR OS v1.6.99 - BUILD: Feb 14 2017 02:05:28 *****
Timeout, packet not received
Timeout, packet not received
IPv4 wrong user data 0x0010eae8 returned, expected 0x0010ead4
507: UDP test "&any_addr4-&any_addr4-1234-4242" fail
===================================================================
PROJECT EXECUTION FAILED
--------------------------sanity-out/qemu_x86/tests/net/udp/test/qemu.log---------------------------
0 of 26 tests passed with 0 warnings in 28 seconds
Extra environment setting:
CONFIG_ASSERT=y
CONFIG_DEBUG=y
Build step 'Execute shell' marked build as failure


job zephyr-sanity build number 475 failed
see: https://jenkins.zephyrproject.org/job/zephyr-sanity/475/

CC kernel/msg_q.o
CC kernel/mutex.o
CC kernel/pipes.o
CC kernel/sched.o
CC kernel/sem.o
CC kernel/stack.o
CC kernel/sys_clock.o
CC kernel/system_work_q.o
CC kernel/thread.o
CC kernel/thread_abort.o
CC kernel/timer.o
CC kernel/work_q.o
LD kernel/built-in.o
AR kernel/lib.a
make[3]: Target `all' not remade because of errors.
make[3]: Leaving directory `/w/workspace/zephyr-sanity/sanity-out/stm32373c_eval/tests/crypto/test_mbedtls/test'
make[2]: *** [sub-make] Error 2
make[2]: Target `all' not remade because of errors.
make[2]: Leaving directory `/w/workspace/zephyr-sanity'
make[1]: *** [all] Error 2
make[1]: Leaving directory `/w/workspace/zephyr-sanity/tests/crypto/test_mbedtls'
Generating LALR tables
Platform 'panther' not specified in any arch .ini file and will not be tested
Platform 'panther_ss' not specified in any arch .ini file and will not be tested
-----------------sanity-out/stm32373c_eval/tests/crypto/test_mbedtls/test/build.log-----------------
0 of 26 tests passed with 0 warnings in 41 seconds
Extra environment setting:
CONFIG_DEBUG=y
Build step 'Execute shell' marked build as failure


zephyr/master: daily build zephyr-kernel-1.6.99-170212-0c87784 Failure

donotreply@...
 

zephyr/master: daily build zephyr-kernel-1.6.99-170212-0c87784 Failure



job zephyr-sanity build number 472 failed
see: https://jenkins.zephyrproject.org/job/zephyr-sanity/472/

FCW=037f FSW=0000 [ST=0] FTW=00 MXCSR=00001f80
FPR0=0000000000000000 0000 FPR1=0000000000000000 0000
FPR2=0000000000000000 0000 FPR3=0000000000000000 0000
FPR4=0000000000000000 0000 FPR5=0000000000000000 0000
FPR6=0000000000000000 0000 FPR7=0000000000000000 0000
XMM00=00000000000000000000000000000000 XMM01=00000000000000000000000000000000
XMM02=00000000000000000000000000000000 XMM03=00000000000000000000000000000000
XMM04=00000000000000000000000000000000 XMM05=00000000000000000000000000000000
XMM06=00000000000000000000000000000000 XMM07=00000000000000000000000000000000
make[3]: *** [run] Aborted (core dumped)
make[3]: Target `qemu' not remade because of errors.
make[3]: Leaving directory `/w/workspace/zephyr-sanity/sanity-out/qemu_x86/tests/legacy/kernel/test_sleep/test'
make[2]: *** [sub-make] Error 2
make[2]: Target `qemu' not remade because of errors.
make[2]: Leaving directory `/w/workspace/zephyr-sanity'
make[1]: *** [qemu] Error 2
make[1]: Leaving directory `/w/workspace/zephyr-sanity/tests/legacy/kernel/test_sleep'
------------------sanity-out/qemu_x86/tests/legacy/kernel/test_sleep/test/run.log-------------------
qemu_x86 tests/net/udp/test FAILED: timeout
--------------------------sanity-out/qemu_x86/tests/net/udp/test/qemu.log---------------------------
***** BOOTING ZEPHYR OS v1.6.99 - BUILD: Feb 13 2017 01:24:06 *****
Timeout, packet not received
ASSERTION FAIL [_is_prio_higher(thread->base.prio, 15) || ((thread->base.prio == 15) && (thread == _idle_thread))] @ /w/workspace/zephyr-sanity/kernel/include/ksched.h:388:
--------------------------sanity-out/qemu_x86/tests/net/udp/test/qemu.log---------------------------
0 of 26 tests passed with 0 warnings in 81 seconds
Extra environment setting:
CONFIG_ASSERT=y
CONFIG_DEBUG=y
Build step 'Execute shell' marked build as failure


job zephyr-sanity build number 471 failed
see: https://jenkins.zephyrproject.org/job/zephyr-sanity/471/

LD arch/built-in.o
LD drivers/serial/built-in.o
LD drivers/built-in.o
AR kernel/lib.a
make[3]: Target `all' not remade because of errors.
make[3]: Leaving directory `/w/workspace/zephyr-sanity/sanity-out/sam_e70_xplained/tests/crypto/test_mbedtls/test'
make[2]: *** [sub-make] Error 2
make[2]: Target `all' not remade because of errors.
make[2]: Leaving directory `/w/workspace/zephyr-sanity'
make[1]: *** [all] Error 2
make[1]: Leaving directory `/w/workspace/zephyr-sanity/tests/crypto/test_mbedtls'
Generating LALR tables
Platform 'panther' not specified in any arch .ini file and will not be tested
Platform 'panther_ss' not specified in any arch .ini file and will not be tested
----------------sanity-out/sam_e70_xplained/tests/crypto/test_mbedtls/test/build.log----------------
qemu_x86 tests/net/udp/test FAILED: failed
--------------------------sanity-out/qemu_x86/tests/net/udp/test/qemu.log---------------------------
***** BOOTING ZEPHYR OS v1.6.99 - BUILD: Feb 13 2017 01:07:17 *****
Timeout, packet not received
Timeout, packet not received
IPv4 wrong user data 0x0010dfc8 returned, expected 0x0010dfb4
507: UDP test "&any_addr4-&any_addr4-1234-4242" fail
===================================================================
PROJECT EXECUTION FAILED
--------------------------sanity-out/qemu_x86/tests/net/udp/test/qemu.log---------------------------
0 of 26 tests passed with 0 warnings in 37 seconds
Extra environment setting:
CONFIG_DEBUG=y
Build step 'Execute shell' marked build as failure

2941 - 2960 of 2976