Date   

[ master ] Build FAILED for zephyrproject-rtos/ci-test ( re-enable notifications Signed-off-by: Anas Nashif <anas.nashif@intel.com> ) on Shippable.com

Shippable.com <noreply@...>
 

SHIPPABLE BUILD REPORT

373
ci-test
Branch : master Sha : aa9e886bb0
Builder : Anas Nashif Triggered By : Anas Nashif
Custom Environment Variables:
JOB_TRIGGERED_BY_NAME="daily-verify-debug"
JOB_TRIGGERED_BY_ID="31726"
# Runtime Status Tests Branch Coverage Sequence Coverage Triggered at Duration
373.1 none failed 1067/1078 N/A N/A Fri Jul 21 2017 04:13:30 GMT+0000 (UTC) 01:42:50
373.2 none failed 1065/1078 N/A N/A Fri Jul 21 2017 04:13:30 GMT+0000 (UTC) 01:42:40
373.3 none failed 1069/1078 N/A N/A Fri Jul 21 2017 04:13:30 GMT+0000 (UTC) 01:53:86
373.4 none failed 1064/1078 N/A N/A Fri Jul 21 2017 04:13:30 GMT+0000 (UTC) 01:53:89
373.5 none failed 1069/1078 N/A N/A Fri Jul 21 2017 04:13:30 GMT+0000 (UTC) 01:41:67
373.6 none failed 1059/1076 N/A N/A Fri Jul 21 2017 04:13:30 GMT+0000 (UTC) 01:52:16


Need help with Shippable? File an Issue


[ master ] Build FAILED for zephyrproject-rtos/ci-test ( re-enable notifications Signed-off-by: Anas Nashif <anas.nashif@intel.com> ) on Shippable.com

Shippable.com <noreply@...>
 

SHIPPABLE BUILD REPORT

371
ci-test
Branch : master Sha : aa9e886bb0
Builder : Anas Nashif Triggered By : Anas Nashif
Custom Environment Variables:
JOB_TRIGGERED_BY_NAME="daily-verify-arm"
JOB_TRIGGERED_BY_ID="28597"
# Runtime Status Tests Branch Coverage Sequence Coverage Triggered at Duration
371.1 none failed 769/780 N/A N/A Fri Jul 21 2017 02:54:12 GMT+0000 (UTC) 01:71:68
371.2 none failed 765/780 N/A N/A Fri Jul 21 2017 02:54:12 GMT+0000 (UTC) 01:73:84
371.3 none succeeded 780/780 N/A N/A Fri Jul 21 2017 02:54:12 GMT+0000 (UTC) 01:79:48
371.4 none failed 763/780 N/A N/A Fri Jul 21 2017 02:54:12 GMT+0000 (UTC) 01:81:69
371.5 none failed 766/780 N/A N/A Fri Jul 21 2017 02:54:12 GMT+0000 (UTC) 01:76:79
371.6 none failed 768/782 N/A N/A Fri Jul 21 2017 02:54:12 GMT+0000 (UTC) 01:81:39


Need help with Shippable? File an Issue


[ master ] Build FAILED for zephyrproject-rtos/ci-test ( re-enable notifications Signed-off-by: Anas Nashif <anas.nashif@intel.com> ) on Shippable.com

Shippable.com <noreply@...>
 

SHIPPABLE BUILD REPORT

370
ci-test
Branch : master Sha : aa9e886bb0
Builder : Anas Nashif Triggered By : Anas Nashif
Custom Environment Variables:
JOB_TRIGGERED_BY_NAME="daily-verify"
JOB_TRIGGERED_BY_ID="23790"
# Runtime Status Tests Branch Coverage Sequence Coverage Triggered at Duration
370.1 none failed 1074/1085 N/A N/A Fri Jul 21 2017 00:01:21 GMT+0000 (UTC) 01:49:15
370.2 none failed 1072/1085 N/A N/A Fri Jul 21 2017 00:01:21 GMT+0000 (UTC) 01:46:38
370.3 none failed 1076/1085 N/A N/A Fri Jul 21 2017 00:01:21 GMT+0000 (UTC) 01:65:28
370.4 none failed 1071/1085 N/A N/A Fri Jul 21 2017 00:01:21 GMT+0000 (UTC) 01:70:81
370.5 none failed 1077/1085 N/A N/A Fri Jul 21 2017 00:01:21 GMT+0000 (UTC) 01:51:86
370.6 none failed 1069/1085 N/A N/A Fri Jul 21 2017 00:01:21 GMT+0000 (UTC) 01:64:65


Need help with Shippable? File an Issue


[ master ] Build FAILED for zephyrproject-rtos/ci-test ( re-enable notifications Signed-off-by: Anas Nashif <anas.nashif@intel.com> ) on Shippable.com

Shippable.com <noreply@...>
 

SHIPPABLE BUILD REPORT

369
ci-test
Branch : master Sha : aa9e886bb0
Builder : Anas Nashif Triggered By : Anas Nashif
Custom Environment Variables:
JOB_TRIGGERED_BY_NAME="daily-verify"
JOB_TRIGGERED_BY_ID="23790"
# Runtime Status Tests Branch Coverage Sequence Coverage Triggered at Duration
369.1 none failed 1074/1085 N/A N/A Thu Jul 20 2017 16:01:09 GMT+0000 (UTC) 01:46:43
369.2 none failed 1072/1085 N/A N/A Thu Jul 20 2017 16:01:09 GMT+0000 (UTC) 01:53:88
369.3 none failed 1076/1085 N/A N/A Thu Jul 20 2017 16:01:09 GMT+0000 (UTC) 01:64:24
369.4 none failed 1071/1085 N/A N/A Thu Jul 20 2017 16:01:09 GMT+0000 (UTC) 01:58:69
369.5 none failed 1077/1085 N/A N/A Thu Jul 20 2017 16:01:09 GMT+0000 (UTC) 01:56:44
369.6 none failed 1069/1085 N/A N/A Thu Jul 20 2017 16:01:09 GMT+0000 (UTC) 01:66:72


Need help with Shippable? File an Issue


[ master ] Build FAILED for zephyrproject-rtos/ci-test ( re-enable notifications Signed-off-by: Anas Nashif <anas.nashif@intel.com> ) on Shippable.com

Shippable.com <noreply@...>
 

SHIPPABLE BUILD REPORT

368
ci-test
Branch : master Sha : aa9e886bb0
Builder : Anas Nashif Triggered By : Anas Nashif
Custom Environment Variables:
JOB_TRIGGERED_BY_NAME="daily-verify"
JOB_TRIGGERED_BY_ID="23790"
# Runtime Status Tests Branch Coverage Sequence Coverage Triggered at Duration
368.1 none failed 1074/1085 N/A N/A Thu Jul 20 2017 08:00:45 GMT+0000 (UTC) 01:56:78
368.2 none failed 1072/1085 N/A N/A Thu Jul 20 2017 08:00:45 GMT+0000 (UTC) 01:54:27
368.3 none failed 1076/1085 N/A N/A Thu Jul 20 2017 08:00:49 GMT+0000 (UTC) 01:67:13
368.4 none failed 1071/1085 N/A N/A Thu Jul 20 2017 08:00:50 GMT+0000 (UTC) 01:67:96
368.5 none failed 1077/1085 N/A N/A Thu Jul 20 2017 08:00:50 GMT+0000 (UTC) 01:51:39
368.6 none failed 1069/1085 N/A N/A Thu Jul 20 2017 08:00:50 GMT+0000 (UTC) 01:64:14


Need help with Shippable? File an Issue


[ master ] Build FAILED for zephyrproject-rtos/ci-test ( re-enable notifications Signed-off-by: Anas Nashif <anas.nashif@intel.com> ) on Shippable.com

Shippable.com <noreply@...>
 

SHIPPABLE BUILD REPORT

367
ci-test
Branch : master Sha : aa9e886bb0
Builder : Anas Nashif Triggered By : Anas Nashif
Custom Environment Variables:
JOB_TRIGGERED_BY_NAME="daily-verify-debug"
JOB_TRIGGERED_BY_ID="31726"
# Runtime Status Tests Branch Coverage Sequence Coverage Triggered at Duration
367.1 none failed 1057/1058 N/A N/A Thu Jul 20 2017 04:13:57 GMT+0000 (UTC) 01:42:94
367.2 none failed 1055/1058 N/A N/A Thu Jul 20 2017 04:13:57 GMT+0000 (UTC) 01:40:16
367.3 none failed 1057/1058 N/A N/A Thu Jul 20 2017 04:13:57 GMT+0000 (UTC) 01:50:09
367.4 none succeeded 1058/1058 N/A N/A Thu Jul 20 2017 04:13:57 GMT+0000 (UTC) 01:54:20
367.5 none failed 1057/1058 N/A N/A Thu Jul 20 2017 04:13:57 GMT+0000 (UTC) 01:38:04
367.6 none failed 1057/1058 N/A N/A Thu Jul 20 2017 04:13:57 GMT+0000 (UTC) 01:49:63


Need help with Shippable? File an Issue


[ master ] Build FAILED for zephyrproject-rtos/ci-test ( re-enable notifications Signed-off-by: Anas Nashif <anas.nashif@intel.com> ) on Shippable.com

Shippable.com <noreply@...>
 

SHIPPABLE BUILD REPORT

365
ci-test
Branch : master Sha : aa9e886bb0
Builder : Anas Nashif Triggered By : Anas Nashif
Custom Environment Variables:
JOB_TRIGGERED_BY_NAME="daily-verify-arm"
JOB_TRIGGERED_BY_ID="28597"
# Runtime Status Tests Branch Coverage Sequence Coverage Triggered at Duration
365.1 none failed 761/762 N/A N/A Thu Jul 20 2017 02:53:37 GMT+0000 (UTC) 01:66:36
365.2 none failed 759/762 N/A N/A Thu Jul 20 2017 02:53:37 GMT+0000 (UTC) 01:64:68
365.3 none succeeded 762/762 N/A N/A Thu Jul 20 2017 02:53:37 GMT+0000 (UTC) 01:74:55
365.4 none failed 761/762 N/A N/A Thu Jul 20 2017 02:53:37 GMT+0000 (UTC) 01:76:77
365.5 none succeeded 762/762 N/A N/A Thu Jul 20 2017 02:53:37 GMT+0000 (UTC) 01:73:02
365.6 none succeeded 765/765 N/A N/A Thu Jul 20 2017 02:53:38 GMT+0000 (UTC) 01:77:25


Need help with Shippable? File an Issue


[ master ] Build FAILED for zephyrproject-rtos/ci-test ( re-enable notifications Signed-off-by: Anas Nashif <anas.nashif@intel.com> ) on Shippable.com

Shippable.com <noreply@...>
 

SHIPPABLE BUILD REPORT

364
ci-test
Branch : master Sha : aa9e886bb0
Builder : Anas Nashif Triggered By : Anas Nashif
Custom Environment Variables:
JOB_TRIGGERED_BY_NAME="daily-verify"
JOB_TRIGGERED_BY_ID="23790"
# Runtime Status Tests Branch Coverage Sequence Coverage Triggered at Duration
364.1 none failed 1064/1065 N/A N/A Thu Jul 20 2017 00:00:52 GMT+0000 (UTC) 01:57:20
364.2 none failed 1062/1065 N/A N/A Thu Jul 20 2017 00:00:52 GMT+0000 (UTC) 01:53:02
364.3 none failed 1064/1065 N/A N/A Thu Jul 20 2017 00:00:52 GMT+0000 (UTC) 01:40:94
364.4 none succeeded 1065/1065 N/A N/A Thu Jul 20 2017 00:00:52 GMT+0000 (UTC) 01:66:82
364.5 none succeeded 1065/1065 N/A N/A Thu Jul 20 2017 00:00:52 GMT+0000 (UTC) 01:59:40
364.6 none succeeded 1067/1067 N/A N/A Thu Jul 20 2017 00:00:56 GMT+0000 (UTC) 01:67:16


Need help with Shippable? File an Issue


[ master ] Build FAILED for zephyrproject-rtos/ci-test ( re-enable notifications Signed-off-by: Anas Nashif <anas.nashif@intel.com> ) on Shippable.com

Shippable.com <noreply@...>
 

SHIPPABLE BUILD REPORT

361
ci-test
Branch : master Sha : aa9e886bb0
Builder : Anas Nashif Triggered By : Anas Nashif
Custom Environment Variables:
JOB_TRIGGERED_BY_NAME="daily-verify-debug"
JOB_TRIGGERED_BY_ID="31726"
# Runtime Status Tests Branch Coverage Sequence Coverage Triggered at Duration
361.1 none succeeded 1057/1057 N/A N/A Wed Jul 19 2017 04:13:06 GMT+0000 (UTC) 01:44:55
361.2 none succeeded 1057/1057 N/A N/A Wed Jul 19 2017 04:13:06 GMT+0000 (UTC) 01:44:21
361.3 none succeeded 1057/1057 N/A N/A Wed Jul 19 2017 04:13:06 GMT+0000 (UTC) 01:54:36
361.4 none succeeded 1057/1057 N/A N/A Wed Jul 19 2017 04:13:06 GMT+0000 (UTC) 01:54:28
361.5 none failed 1056/1057 N/A N/A Wed Jul 19 2017 04:13:06 GMT+0000 (UTC) 01:38:70
361.6 none failed 1058/1059 N/A N/A Wed Jul 19 2017 04:13:06 GMT+0000 (UTC) 01:49:57


Need help with Shippable? File an Issue


[ master ] Build FAILED for zephyrproject-rtos/ci-test ( re-enable notifications Signed-off-by: Anas Nashif <anas.nashif@intel.com> ) on Shippable.com

Shippable.com <noreply@...>
 

SHIPPABLE BUILD REPORT

355
ci-test
Branch : master Sha : aa9e886bb0
Builder : Anas Nashif Triggered By : Anas Nashif
Custom Environment Variables:
JOB_TRIGGERED_BY_NAME="daily-verify-debug"
JOB_TRIGGERED_BY_ID="31726"
# Runtime Status Tests Branch Coverage Sequence Coverage Triggered at Duration
355.1 none succeeded 1057/1057 N/A N/A Tue Jul 18 2017 04:13:29 GMT+0000 (UTC) 01:45:78
355.2 none succeeded 1057/1057 N/A N/A Tue Jul 18 2017 04:13:29 GMT+0000 (UTC) 01:41:85
355.3 none succeeded 1057/1057 N/A N/A Tue Jul 18 2017 04:13:29 GMT+0000 (UTC) 01:52:04
355.4 none succeeded 1057/1057 N/A N/A Tue Jul 18 2017 04:13:29 GMT+0000 (UTC) 01:60:80
355.5 none failed 1056/1057 N/A N/A Tue Jul 18 2017 04:13:29 GMT+0000 (UTC) 01:39:38
355.6 none failed 1057/1058 N/A N/A Tue Jul 18 2017 04:13:30 GMT+0000 (UTC) 01:49:12


Need help with Shippable? File an Issue


[ master ] Build FAILED for zephyrproject-rtos/ci-test ( re-enable notifications Signed-off-by: Anas Nashif <anas.nashif@intel.com> ) on Shippable.com

Shippable.com <noreply@...>
 

SHIPPABLE BUILD REPORT

349
ci-test
Branch : master Sha : aa9e886bb0
Builder : Anas Nashif Triggered By : Anas Nashif
Custom Environment Variables:
JOB_TRIGGERED_BY_NAME="daily-verify-debug"
JOB_TRIGGERED_BY_ID="31726"
# Runtime Status Tests Branch Coverage Sequence Coverage Triggered at Duration
349.1 none succeeded 1057/1057 N/A N/A Mon Jul 17 2017 04:13:47 GMT+0000 (UTC) 01:43:61
349.2 none succeeded 1057/1057 N/A N/A Mon Jul 17 2017 04:13:47 GMT+0000 (UTC) 01:42:14
349.3 none succeeded 1057/1057 N/A N/A Mon Jul 17 2017 04:13:47 GMT+0000 (UTC) 01:52:41
349.4 none succeeded 1057/1057 N/A N/A Mon Jul 17 2017 04:13:47 GMT+0000 (UTC) 01:55:22
349.5 none failed 1056/1057 N/A N/A Mon Jul 17 2017 04:13:47 GMT+0000 (UTC) 01:38:83
349.6 none failed 1057/1058 N/A N/A Mon Jul 17 2017 04:13:47 GMT+0000 (UTC) 01:51:41


Need help with Shippable? File an Issue


[ master ] Build FAILED for zephyrproject-rtos/ci-test ( re-enable notifications Signed-off-by: Anas Nashif <anas.nashif@intel.com> ) on Shippable.com

Shippable.com <noreply@...>
 

SHIPPABLE BUILD REPORT

343
ci-test
Branch : master Sha : aa9e886bb0
Builder : Anas Nashif Triggered By : Anas Nashif
Custom Environment Variables:
JOB_TRIGGERED_BY_NAME="daily-verify-debug"
JOB_TRIGGERED_BY_ID="31726"
# Runtime Status Tests Branch Coverage Sequence Coverage Triggered at Duration
343.1 none succeeded 1057/1057 N/A N/A Sun Jul 16 2017 04:14:02 GMT+0000 (UTC) 01:42:48
343.2 none succeeded 1057/1057 N/A N/A Sun Jul 16 2017 04:14:02 GMT+0000 (UTC) 01:44:13
343.3 none succeeded 1057/1057 N/A N/A Sun Jul 16 2017 04:14:02 GMT+0000 (UTC) 01:52:93
343.4 none succeeded 1057/1057 N/A N/A Sun Jul 16 2017 04:14:02 GMT+0000 (UTC) 01:53:81
343.5 none failed 1056/1057 N/A N/A Sun Jul 16 2017 04:14:02 GMT+0000 (UTC) 01:38:51
343.6 none failed 1057/1058 N/A N/A Sun Jul 16 2017 04:14:02 GMT+0000 (UTC) 01:48:56


Need help with Shippable? File an Issue


[ master ] Build FAILED for zephyrproject-rtos/ci-test ( re-enable notifications Signed-off-by: Anas Nashif <anas.nashif@intel.com> ) on Shippable.com

Shippable.com <noreply@...>
 

SHIPPABLE BUILD REPORT

337
ci-test
Branch : master Sha : aa9e886bb0
Builder : Anas Nashif Triggered By : Anas Nashif
Custom Environment Variables:
JOB_TRIGGERED_BY_NAME="daily-verify-debug"
JOB_TRIGGERED_BY_ID="31726"
# Runtime Status Tests Branch Coverage Sequence Coverage Triggered at Duration
337.1 none succeeded 1057/1057 N/A N/A Sat Jul 15 2017 04:13:59 GMT+0000 (UTC) 01:45:16
337.2 none succeeded 1057/1057 N/A N/A Sat Jul 15 2017 04:13:59 GMT+0000 (UTC) 01:44:36
337.3 none succeeded 1057/1057 N/A N/A Sat Jul 15 2017 04:13:59 GMT+0000 (UTC) 01:54:55
337.4 none succeeded 1057/1057 N/A N/A Sat Jul 15 2017 04:13:59 GMT+0000 (UTC) 01:54:42
337.5 none failed 1056/1057 N/A N/A Sat Jul 15 2017 04:14:00 GMT+0000 (UTC) 01:39:56
337.6 none failed 1057/1058 N/A N/A Sat Jul 15 2017 04:14:00 GMT+0000 (UTC) 01:49:47


Need help with Shippable? File an Issue


[ master ] Build FAILED for zephyrproject-rtos/ci-test ( re-enable notifications Signed-off-by: Anas Nashif <anas.nashif@intel.com> ) on Shippable.com

Shippable.com <noreply@...>
 

SHIPPABLE BUILD REPORT

331
ci-test
Branch : master Sha : aa9e886bb0
Builder : Anas Nashif Triggered By : Anas Nashif
Custom Environment Variables:
JOB_TRIGGERED_BY_NAME="daily-verify-debug"
JOB_TRIGGERED_BY_ID="31726"
# Runtime Status Tests Branch Coverage Sequence Coverage Triggered at Duration
331.1 none succeeded 1040/1040 N/A N/A Fri Jul 14 2017 04:14:01 GMT+0000 (UTC) 01:45:27
331.2 none succeeded 1040/1040 N/A N/A Fri Jul 14 2017 04:14:01 GMT+0000 (UTC) 01:43:08
331.3 none succeeded 1040/1040 N/A N/A Fri Jul 14 2017 04:14:01 GMT+0000 (UTC) 01:52:27
331.4 none succeeded 1040/1040 N/A N/A Fri Jul 14 2017 04:14:01 GMT+0000 (UTC) 01:52:49
331.5 none failed 1039/1040 N/A N/A Fri Jul 14 2017 04:14:02 GMT+0000 (UTC) 01:40:24
331.6 none failed 1040/1041 N/A N/A Fri Jul 14 2017 04:14:02 GMT+0000 (UTC) 01:50:70


Need help with Shippable? File an Issue


[ master ] Build TIMEOUT for zephyrproject-rtos/ci-test ( re-enable notifications Signed-off-by: Anas Nashif <anas.nashif@intel.com> ) on Shippable.com

Shippable.com <noreply@...>
 

SHIPPABLE BUILD REPORT

327
ci-test
Branch : master Sha : aa9e886bb0
Builder : Anas Nashif Triggered By : Anas Nashif
Custom Environment Variables:
JOB_TRIGGERED_BY_NAME="daily-verify"
JOB_TRIGGERED_BY_ID="23790"
# Runtime Status Tests Branch Coverage Sequence Coverage Triggered at Duration
327.1 none succeeded 1047/1047 N/A N/A Thu Jul 13 2017 16:04:14 GMT+0000 (UTC) 01:60:00
327.2 none succeeded 1047/1047 N/A N/A Thu Jul 13 2017 16:04:14 GMT+0000 (UTC) 01:55:86
327.3 none succeeded 1047/1047 N/A N/A Thu Jul 13 2017 16:04:14 GMT+0000 (UTC) 01:66:76
327.4 none succeeded 1047/1047 N/A N/A Thu Jul 13 2017 16:04:14 GMT+0000 (UTC) 01:66:81
327.5 none succeeded 1047/1047 N/A N/A Thu Jul 13 2017 16:04:14 GMT+0000 (UTC) 01:44:15
327.6 none timeout 0/0 N/A N/A Thu Jul 13 2017 16:04:14 GMT+0000 (UTC) 02:22:00


Need help with Shippable? File an Issue


[ master ] Build FAILED for zephyrproject-rtos/ci-test ( re-enable notifications Signed-off-by: Anas Nashif <anas.nashif@intel.com> ) on Shippable.com

Shippable.com <noreply@...>
 

SHIPPABLE BUILD REPORT

323
ci-test
Branch : master Sha : aa9e886bb0
Builder : Anas Nashif Triggered By : Anas Nashif
Custom Environment Variables:
JOB_TRIGGERED_BY_NAME="daily-verify-debug"
JOB_TRIGGERED_BY_ID="31726"
# Runtime Status Tests Branch Coverage Sequence Coverage Triggered at Duration
323.1 none succeeded 1040/1040 N/A N/A Thu Jul 13 2017 04:13:16 GMT+0000 (UTC) 01:47:12
323.2 none succeeded 1040/1040 N/A N/A Thu Jul 13 2017 04:13:17 GMT+0000 (UTC) 01:43:63
323.3 none succeeded 1040/1040 N/A N/A Thu Jul 13 2017 04:13:17 GMT+0000 (UTC) 01:52:91
323.4 none succeeded 1040/1040 N/A N/A Thu Jul 13 2017 04:13:17 GMT+0000 (UTC) 01:55:04
323.5 none failed 1039/1040 N/A N/A Thu Jul 13 2017 04:13:17 GMT+0000 (UTC) 01:40:07
323.6 none failed 1040/1041 N/A N/A Thu Jul 13 2017 04:13:17 GMT+0000 (UTC) 01:51:54


Need help with Shippable? File an Issue


[ master ] Build TIMEOUT for zephyrproject-rtos/ci-test ( re-enable notifications Signed-off-by: Anas Nashif <anas.nashif@intel.com> ) on Shippable.com

Shippable.com <noreply@...>
 

SHIPPABLE BUILD REPORT

320
ci-test
Branch : master Sha : aa9e886bb0
Builder : Anas Nashif Triggered By : Anas Nashif
Custom Environment Variables:
JOB_TRIGGERED_BY_NAME="daily-verify"
JOB_TRIGGERED_BY_ID="23790"
# Runtime Status Tests Branch Coverage Sequence Coverage Triggered at Duration
320.1 none succeeded 1047/1047 N/A N/A Thu Jul 13 2017 00:00:46 GMT+0000 (UTC) 01:57:13
320.2 none succeeded 1047/1047 N/A N/A Thu Jul 13 2017 00:00:50 GMT+0000 (UTC) 01:56:66
320.3 none succeeded 1047/1047 N/A N/A Thu Jul 13 2017 00:00:50 GMT+0000 (UTC) 01:64:33
320.4 none succeeded 1047/1047 N/A N/A Thu Jul 13 2017 00:00:50 GMT+0000 (UTC) 01:64:66
320.5 none succeeded 1047/1047 N/A N/A Thu Jul 13 2017 00:00:50 GMT+0000 (UTC) 01:56:58
320.6 none timeout 0/0 N/A N/A Thu Jul 13 2017 00:00:51 GMT+0000 (UTC) 02:23:75


Need help with Shippable? File an Issue


[ master ] Build FAILED for zephyrproject-rtos/ci-test ( re-enable notifications Signed-off-by: Anas Nashif <anas.nashif@intel.com> ) on Shippable.com

Shippable.com <noreply@...>
 

SHIPPABLE BUILD REPORT

317
ci-test
Branch : master Sha : aa9e886bb0
Builder : Anas Nashif Triggered By : Anas Nashif
Custom Environment Variables:
JOB_TRIGGERED_BY_NAME="daily-verify-debug"
JOB_TRIGGERED_BY_ID="31726"
# Runtime Status Tests Branch Coverage Sequence Coverage Triggered at Duration
317.1 none succeeded 1040/1040 N/A N/A Wed Jul 12 2017 04:13:13 GMT+0000 (UTC) 01:44:38
317.2 none succeeded 1040/1040 N/A N/A Wed Jul 12 2017 04:13:13 GMT+0000 (UTC) 01:45:18
317.3 none succeeded 1040/1040 N/A N/A Wed Jul 12 2017 04:13:13 GMT+0000 (UTC) 01:54:22
317.4 none succeeded 1040/1040 N/A N/A Wed Jul 12 2017 04:13:13 GMT+0000 (UTC) 01:53:91
317.5 none failed 1039/1040 N/A N/A Wed Jul 12 2017 04:13:13 GMT+0000 (UTC) 01:38:96
317.6 none failed 1040/1041 N/A N/A Wed Jul 12 2017 04:13:14 GMT+0000 (UTC) 01:49:33


Need help with Shippable? File an Issue


[ master ] Build FAILED for zephyrproject-rtos/ci-test ( re-enable notifications Signed-off-by: Anas Nashif <anas.nashif@intel.com> ) on Shippable.com

Shippable.com <noreply@...>
 

SHIPPABLE BUILD REPORT

311
ci-test
Branch : master Sha : aa9e886bb0
Builder : Anas Nashif Triggered By : Anas Nashif
Custom Environment Variables:
JOB_TRIGGERED_BY_NAME="daily-verify-debug"
JOB_TRIGGERED_BY_ID="31726"
# Runtime Status Tests Branch Coverage Sequence Coverage Triggered at Duration
311.1 none succeeded 1040/1040 N/A N/A Tue Jul 11 2017 04:13:45 GMT+0000 (UTC) 01:43:83
311.2 none succeeded 1040/1040 N/A N/A Tue Jul 11 2017 04:13:45 GMT+0000 (UTC) 01:43:00
311.3 none succeeded 1040/1040 N/A N/A Tue Jul 11 2017 04:13:45 GMT+0000 (UTC) 01:52:07
311.4 none succeeded 1040/1040 N/A N/A Tue Jul 11 2017 04:13:45 GMT+0000 (UTC) 01:52:07
311.5 none failed 1039/1040 N/A N/A Tue Jul 11 2017 04:13:45 GMT+0000 (UTC) 01:38:86
311.6 none failed 1039/1040 N/A N/A Tue Jul 11 2017 04:13:45 GMT+0000 (UTC) 01:48:53


Need help with Shippable? File an Issue


[ master ] Build FAILED for zephyrproject-rtos/ci-test ( re-enable notifications Signed-off-by: Anas Nashif <anas.nashif@intel.com> ) on Shippable.com

Shippable.com <noreply@...>
 

SHIPPABLE BUILD REPORT

305
ci-test
Branch : master Sha : aa9e886bb0
Builder : Anas Nashif Triggered By : Anas Nashif
Custom Environment Variables:
JOB_TRIGGERED_BY_NAME="daily-verify-debug"
JOB_TRIGGERED_BY_ID="31726"
# Runtime Status Tests Branch Coverage Sequence Coverage Triggered at Duration
305.1 none succeeded 1040/1040 N/A N/A Mon Jul 10 2017 04:13:59 GMT+0000 (UTC) 01:45:89
305.2 none succeeded 1040/1040 N/A N/A Mon Jul 10 2017 04:13:59 GMT+0000 (UTC) 01:42:27
305.3 none succeeded 1040/1040 N/A N/A Mon Jul 10 2017 04:13:59 GMT+0000 (UTC) 01:52:00
305.4 none succeeded 1040/1040 N/A N/A Mon Jul 10 2017 04:13:59 GMT+0000 (UTC) 01:52:01
305.5 none failed 1036/1040 N/A N/A Mon Jul 10 2017 04:13:59 GMT+0000 (UTC) 01:37:46
305.6 none failed 1037/1038 N/A N/A Mon Jul 10 2017 04:13:59 GMT+0000 (UTC) 01:47:05


Need help with Shippable? File an Issue

2701 - 2720 of 2976