Date   

zephyr/master: daily build zephyr-kernel-1.6.99-170201-f5b3e2a Failure

donotreply@...
 

zephyr/master: daily build zephyr-kernel-1.6.99-170201-f5b3e2a Failure



job zephyr-sanity build number 428 failed
see: https://jenkins.zephyrproject.org/job/zephyr-sanity/428/

===================================================================
PASS - test_mpool_alloc_free_thread.
tc_start() - test_mpool_alloc_free_isr
ASSERTION FAIL [!(_kernel.nested != 0)] @ /w/workspace/zephyr-sanity/kernel/include/ksched.h:237:
---------------sanity-out/qemu_x86/tests/kernel/mem_pool/test_mpool_api/test/qemu.log---------------
qemu_x86_iamcu tests/kernel/mem_pool/test_mpool_api/test FAILED: timeout
------------sanity-out/qemu_x86_iamcu/tests/kernel/mem_pool/test_mpool_api/test/qemu.log------------
***** BOOTING ZEPHYR OS v1.6.99 - BUILD: Feb 2 2017 00:34:19 *****
Running test suite test_mpool_api
tc_start() - test_mpool_alloc_free_thread
===================================================================
PASS - test_mpool_alloc_free_thread.
tc_start() - test_mpool_alloc_free_isr
ASSERTION FAIL [!(_kernel.nested != 0)] @ /w/workspace/zephyr-sanity/kernel/include/ksched.h:237:
------------sanity-out/qemu_x86_iamcu/tests/kernel/mem_pool/test_mpool_api/test/qemu.log------------
qemu_nios2 tests/kernel/pipe/test_pipe_api/test FAILED: timeout
----------------sanity-out/qemu_nios2/tests/kernel/pipe/test_pipe_api/test/qemu.log-----------------
Running test suite test_pipe_api
tc_start() - test_pipe_thread2thread
===================================================================
PASS - test_pipe_thread2thread.
tc_start() - test_pipe_thread2isr
ASSERTION FAIL [!(_kernel.nested != 0)] @ /w/workspace/zephyr-sanity/kernel/include/ksched.h:237:
----------------sanity-out/qemu_nios2/tests/kernel/pipe/test_pipe_api/test/qemu.log-----------------
0 of 47 tests passed with 0 warnings in 195 seconds
Extra environment setting:
CONFIG_ASSERT=y
CONFIG_DEBUG=y
Build step 'Execute shell' marked build as failure


job zephyr-sanity build number 427 failed
see: https://jenkins.zephyrproject.org/job/zephyr-sanity/427/

GDT= 00100070 00000017
IDT= 00103c70 000007ff
CR0=0000003f CR2=00000000 CR3=00000000 CR4=00000000
DR0=00000000 DR1=00000000 DR2=00000000 DR3=00000000
DR6=ffff0ff0 DR7=00000400
CCS=00000000 CCD=00000030 CCO=ADDB
EFER=0000000000000000
FCW=037f FSW=0000 [ST=0] FTW=00 MXCSR=00001f80
FPR0=0000000000000000 0000 FPR1=0000000000000000 0000
FPR2=0000000000000000 0000 FPR3=0000000000000000 0000
FPR4=0000000000000000 0000 FPR5=0000000000000000 0000
FPR6=0000000000000000 0000 FPR7=0000000000000000 0000
XMM00=00000000000000000000000000000000 XMM01=00000000000000000000000000000000
XMM02=00000000000000000000000000000000 XMM03=00000000000000000000000000000000
XMM04=00000000000000000000000000000000 XMM05=00000000000000000000000000000000
XMM06=00000000000000000000000000000000 XMM07=00000000000000000000000000000000
make[3]: *** [run] Aborted (core dumped)
make[3]: Target `qemu' not remade because of errors.
make[3]: Leaving directory `/w/workspace/zephyr-sanity/sanity-out/qemu_x86/tests/kernel/context/test'
make[2]: *** [sub-make] Error 2
make[2]: Target `qemu' not remade because of errors.
make[2]: Leaving directory `/w/workspace/zephyr-sanity'
make[1]: *** [qemu] Error 2
make[1]: Leaving directory `/w/workspace/zephyr-sanity/tests/kernel/context'
-----------------------sanity-out/qemu_x86/tests/kernel/context/test/run.log------------------------
0 of 32 tests passed with 0 warnings in 62 seconds
Extra environment setting:
CONFIG_DEBUG=y
Build step 'Execute shell' marked build as failure


job zephyr-sanity build number 426 failed
see: https://jenkins.zephyrproject.org/job/zephyr-sanity/426/

--------------sanity-out/qemu_x86_iamcu/tests/kernel/pipe/test_pipe_api/test/qemu.log---------------
Running test suite test_pipe_api
tc_start() - test_pipe_thread2thread
===================================================================
PASS - test_pipe_thread2thread.
tc_start() - test_pipe_thread2isr
ASSERTION FAIL [!(_kernel.nested != 0)] @ /w/workspace/zephyr-sanity/kernel/include/ksched.h:237:
Generating LALR tables
Platform 'sam_e70_xplained' not specified in any arch .ini file and will not be tested
--------------sanity-out/qemu_x86_iamcu/tests/kernel/pipe/test_pipe_api/test/qemu.log---------------
qemu_cortex_m3 tests/kernel/timer/timer_api/test FAILED: timeout
----------------sanity-out/qemu_cortex_m3/tests/kernel/timer/timer_api/test/qemu.log----------------
Running test suite test_timer_api
tc_start() - test_timer_duration_period
ASSERTION FAIL [!_IsInIsr()] @ /w/workspace/zephyr-sanity/kernel/timer.c:134:
----------------sanity-out/qemu_cortex_m3/tests/kernel/timer/timer_api/test/qemu.log----------------
qemu_cortex_m3 tests/kernel/pipe/test_pipe_api/test FAILED: timeout
--------------sanity-out/qemu_cortex_m3/tests/kernel/pipe/test_pipe_api/test/qemu.log---------------
Running test suite test_pipe_api
tc_start() - test_pipe_thread2thread
===================================================================
PASS - test_pipe_thread2thread.
tc_start() - test_pipe_thread2isr
ASSERTION FAIL [!_IsInIsr()] @ /w/workspace/zephyr-sanity/kernel/include/ksched.h:237:
--------------sanity-out/qemu_cortex_m3/tests/kernel/pipe/test_pipe_api/test/qemu.log---------------
0 of 16 tests passed with 0 warnings in 85 seconds
Extra environment setting:
CONFIG_ASSERT=y
Build step 'Execute shell' marked build as failure


job zephyr-sanity build number 425 failed
see: https://jenkins.zephyrproject.org/job/zephyr-sanity/425/

[FAIL] Test #1: ECDH - NIST-p256
===================================================================
FAIL - main.
===================================================================
PROJECT EXECUTION FAILED
-------------------sanity-out/qemu_riscv32/tests/crypto/test_ecc_dh/test/qemu.log-------------------
0 of 1 tests passed with 0 warnings in 1270 seconds
Invalid sanity, let's retry #2
sanitycheck --inline-logs +scripts/sanity_chk/sanity_daily.args --only-failed
Generating LALR tables
Platform 'sam_e70_xplained' not specified in any arch .ini file and will not be tested
Cleaning output directory /w/workspace/zephyr-sanity/sanity-out
Selecting all possible platforms per test case
Building testcase defconfigs...
1 tests selected, 11923 tests discarded due to filters
qemu_riscv32 tests/crypto/test_ecc_dh/test FAILED: failed
-------------------sanity-out/qemu_riscv32/tests/crypto/test_ecc_dh/test/qemu.log-------------------
***** BOOTING ZEPHYR OS v1.6.99 - BUILD: Feb 2 2017 00:41:58 *****
tc_start() - TinyCrypt ECC DH tests

Vector #01 check Z - FAILURE
[FAIL] Test #1: ECDH - NIST-p256
===================================================================
FAIL - main.
===================================================================
PROJECT EXECUTION FAILED
-------------------sanity-out/qemu_riscv32/tests/crypto/test_ecc_dh/test/qemu.log-------------------
0 of 1 tests passed with 0 warnings in 4 seconds
Build step 'Execute shell' marked build as failure


zephyr/master: daily build zephyr-kernel-1.6.99-170131-b7180a4 Failure

donotreply@...
 

zephyr/master: daily build zephyr-kernel-1.6.99-170131-b7180a4 Failure



job zephyr-sanity build number 424 failed
see: https://jenkins.zephyrproject.org/job/zephyr-sanity/424/

PASS - test_mpool_alloc_free_thread.
tc_start() - test_mpool_alloc_free_isr
ASSERTION FAIL [!(_kernel.nested != 0)] @ /w/workspace/zephyr-sanity/kernel/include/ksched.h:237:
-------------sanity-out/qemu_riscv32/tests/kernel/mem_pool/test_mpool_api/test/qemu.log-------------
qemu_riscv32 tests/kernel/pipe/test_pipe_api/test FAILED: timeout
---------------sanity-out/qemu_riscv32/tests/kernel/pipe/test_pipe_api/test/qemu.log----------------
***** BOOTING ZEPHYR OS v1.6.99 *****
Running test suite test_pipe_api
tc_start() - test_pipe_thread2thread
===================================================================
PASS - test_pipe_thread2thread.
tc_start() - test_pipe_thread2isr
ASSERTION FAIL [!(_kernel.nested != 0)] @ /w/workspace/zephyr-sanity/kernel/include/ksched.h:237:
---------------sanity-out/qemu_riscv32/tests/kernel/pipe/test_pipe_api/test/qemu.log----------------
qemu_nios2 tests/kernel/mem_pool/test_mpool_api/test FAILED: timeout
--------------sanity-out/qemu_nios2/tests/kernel/mem_pool/test_mpool_api/test/qemu.log--------------
***** BOOTING ZEPHYR OS v1.6.99 - BUILD: Feb 1 2017 00:43:40 *****
Running test suite test_mpool_api
tc_start() - test_mpool_alloc_free_thread
===================================================================
PASS - test_mpool_alloc_free_thread.
tc_start() - test_mpool_alloc_free_isr
ASSERTION FAIL [!(_kernel.nested != 0)] @ /w/workspace/zephyr-sanity/kernel/include/ksched.h:237:
--------------sanity-out/qemu_nios2/tests/kernel/mem_pool/test_mpool_api/test/qemu.log--------------
0 of 47 tests passed with 0 warnings in 190 seconds
Extra environment setting:
CONFIG_ASSERT=y
CONFIG_DEBUG=y
Build step 'Execute shell' marked build as failure


job zephyr-sanity build number 423 failed
see: https://jenkins.zephyrproject.org/job/zephyr-sanity/423/

CC ext/lib/crypto/mbedtls/library/x509.o
CC ext/lib/crypto/mbedtls/library/x509_create.o
CC ext/lib/crypto/mbedtls/library/x509_crl.o
CC ext/lib/crypto/mbedtls/library/x509_crt.o
CC ext/lib/crypto/mbedtls/library/x509_csr.o
CC ext/lib/crypto/mbedtls/library/x509write_crt.o
CC ext/lib/crypto/mbedtls/library/x509write_csr.o
CC ext/lib/crypto/mbedtls/library/xtea.o
make[7]: Target `__build' not remade because of errors.
make[6]: *** [ext/lib/crypto/mbedtls] Error 2
make[6]: Target `__build' not remade because of errors.
make[5]: *** [ext/lib/crypto] Error 2
make[5]: Target `__build' not remade because of errors.
make[4]: *** [ext/lib] Error 2
make[4]: Target `__build' not remade because of errors.
make[3]: *** [ext] Error 2
make[3]: Target `all' not remade because of errors.
make[3]: Leaving directory `/w/workspace/zephyr-sanity/sanity-out/frdm_kw41z/tests/crypto/test_mbedtls/test'
make[2]: *** [sub-make] Error 2
make[2]: Target `all' not remade because of errors.
make[2]: Leaving directory `/w/workspace/zephyr-sanity'
make[1]: *** [all] Error 2
make[1]: Leaving directory `/w/workspace/zephyr-sanity/tests/crypto/test_mbedtls'
Generating LALR tables
-------------------sanity-out/frdm_kw41z/tests/crypto/test_mbedtls/test/build.log-------------------
0 of 32 tests passed with 0 warnings in 62 seconds
Extra environment setting:
CONFIG_DEBUG=y
Build step 'Execute shell' marked build as failure


job zephyr-sanity build number 422 failed
see: https://jenkins.zephyrproject.org/job/zephyr-sanity/422/

--------------sanity-out/qemu_cortex_m3/tests/kernel/pipe/test_pipe_api/test/qemu.log---------------
Running test suite test_pipe_api
tc_start() - test_pipe_thread2thread
===================================================================
PASS - test_pipe_thread2thread.
tc_start() - test_pipe_thread2isr
ASSERTION FAIL [!_IsInIsr()] @ /w/workspace/zephyr-sanity/kernel/include/ksched.h:237:
Generating LALR tables
--------------sanity-out/qemu_cortex_m3/tests/kernel/pipe/test_pipe_api/test/qemu.log---------------
qemu_cortex_m3 tests/kernel/timer/timer_api/test FAILED: timeout
----------------sanity-out/qemu_cortex_m3/tests/kernel/timer/timer_api/test/qemu.log----------------
Running test suite test_timer_api
tc_start() - test_timer_duration_period
ASSERTION FAIL [!_IsInIsr()] @ /w/workspace/zephyr-sanity/kernel/timer.c:134:
----------------sanity-out/qemu_cortex_m3/tests/kernel/timer/timer_api/test/qemu.log----------------
qemu_cortex_m3 tests/kernel/mem_pool/test_mpool_api/test FAILED: timeout
------------sanity-out/qemu_cortex_m3/tests/kernel/mem_pool/test_mpool_api/test/qemu.log------------
***** BOOTING ZEPHYR OS v1.6.99 - BUILD: Feb 1 2017 00:35:08 *****
Running test suite test_mpool_api
tc_start() - test_mpool_alloc_free_thread
===================================================================
PASS - test_mpool_alloc_free_thread.
tc_start() - test_mpool_alloc_free_isr
ASSERTION FAIL [!_IsInIsr()] @ /w/workspace/zephyr-sanity/kernel/include/ksched.h:237:
------------sanity-out/qemu_cortex_m3/tests/kernel/mem_pool/test_mpool_api/test/qemu.log------------
0 of 16 tests passed with 0 warnings in 83 seconds
Extra environment setting:
CONFIG_ASSERT=y
Build step 'Execute shell' marked build as failure


job zephyr-sanity build number 421 failed
see: https://jenkins.zephyrproject.org/job/zephyr-sanity/421/

[FAIL] Test #1: ECDH - NIST-p256
===================================================================
FAIL - main.
===================================================================
PROJECT EXECUTION FAILED
-------------------sanity-out/qemu_riscv32/tests/crypto/test_ecc_dh/test/qemu.log-------------------
qemu_riscv32 tests/kernel/context/test PASSED
1 of 2 tests passed with 0 warnings in 1284 seconds
Invalid sanity, let's retry #2
sanitycheck --inline-logs +scripts/sanity_chk/sanity_daily.args --only-failed
Generating LALR tables
Cleaning output directory /w/workspace/zephyr-sanity/sanity-out
Selecting all possible platforms per test case
Building testcase defconfigs...
1 tests selected, 11923 tests discarded due to filters
qemu_riscv32 tests/crypto/test_ecc_dh/test FAILED: failed
-------------------sanity-out/qemu_riscv32/tests/crypto/test_ecc_dh/test/qemu.log-------------------
***** BOOTING ZEPHYR OS v1.6.99 - BUILD: Feb 1 2017 00:42:09 *****
tc_start() - TinyCrypt ECC DH tests

Vector #00 check Z - FAILURE
[FAIL] Test #1: ECDH - NIST-p256
===================================================================
FAIL - main.
===================================================================
PROJECT EXECUTION FAILED
-------------------sanity-out/qemu_riscv32/tests/crypto/test_ecc_dh/test/qemu.log-------------------
0 of 1 tests passed with 0 warnings in 5 seconds
Build step 'Execute shell' marked build as failure


zephyr/master: daily build zephyr-kernel-1.6.99-170130-8436c0a Failure

donotreply@...
 

zephyr/master: daily build zephyr-kernel-1.6.99-170130-8436c0a Failure



job zephyr-sanity build number 420 failed
see: https://jenkins.zephyrproject.org/job/zephyr-sanity/420/

-----------------sanity-out/qemu_x86/tests/kernel/pipe/test_pipe_api/test/qemu.log------------------
qemu_x86_iamcu tests/kernel/mem_pool/test_mpool_api/test FAILED: timeout
------------sanity-out/qemu_x86_iamcu/tests/kernel/mem_pool/test_mpool_api/test/qemu.log------------
***** BOOTING ZEPHYR OS v1.6.99 - BUILD: Jan 31 2017 00:35:13 *****
Running test suite test_mpool_api
tc_start() - test_mpool_alloc_free_thread
===================================================================
PASS - test_mpool_alloc_free_thread.
tc_start() - test_mpool_alloc_free_isr
ASSERTION FAIL [!(_kernel.nested != 0)] @ /w/workspace/zephyr-sanity/kernel/include/ksched.h:237:
------------sanity-out/qemu_x86_iamcu/tests/kernel/mem_pool/test_mpool_api/test/qemu.log------------
qemu_x86 tests/kernel/timer/timer_api/test FAILED: timeout
-------------------sanity-out/qemu_x86/tests/kernel/timer/timer_api/test/qemu.log-------------------
Running test suite test_timer_api
tc_start() - test_timer_duration_period
ASSERTION FAIL [!(_kernel.nested != 0)] @ /w/workspace/zephyr-sanity/kernel/timer.c:134:
-------------------sanity-out/qemu_x86/tests/kernel/timer/timer_api/test/qemu.log-------------------
qemu_riscv32 tests/kernel/timer/timer_api/test FAILED: timeout
-----------------sanity-out/qemu_riscv32/tests/kernel/timer/timer_api/test/qemu.log-----------------
***** BOOTING ZEPHYR OS v1.6.99 *****
Running test suite test_timer_api
tc_start() - test_timer_duration_period
ASSERTION FAIL [!(_kernel.nested != 0)] @ /w/workspace/zephyr-sanity/kernel/timer.c:134:
-----------------sanity-out/qemu_riscv32/tests/kernel/timer/timer_api/test/qemu.log-----------------
0 of 47 tests passed with 0 warnings in 192 seconds
Extra environment setting:
CONFIG_ASSERT=y
CONFIG_DEBUG=y
Build step 'Execute shell' marked build as failure


job zephyr-sanity build number 419 failed
see: https://jenkins.zephyrproject.org/job/zephyr-sanity/419/

GDT= 00100070 00000017
IDT= 00102df0 000007ff
CR0=0000003f CR2=00000000 CR3=00000000 CR4=00000000
DR0=00000000 DR1=00000000 DR2=00000000 DR3=00000000
DR6=ffff0ff0 DR7=00000400
CCS=0000000a CCD=0000003c CCO=CLR
EFER=0000000000000000
FCW=037f FSW=0000 [ST=0] FTW=00 MXCSR=00001f80
FPR0=0000000000000000 0000 FPR1=0000000000000000 0000
FPR2=0000000000000000 0000 FPR3=0000000000000000 0000
FPR4=0000000000000000 0000 FPR5=0000000000000000 0000
FPR6=0000000000000000 0000 FPR7=0000000000000000 0000
XMM00=00000000000000000000000000000000 XMM01=00000000000000000000000000000000
XMM02=00000000000000000000000000000000 XMM03=00000000000000000000000000000000
XMM04=00000000000000000000000000000000 XMM05=00000000000000000000000000000000
XMM06=00000000000000000000000000000000 XMM07=00000000000000000000000000000000
make[3]: *** [run] Aborted (core dumped)
make[3]: Target `qemu' not remade because of errors.
make[3]: Leaving directory `/w/workspace/zephyr-sanity/sanity-out/qemu_x86/tests/legacy/kernel/test_sleep/test'
make[2]: *** [sub-make] Error 2
make[2]: Target `qemu' not remade because of errors.
make[2]: Leaving directory `/w/workspace/zephyr-sanity'
make[1]: *** [qemu] Error 2
make[1]: Leaving directory `/w/workspace/zephyr-sanity/tests/legacy/kernel/test_sleep'
------------------sanity-out/qemu_x86/tests/legacy/kernel/test_sleep/test/run.log-------------------
1 of 33 tests passed with 0 warnings in 65 seconds
Extra environment setting:
CONFIG_DEBUG=y
Build step 'Execute shell' marked build as failure


job zephyr-sanity build number 418 failed
see: https://jenkins.zephyrproject.org/job/zephyr-sanity/418/

qemu_cortex_m3 tests/kernel/pipe/test_pipe_api/test FAILED: timeout
--------------sanity-out/qemu_cortex_m3/tests/kernel/pipe/test_pipe_api/test/qemu.log---------------
Running test suite test_pipe_api
tc_start() - test_pipe_thread2thread
===================================================================
PASS - test_pipe_thread2thread.
tc_start() - test_pipe_thread2isr
ASSERTION FAIL [!_IsInIsr()] @ /w/workspace/zephyr-sanity/kernel/include/ksched.h:237:
Generating LALR tables
--------------sanity-out/qemu_cortex_m3/tests/kernel/pipe/test_pipe_api/test/qemu.log---------------
qemu_x86 tests/kernel/pipe/test_pipe_api/test FAILED: timeout
-----------------sanity-out/qemu_x86/tests/kernel/pipe/test_pipe_api/test/qemu.log------------------
Running test suite test_pipe_api
tc_start() - test_pipe_thread2thread
===================================================================
PASS - test_pipe_thread2thread.
tc_start() - test_pipe_thread2isr
ASSERTION FAIL [!(_kernel.nested != 0)] @ /w/workspace/zephyr-sanity/kernel/include/ksched.h:237:
-----------------sanity-out/qemu_x86/tests/kernel/pipe/test_pipe_api/test/qemu.log------------------
qemu_cortex_m3 tests/kernel/timer/timer_api/test FAILED: timeout
----------------sanity-out/qemu_cortex_m3/tests/kernel/timer/timer_api/test/qemu.log----------------
Running test suite test_timer_api
tc_start() - test_timer_duration_period
ASSERTION FAIL [!_IsInIsr()] @ /w/workspace/zephyr-sanity/kernel/timer.c:134:
----------------sanity-out/qemu_cortex_m3/tests/kernel/timer/timer_api/test/qemu.log----------------
0 of 16 tests passed with 0 warnings in 86 seconds
Extra environment setting:
CONFIG_ASSERT=y
Build step 'Execute shell' marked build as failure


job zephyr-sanity build number 417 failed
see: https://jenkins.zephyrproject.org/job/zephyr-sanity/417/

Vector #00 check Z - FAILURE
[FAIL] Test #1: ECDH - NIST-p256
===================================================================
FAIL - main.
===================================================================
PROJECT EXECUTION FAILED
-------------------sanity-out/qemu_riscv32/tests/crypto/test_ecc_dh/test/qemu.log-------------------
0 of 1 tests passed with 0 warnings in 1639 seconds
Invalid sanity, let's retry #2
sanitycheck --inline-logs +scripts/sanity_chk/sanity_daily.args --only-failed
Generating LALR tables
Cleaning output directory /w/workspace/zephyr-sanity/sanity-out
Selecting all possible platforms per test case
Building testcase defconfigs...
1 tests selected, 11883 tests discarded due to filters
qemu_riscv32 tests/crypto/test_ecc_dh/test FAILED: failed
-------------------sanity-out/qemu_riscv32/tests/crypto/test_ecc_dh/test/qemu.log-------------------
***** BOOTING ZEPHYR OS v1.6.99 - BUILD: Jan 31 2017 00:48:37 *****
tc_start() - TinyCrypt ECC DH tests

Vector #00 check Z - FAILURE
[FAIL] Test #1: ECDH - NIST-p256
===================================================================
FAIL - main.
===================================================================
PROJECT EXECUTION FAILED
-------------------sanity-out/qemu_riscv32/tests/crypto/test_ecc_dh/test/qemu.log-------------------
0 of 1 tests passed with 0 warnings in 4 seconds
Build step 'Execute shell' marked build as failure


zephyr/master: daily build zephyr-kernel-1.6.99-170129-f086a19 Failure

donotreply@...
 

zephyr/master: daily build zephyr-kernel-1.6.99-170129-f086a19 Failure



job zephyr-sanity build number 416 failed
see: https://jenkins.zephyrproject.org/job/zephyr-sanity/416/

***** BOOTING ZEPHYR OS v1.6.99 - BUILD: Jan 30 2017 00:15:07 *****
Running test suite test_mpool_api
tc_start() - test_mpool_alloc_free_thread
===================================================================
PASS - test_mpool_alloc_free_thread.
tc_start() - test_mpool_alloc_free_isr
ASSERTION FAIL [!(_kernel.nested != 0)] @ /w/workspace/zephyr-sanity/kernel/include/ksched.h:237:
---------------sanity-out/qemu_x86/tests/kernel/mem_pool/test_mpool_api/test/qemu.log---------------
qemu_nios2 tests/kernel/timer/timer_api/test FAILED: timeout
------------------sanity-out/qemu_nios2/tests/kernel/timer/timer_api/test/qemu.log------------------
Running test suite test_timer_api
tc_start() - test_timer_duration_period
ASSERTION FAIL [!(_kernel.nested != 0)] @ /w/workspace/zephyr-sanity/kernel/timer.c:134:
------------------sanity-out/qemu_nios2/tests/kernel/timer/timer_api/test/qemu.log------------------
qemu_x86_iamcu tests/kernel/mem_pool/test_mpool_api/test FAILED: timeout
------------sanity-out/qemu_x86_iamcu/tests/kernel/mem_pool/test_mpool_api/test/qemu.log------------
***** BOOTING ZEPHYR OS v1.6.99 - BUILD: Jan 30 2017 00:15:31 *****
Running test suite test_mpool_api
tc_start() - test_mpool_alloc_free_thread
===================================================================
PASS - test_mpool_alloc_free_thread.
tc_start() - test_mpool_alloc_free_isr
ASSERTION FAIL [!(_kernel.nested != 0)] @ /w/workspace/zephyr-sanity/kernel/include/ksched.h:237:
------------sanity-out/qemu_x86_iamcu/tests/kernel/mem_pool/test_mpool_api/test/qemu.log------------
0 of 43 tests passed with 0 warnings in 178 seconds
Extra environment setting:
CONFIG_ASSERT=y
CONFIG_DEBUG=y
Build step 'Execute shell' marked build as failure


job zephyr-sanity build number 415 failed
see: https://jenkins.zephyrproject.org/job/zephyr-sanity/415/

AS arch/arm/core/cortex_m/reset.o
AS arch/arm/core/cortex_m/nmi_on_reset.o
CC arch/arm/core/cortex_m/prep_c.o
CC arch/arm/core/cortex_m/scs.o
CC arch/arm/core/cortex_m/scb.o
CC arch/arm/core/cortex_m/nmi.o
CC arch/arm/core/cortex_m/exc_manage.o
CC arch/arm/core/cortex_m/irq_vector_table.o
AS arch/arm/core/cortex_m/sw_isr_table.o
LD arch/arm/core/cortex_m/built-in.o
LD arch/arm/core/built-in.o
AR kernel/lib.a
LD arch/arm/built-in.o
LD arch/built-in.o
make[3]: Target `all' not remade because of errors.
make[3]: Leaving directory `/w/workspace/zephyr-sanity/sanity-out/mps2_an385/tests/crypto/test_mbedtls/test'
make[2]: *** [sub-make] Error 2
make[2]: Target `all' not remade because of errors.
make[2]: Leaving directory `/w/workspace/zephyr-sanity'
make[1]: *** [all] Error 2
make[1]: Leaving directory `/w/workspace/zephyr-sanity/tests/crypto/test_mbedtls'
Generating LALR tables
Platform 'zedboard_pulpino' not specified in any arch .ini file and will not be tested
Platform 'qemu_riscv32' not specified in any arch .ini file and will not be tested
-------------------sanity-out/mps2_an385/tests/crypto/test_mbedtls/test/build.log-------------------
0 of 31 tests passed with 0 warnings in 50 seconds
Extra environment setting:
CONFIG_DEBUG=y
Build step 'Execute shell' marked build as failure


job zephyr-sanity build number 414 failed
see: https://jenkins.zephyrproject.org/job/zephyr-sanity/414/

-------------------sanity-out/qemu_x86/tests/kernel/timer/timer_api/test/qemu.log-------------------
qemu_x86_iamcu tests/kernel/pipe/test_pipe_api/test FAILED: timeout
--------------sanity-out/qemu_x86_iamcu/tests/kernel/pipe/test_pipe_api/test/qemu.log---------------
Running test suite test_pipe_api
tc_start() - test_pipe_thread2thread
===================================================================
PASS - test_pipe_thread2thread.
tc_start() - test_pipe_thread2isr
ASSERTION FAIL [!(_kernel.nested != 0)] @ /w/workspace/zephyr-sanity/kernel/include/ksched.h:237:
--------------sanity-out/qemu_x86_iamcu/tests/kernel/pipe/test_pipe_api/test/qemu.log---------------
qemu_cortex_m3 tests/kernel/timer/timer_api/test FAILED: timeout
----------------sanity-out/qemu_cortex_m3/tests/kernel/timer/timer_api/test/qemu.log----------------
Running test suite test_timer_api
tc_start() - test_timer_duration_period
ASSERTION FAIL [!_IsInIsr()] @ /w/workspace/zephyr-sanity/kernel/timer.c:134:
----------------sanity-out/qemu_cortex_m3/tests/kernel/timer/timer_api/test/qemu.log----------------
qemu_cortex_m3 tests/kernel/pipe/test_pipe_api/test FAILED: timeout
--------------sanity-out/qemu_cortex_m3/tests/kernel/pipe/test_pipe_api/test/qemu.log---------------
Running test suite test_pipe_api
tc_start() - test_pipe_thread2thread
===================================================================
PASS - test_pipe_thread2thread.
tc_start() - test_pipe_thread2isr
ASSERTION FAIL [!_IsInIsr()] @ /w/workspace/zephyr-sanity/kernel/include/ksched.h:237:
--------------sanity-out/qemu_cortex_m3/tests/kernel/pipe/test_pipe_api/test/qemu.log---------------
0 of 12 tests passed with 0 warnings in 79 seconds
Extra environment setting:
CONFIG_ASSERT=y
Build step 'Execute shell' marked build as failure


zephyr/master: daily build zephyr-kernel-1.6.99-170128-a45dd12 Failure

donotreply@...
 

zephyr/master: daily build zephyr-kernel-1.6.99-170128-a45dd12 Failure



job zephyr-sanity build number 412 failed
see: https://jenkins.zephyrproject.org/job/zephyr-sanity/412/

------------sanity-out/qemu_cortex_m3/tests/kernel/mem_pool/test_mpool_api/test/qemu.log------------
***** BOOTING ZEPHYR OS v1.6.99 - BUILD: Jan 29 2017 00:19:17 *****
Running test suite test_mpool_api
tc_start() - test_mpool_alloc_free_thread
===================================================================
PASS - test_mpool_alloc_free_thread.
tc_start() - test_mpool_alloc_free_isr
ASSERTION FAIL [!_IsInIsr()] @ /w/workspace/zephyr-sanity/kernel/include/ksched.h:237:
------------sanity-out/qemu_cortex_m3/tests/kernel/mem_pool/test_mpool_api/test/qemu.log------------
qemu_nios2 tests/kernel/pipe/test_pipe_api/test FAILED: timeout
----------------sanity-out/qemu_nios2/tests/kernel/pipe/test_pipe_api/test/qemu.log-----------------
Running test suite test_pipe_api
tc_start() - test_pipe_thread2thread
===================================================================
PASS - test_pipe_thread2thread.
tc_start() - test_pipe_thread2isr
ASSERTION FAIL [!(_kernel.nested != 0)] @ /w/workspace/zephyr-sanity/kernel/include/ksched.h:237:
----------------sanity-out/qemu_nios2/tests/kernel/pipe/test_pipe_api/test/qemu.log-----------------
qemu_cortex_m3 tests/kernel/timer/timer_api/test FAILED: timeout
----------------sanity-out/qemu_cortex_m3/tests/kernel/timer/timer_api/test/qemu.log----------------
Running test suite test_timer_api
tc_start() - test_timer_duration_period
ASSERTION FAIL [!_IsInIsr()] @ /w/workspace/zephyr-sanity/kernel/timer.c:134:
----------------sanity-out/qemu_cortex_m3/tests/kernel/timer/timer_api/test/qemu.log----------------
0 of 43 tests passed with 0 warnings in 171 seconds
Extra environment setting:
CONFIG_ASSERT=y
CONFIG_DEBUG=y
Build step 'Execute shell' marked build as failure


job zephyr-sanity build number 411 failed
see: https://jenkins.zephyrproject.org/job/zephyr-sanity/411/

GDT= 00100070 00000017
IDT= 00104ab0 000007ff
CR0=0000003f CR2=00000000 CR3=00000000 CR4=00000000
DR0=00000000 DR1=00000000 DR2=00000000 DR3=00000000
DR6=ffff0ff0 DR7=00000400
CCS=00000000 CCD=00000030 CCO=ADDB
EFER=0000000000000000
FCW=037f FSW=0000 [ST=0] FTW=00 MXCSR=00001f80
FPR0=0000000000000000 0000 FPR1=0000000000000000 0000
FPR2=0000000000000000 0000 FPR3=0000000000000000 0000
FPR4=0000000000000000 0000 FPR5=0000000000000000 0000
FPR6=0000000000000000 0000 FPR7=0000000000000000 0000
XMM00=00000000000000000000000000000000 XMM01=00000000000000000000000000000000
XMM02=00000000000000000000000000000000 XMM03=00000000000000000000000000000000
XMM04=00000000000000000000000000000000 XMM05=00000000000000000000000000000000
XMM06=00000000000000000000000000000000 XMM07=00000000000000000000000000000000
make[3]: *** [run] Aborted (core dumped)
make[3]: Target `qemu' not remade because of errors.
make[3]: Leaving directory `/w/workspace/zephyr-sanity/sanity-out/qemu_x86/tests/legacy/kernel/test_sema/nanokernel/test'
make[2]: *** [sub-make] Error 2
make[2]: Target `qemu' not remade because of errors.
make[2]: Leaving directory `/w/workspace/zephyr-sanity'
make[1]: *** [qemu] Error 2
make[1]: Leaving directory `/w/workspace/zephyr-sanity/tests/legacy/kernel/test_sema/nanokernel'
-------------sanity-out/qemu_x86/tests/legacy/kernel/test_sema/nanokernel/test/run.log--------------
0 of 31 tests passed with 0 warnings in 55 seconds
Extra environment setting:
CONFIG_DEBUG=y
Build step 'Execute shell' marked build as failure


job zephyr-sanity build number 410 failed
see: https://jenkins.zephyrproject.org/job/zephyr-sanity/410/

qemu_cortex_m3 tests/kernel/mem_pool/test_mpool_api/test FAILED: timeout
------------sanity-out/qemu_cortex_m3/tests/kernel/mem_pool/test_mpool_api/test/qemu.log------------
***** BOOTING ZEPHYR OS v1.6.99 - BUILD: Jan 29 2017 00:20:13 *****
Running test suite test_mpool_api
tc_start() - test_mpool_alloc_free_thread
===================================================================
PASS - test_mpool_alloc_free_thread.
tc_start() - test_mpool_alloc_free_isr
ASSERTION FAIL [!_IsInIsr()] @ /w/workspace/zephyr-sanity/kernel/include/ksched.h:237:
------------sanity-out/qemu_cortex_m3/tests/kernel/mem_pool/test_mpool_api/test/qemu.log------------
qemu_cortex_m3 tests/kernel/pipe/test_pipe_api/test FAILED: timeout
--------------sanity-out/qemu_cortex_m3/tests/kernel/pipe/test_pipe_api/test/qemu.log---------------
Running test suite test_pipe_api
tc_start() - test_pipe_thread2thread
===================================================================
PASS - test_pipe_thread2thread.
tc_start() - test_pipe_thread2isr
ASSERTION FAIL [!_IsInIsr()] @ /w/workspace/zephyr-sanity/kernel/include/ksched.h:237:
--------------sanity-out/qemu_cortex_m3/tests/kernel/pipe/test_pipe_api/test/qemu.log---------------
qemu_x86 tests/kernel/timer/timer_api/test FAILED: timeout
-------------------sanity-out/qemu_x86/tests/kernel/timer/timer_api/test/qemu.log-------------------
Running test suite test_timer_api
tc_start() - test_timer_duration_period
ASSERTION FAIL [!(_kernel.nested != 0)] @ /w/workspace/zephyr-sanity/kernel/timer.c:134:
-------------------sanity-out/qemu_x86/tests/kernel/timer/timer_api/test/qemu.log-------------------
0 of 12 tests passed with 0 warnings in 80 seconds
Extra environment setting:
CONFIG_ASSERT=y
Build step 'Execute shell' marked build as failure


zephyr/master: daily build zephyr-kernel-1.6.99-170127-a45dd12 Failure

donotreply@...
 

zephyr/master: daily build zephyr-kernel-1.6.99-170127-a45dd12 Failure



job zephyr-sanity build number 408 failed
see: https://jenkins.zephyrproject.org/job/zephyr-sanity/408/

***** BOOTING ZEPHYR OS v1.6.99 - BUILD: Jan 28 2017 00:31:32 *****
Running test suite test_mpool_api
tc_start() - test_mpool_alloc_free_thread
===================================================================
PASS - test_mpool_alloc_free_thread.
tc_start() - test_mpool_alloc_free_isr
ASSERTION FAIL [!(_kernel.nested != 0)] @ /w/workspace/zephyr-sanity/kernel/include/ksched.h:237:
---------------sanity-out/qemu_x86/tests/kernel/mem_pool/test_mpool_api/test/qemu.log---------------
qemu_nios2 tests/kernel/mem_pool/test_mpool_api/test FAILED: timeout
--------------sanity-out/qemu_nios2/tests/kernel/mem_pool/test_mpool_api/test/qemu.log--------------
***** BOOTING ZEPHYR OS v1.6.99 - BUILD: Jan 28 2017 00:31:38 *****
Running test suite test_mpool_api
tc_start() - test_mpool_alloc_free_thread
===================================================================
PASS - test_mpool_alloc_free_thread.
tc_start() - test_mpool_alloc_free_isr
ASSERTION FAIL [!(_kernel.nested != 0)] @ /w/workspace/zephyr-sanity/kernel/include/ksched.h:237:
--------------sanity-out/qemu_nios2/tests/kernel/mem_pool/test_mpool_api/test/qemu.log--------------
qemu_x86_iamcu tests/kernel/timer/timer_api/test FAILED: timeout
----------------sanity-out/qemu_x86_iamcu/tests/kernel/timer/timer_api/test/qemu.log----------------
Running test suite test_timer_api
tc_start() - test_timer_duration_period
ASSERTION FAIL [!(_kernel.nested != 0)] @ /w/workspace/zephyr-sanity/kernel/timer.c:134:
----------------sanity-out/qemu_x86_iamcu/tests/kernel/timer/timer_api/test/qemu.log----------------
0 of 43 tests passed with 0 warnings in 171 seconds
Extra environment setting:
CONFIG_ASSERT=y
CONFIG_DEBUG=y
Build step 'Execute shell' marked build as failure


job zephyr-sanity build number 407 failed
see: https://jenkins.zephyrproject.org/job/zephyr-sanity/407/

CC ext/lib/crypto/mbedtls/library/x509_crl.o
CC ext/lib/crypto/mbedtls/library/x509_crt.o
CC ext/lib/crypto/mbedtls/library/x509_csr.o
CC ext/lib/crypto/mbedtls/library/x509write_crt.o
CC ext/lib/crypto/mbedtls/library/x509write_csr.o
CC ext/lib/crypto/mbedtls/library/xtea.o
make[7]: Target `__build' not remade because of errors.
make[6]: *** [ext/lib/crypto/mbedtls] Error 2
make[6]: Target `__build' not remade because of errors.
make[5]: *** [ext/lib/crypto] Error 2
make[5]: Target `__build' not remade because of errors.
make[4]: *** [ext/lib] Error 2
make[4]: Target `__build' not remade because of errors.
make[3]: *** [ext] Error 2
make[3]: Target `all' not remade because of errors.
make[3]: Leaving directory `/w/workspace/zephyr-sanity/sanity-out/qemu_x86/tests/crypto/test_mbedtls/test'
make[2]: *** [sub-make] Error 2
make[2]: Target `all' not remade because of errors.
make[2]: Leaving directory `/w/workspace/zephyr-sanity'
make[1]: *** [all] Error 2
make[1]: Leaving directory `/w/workspace/zephyr-sanity/tests/crypto/test_mbedtls'
Generating LALR tables
Platform 'zedboard_pulpino' not specified in any arch .ini file and will not be tested
Platform 'qemu_riscv32' not specified in any arch .ini file and will not be tested
--------------------sanity-out/qemu_x86/tests/crypto/test_mbedtls/test/build.log--------------------
0 of 31 tests passed with 0 warnings in 59 seconds
Extra environment setting:
CONFIG_DEBUG=y
Build step 'Execute shell' marked build as failure


job zephyr-sanity build number 406 failed
see: https://jenkins.zephyrproject.org/job/zephyr-sanity/406/

qemu_cortex_m3 tests/kernel/timer/timer_api/test FAILED: timeout
----------------sanity-out/qemu_cortex_m3/tests/kernel/timer/timer_api/test/qemu.log----------------
Running test suite test_timer_api
tc_start() - test_timer_duration_period
ASSERTION FAIL [!_IsInIsr()] @ /w/workspace/zephyr-sanity/kernel/timer.c:134:
----------------sanity-out/qemu_cortex_m3/tests/kernel/timer/timer_api/test/qemu.log----------------
qemu_nios2 tests/kernel/pipe/test_pipe_api/test FAILED: timeout
----------------sanity-out/qemu_nios2/tests/kernel/pipe/test_pipe_api/test/qemu.log-----------------
Running test suite test_pipe_api
tc_start() - test_pipe_thread2thread
===================================================================
PASS - test_pipe_thread2thread.
tc_start() - test_pipe_thread2isr
ASSERTION FAIL [!(_kernel.nested != 0)] @ /w/workspace/zephyr-sanity/kernel/include/ksched.h:237:
----------------sanity-out/qemu_nios2/tests/kernel/pipe/test_pipe_api/test/qemu.log-----------------
qemu_cortex_m3 tests/kernel/mem_pool/test_mpool_api/test FAILED: timeout
------------sanity-out/qemu_cortex_m3/tests/kernel/mem_pool/test_mpool_api/test/qemu.log------------
***** BOOTING ZEPHYR OS v1.6.99 - BUILD: Jan 28 2017 00:40:03 *****
Running test suite test_mpool_api
tc_start() - test_mpool_alloc_free_thread
===================================================================
PASS - test_mpool_alloc_free_thread.
tc_start() - test_mpool_alloc_free_isr
ASSERTION FAIL [!_IsInIsr()] @ /w/workspace/zephyr-sanity/kernel/include/ksched.h:237:
------------sanity-out/qemu_cortex_m3/tests/kernel/mem_pool/test_mpool_api/test/qemu.log------------
0 of 12 tests passed with 0 warnings in 78 seconds
Extra environment setting:
CONFIG_ASSERT=y
Build step 'Execute shell' marked build as failure

2901 - 2906 of 2906