Date   
[ master ] Build TIMEOUT for zephyrproject-rtos/ci-test ( ci: Update sdk to 0.11.3 Update sdk to 0.11.3 release and update docker image to get that SDK version. Signed-off-by: Kumar Gala <kumar.gala@linaro.org> ) on Shippable.com #builds By Shippable.com <noreply@...> · #2449 ·
[ master ] Build UNSTABLE for zephyrproject-rtos/test_results ( tests: reel board test results Testing CI system, run tests on hardware reel board v1 Signed-off-by: Maksim Masalski <maksim.masalski@intel.com> ) on Shippable.com #builds By Shippable.com <noreply@...> · #2448 ·
[ master ] Build TIMEOUT for zephyrproject-rtos/ci-test ( ci: Update sdk to 0.11.3 Update sdk to 0.11.3 release and update docker image to get that SDK version. Signed-off-by: Kumar Gala <kumar.gala@linaro.org> ) on Shippable.com #builds By Shippable.com <noreply@...> · #2447 ·
[ master ] Build FAILED for zephyrproject-rtos/test_results ( tests: reel board test results Testing CI system, run tests on hardware reel board v1 Signed-off-by: Maksim Masalski <maksim.masalski@intel.com> ) on Shippable.com #builds By Shippable.com <noreply@...> · #2446 ·
[ master ] Build TIMEOUT for zephyrproject-rtos/ci-test ( ci: Update sdk to 0.11.3 Update sdk to 0.11.3 release and update docker image to get that SDK version. Signed-off-by: Kumar Gala <kumar.gala@linaro.org> ) on Shippable.com #builds By Shippable.com <noreply@...> · #2445 ·
[ master ] Build UNSTABLE for zephyrproject-rtos/test_results ( tests: reel board test results Testing CI system, run tests on hardware reel board v1 Signed-off-by: Maksim Masalski <maksim.masalski@intel.com> ) on Shippable.com #builds By Shippable.com <noreply@...> · #2444 ·
[ master ] Build TIMEOUT for zephyrproject-rtos/ci-test ( ci: Update sdk to 0.11.3 Update sdk to 0.11.3 release and update docker image to get that SDK version. Signed-off-by: Kumar Gala <kumar.gala@linaro.org> ) on Shippable.com #builds By Shippable.com <noreply@...> · #2443 ·
[ master ] Build FAILED for zephyrproject-rtos/test_results ( results: add more results for v2.3.0-rc1 ) on Shippable.com #builds By Shippable.com <noreply@...> · #2442 ·
[ master ] Build TIMEOUT for zephyrproject-rtos/ci-test ( bump matrix to 35 See if 35 builders will get this to not timeout. Signed-off-by: Kumar Gala <kumar.gala@linaro.org> ) on Shippable.com #builds By Shippable.com <noreply@...> · #2441 ·
[ master ] Build FAILED for zephyrproject-rtos/test_results ( results: add more results for v2.3.0-rc1 ) on Shippable.com #builds By Shippable.com <noreply@...> · #2440 ·
[ master ] Build TIMEOUT for zephyrproject-rtos/ci-test ( bump matrix to 35 See if 35 builders will get this to not timeout. Signed-off-by: Kumar Gala <kumar.gala@linaro.org> ) on Shippable.com #builds By Shippable.com <noreply@...> · #2439 ·
[ master ] Build UNSTABLE for zephyrproject-rtos/test_results ( results: add more results for v2.3.0-rc1 ) on Shippable.com #builds By Shippable.com <noreply@...> · #2438 ·
[ master ] Build TIMEOUT for zephyrproject-rtos/ci-test ( bump matrix to 35 See if 35 builders will get this to not timeout. Signed-off-by: Kumar Gala <kumar.gala@linaro.org> ) on Shippable.com #builds By Shippable.com <noreply@...> · #2437 ·
[ master ] Build FAILED for zephyrproject-rtos/test_results ( results: add more results for v2.3.0-rc1 ) on Shippable.com #builds By Shippable.com <noreply@...> · #2436 ·
[ master ] Build TIMEOUT for zephyrproject-rtos/ci-test ( bump matrix to 35 See if 35 builders will get this to not timeout. Signed-off-by: Kumar Gala <kumar.gala@linaro.org> ) on Shippable.com #builds By Shippable.com <noreply@...> · #2435 ·
[ master ] Build FAILED for zephyrproject-rtos/test_results ( results: add more results for v2.3.0-rc1 ) on Shippable.com #builds By Shippable.com <noreply@...> · #2434 ·
[ master ] Build TIMEOUT for zephyrproject-rtos/ci-test ( bump matrix to 35 See if 35 builders will get this to not timeout. Signed-off-by: Kumar Gala <kumar.gala@linaro.org> ) on Shippable.com #builds By Shippable.com <noreply@...> · #2433 ·
[ master ] Build TIMEOUT for zephyrproject-rtos/ci-test ( bump matrix to 35 See if 35 builders will get this to not timeout. Signed-off-by: Kumar Gala <kumar.gala@linaro.org> ) on Shippable.com #builds By Shippable.com <noreply@...> · #2432 ·
[ master ] Build SUCCEEDED for zephyrproject-rtos/test_results ( results: add more results for v2.3.0-rc1 ) on Shippable.com #builds By Shippable.com <noreply@...> · #2431 ·
[ master ] Build TIMEOUT for zephyrproject-rtos/ci-test ( bump matrix to 35 See if 35 builders will get this to not timeout. Signed-off-by: Kumar Gala <kumar.gala@linaro.org> ) on Shippable.com #builds By Shippable.com <noreply@...> · #2430 ·