Date   
[ master ] Build FAILED for zephyrproject-rtos/test_results ( tests: reel board test results Testing CI system, run tests on hardware reel board v1 Signed-off-by: Maksim Masalski <maksim.masalski@intel.com> ) on Shippable.com #builds By Shippable.com <noreply@...> · #2462 ·
[ master ] Build TIMEOUT for zephyrproject-rtos/ci-test ( ci: Update sdk to 0.11.3 Update sdk to 0.11.3 release and update docker image to get that SDK version. Signed-off-by: Kumar Gala <kumar.gala@linaro.org> ) on Shippable.com #builds By Shippable.com <noreply@...> · #2461 ·
[ master ] Build UNSTABLE for zephyrproject-rtos/test_results ( tests: reel board test results Testing CI system, run tests on hardware reel board v1 Signed-off-by: Maksim Masalski <maksim.masalski@intel.com> ) on Shippable.com #builds By Shippable.com <noreply@...> · #2460 ·
[ master ] Build TIMEOUT for zephyrproject-rtos/ci-test ( ci: Update sdk to 0.11.3 Update sdk to 0.11.3 release and update docker image to get that SDK version. Signed-off-by: Kumar Gala <kumar.gala@linaro.org> ) on Shippable.com #builds By Shippable.com <noreply@...> · #2459 ·
[ master ] Build FAILED for zephyrproject-rtos/test_results ( tests: reel board test results Testing CI system, run tests on hardware reel board v1 Signed-off-by: Maksim Masalski <maksim.masalski@intel.com> ) on Shippable.com #builds By Shippable.com <noreply@...> · #2458 ·
[ master ] Build TIMEOUT for zephyrproject-rtos/ci-test ( ci: Update sdk to 0.11.3 Update sdk to 0.11.3 release and update docker image to get that SDK version. Signed-off-by: Kumar Gala <kumar.gala@linaro.org> ) on Shippable.com #builds By Shippable.com <noreply@...> · #2457 ·
[ master ] Build FAILED for zephyrproject-rtos/test_results ( tests: reel board test results Testing CI system, run tests on hardware reel board v1 Signed-off-by: Maksim Masalski <maksim.masalski@intel.com> ) on Shippable.com #builds By Shippable.com <noreply@...> · #2456 ·
[ master ] Build TIMEOUT for zephyrproject-rtos/ci-test ( ci: Update sdk to 0.11.3 Update sdk to 0.11.3 release and update docker image to get that SDK version. Signed-off-by: Kumar Gala <kumar.gala@linaro.org> ) on Shippable.com #builds By Shippable.com <noreply@...> · #2455 ·
[ master ] Build UNSTABLE for zephyrproject-rtos/test_results ( tests: reel board test results Testing CI system, run tests on hardware reel board v1 Signed-off-by: Maksim Masalski <maksim.masalski@intel.com> ) on Shippable.com #builds By Shippable.com <noreply@...> · #2454 ·
[ master ] Build TIMEOUT for zephyrproject-rtos/ci-test ( ci: Update sdk to 0.11.3 Update sdk to 0.11.3 release and update docker image to get that SDK version. Signed-off-by: Kumar Gala <kumar.gala@linaro.org> ) on Shippable.com #builds By Shippable.com <noreply@...> · #2453 ·
[ master ] Build UNSTABLE for zephyrproject-rtos/test_results ( tests: reel board test results Testing CI system, run tests on hardware reel board v1 Signed-off-by: Maksim Masalski <maksim.masalski@intel.com> ) on Shippable.com #builds By Shippable.com <noreply@...> · #2452 ·
[ master ] Build TIMEOUT for zephyrproject-rtos/ci-test ( ci: Update sdk to 0.11.3 Update sdk to 0.11.3 release and update docker image to get that SDK version. Signed-off-by: Kumar Gala <kumar.gala@linaro.org> ) on Shippable.com #builds By Shippable.com <noreply@...> · #2451 ·
[ master ] Build FAILED for zephyrproject-rtos/test_results ( tests: reel board test results Testing CI system, run tests on hardware reel board v1 Signed-off-by: Maksim Masalski <maksim.masalski@intel.com> ) on Shippable.com #builds By Shippable.com <noreply@...> · #2450 ·
[ master ] Build TIMEOUT for zephyrproject-rtos/ci-test ( ci: Update sdk to 0.11.3 Update sdk to 0.11.3 release and update docker image to get that SDK version. Signed-off-by: Kumar Gala <kumar.gala@linaro.org> ) on Shippable.com #builds By Shippable.com <noreply@...> · #2449 ·
[ master ] Build UNSTABLE for zephyrproject-rtos/test_results ( tests: reel board test results Testing CI system, run tests on hardware reel board v1 Signed-off-by: Maksim Masalski <maksim.masalski@intel.com> ) on Shippable.com #builds By Shippable.com <noreply@...> · #2448 ·
[ master ] Build TIMEOUT for zephyrproject-rtos/ci-test ( ci: Update sdk to 0.11.3 Update sdk to 0.11.3 release and update docker image to get that SDK version. Signed-off-by: Kumar Gala <kumar.gala@linaro.org> ) on Shippable.com #builds By Shippable.com <noreply@...> · #2447 ·
[ master ] Build FAILED for zephyrproject-rtos/test_results ( tests: reel board test results Testing CI system, run tests on hardware reel board v1 Signed-off-by: Maksim Masalski <maksim.masalski@intel.com> ) on Shippable.com #builds By Shippable.com <noreply@...> · #2446 ·
[ master ] Build TIMEOUT for zephyrproject-rtos/ci-test ( ci: Update sdk to 0.11.3 Update sdk to 0.11.3 release and update docker image to get that SDK version. Signed-off-by: Kumar Gala <kumar.gala@linaro.org> ) on Shippable.com #builds By Shippable.com <noreply@...> · #2445 ·
[ master ] Build UNSTABLE for zephyrproject-rtos/test_results ( tests: reel board test results Testing CI system, run tests on hardware reel board v1 Signed-off-by: Maksim Masalski <maksim.masalski@intel.com> ) on Shippable.com #builds By Shippable.com <noreply@...> · #2444 ·
[ master ] Build TIMEOUT for zephyrproject-rtos/ci-test ( ci: Update sdk to 0.11.3 Update sdk to 0.11.3 release and update docker image to get that SDK version. Signed-off-by: Kumar Gala <kumar.gala@linaro.org> ) on Shippable.com #builds By Shippable.com <noreply@...> · #2443 ·