Date   
[Still Failing] Zephyr / zephyr-daily #18 (master) #builds By Buildkite <notifications@...> · #2545 ·
[Still Failing] Zephyr / zephyr-daily #17 (master) #builds By Buildkite <notifications@...> · #2544 ·
[Still Failing] Zephyr / zephyr-daily #16 (master) #builds By Buildkite <notifications@...> · #2543 ·
[Still Failing] Zephyr / zephyr-daily #15 (master) #builds By Buildkite <notifications@...> · #2542 ·
[Still Failing] Zephyr / zephyr-daily #14 (master) #builds By Buildkite <notifications@...> · #2541 ·
[Still Failing] Zephyr / zephyr-daily #13 (master) #builds By Buildkite <notifications@...> · #2540 ·
[ master ] Build TIMEOUT for zephyrproject-rtos/ci-test ( ci: Update sdk to 0.11.3 Update sdk to 0.11.3 release and update docker image to get that SDK version. Signed-off-by: Kumar Gala <kumar.gala@linaro.org> ) on Shippable.com #builds By Shippable.com <noreply@...> · #2539 ·
[ master ] Build FAILED for zephyrproject-rtos/test_results ( zephyr-v2.3.0-437-gb5764f9902: Intel Master Daily Test Report Intel Zephyr Daily Test Report for the master branch Signed-off-by: Maksim Masalski <maksim.masalski@intel.com> ) on Shippable.com #builds By Shippable.com <noreply@...> · #2538 ·
[Failed] Zephyr / zephyr-daily #12 (master) #builds By Buildkite <notifications@...> · #2537 ·
[ master ] Build TIMEOUT for zephyrproject-rtos/ci-test ( ci: Update sdk to 0.11.3 Update sdk to 0.11.3 release and update docker image to get that SDK version. Signed-off-by: Kumar Gala <kumar.gala@linaro.org> ) on Shippable.com #builds By Shippable.com <noreply@...> · #2536 ·
[ master ] Build FAILED for zephyrproject-rtos/test_results ( zephyr-v2.3.0-361-gcf72fe8fe9: arc em_starterkit_em9d results em_starterkit_em9d: 142 tests passed, 1 failed, 29 skipped 143 tests executed on platforms, 29 tests were only build samples/posix/eventfd/sample.posix.eventfd failed timeout Signed-off-by: Jingru Wang <jingru@synopsys.com> ) on Shippable.com #builds By Shippable.com <noreply@...> · #2535 ·
[Canceled] Zephyr / zephyr-daily #8 (master) #builds By Buildkite <notifications@...> · #2534 ·
[ master ] Build TIMEOUT for zephyrproject-rtos/ci-test ( ci: Update sdk to 0.11.3 Update sdk to 0.11.3 release and update docker image to get that SDK version. Signed-off-by: Kumar Gala <kumar.gala@linaro.org> ) on Shippable.com #builds By Shippable.com <noreply@...> · #2533 ·
[ master ] Build SUCCEEDED for zephyrproject-rtos/test_results ( zephyr-v2.3.0-641-gb5fb9497b6: stm32 results Non reg result analysis on last run: (verdicts: T/p: Passed, F/f: Failed, t:timeout) tests/kernel/fpu_sharing/float_disable/kernel.fpu_sharing.float_disable.arm, nucleo_l4r5zi (instable: pfpfppppppppppppp) tests/kernel/mem_protect/userspace/kernel.memory_protection.userspace, disco_l475_iot1 (instable: pppppppttpppppppp) Total: 19 test(s) failed out of 1802 tests run 0 regression(s) on stable test Signed-off-by: Erwan Gouriou <erwan.gouriou@linaro.org> ) on Shippable.com #builds By Shippable.com <noreply@...> · #2532 ·
[ master ] Build TIMEOUT for zephyrproject-rtos/ci-test ( ci: Update sdk to 0.11.3 Update sdk to 0.11.3 release and update docker image to get that SDK version. Signed-off-by: Kumar Gala <kumar.gala@linaro.org> ) on Shippable.com #builds By Shippable.com <noreply@...> · #2531 ·
[ master ] Build FAILED for zephyrproject-rtos/test_results ( zephyr-v2.3.0-618-ga53c813ac5: stm32 results Non reg result analysis on last run: (verdicts: T/p: Passed, F/f: Failed, t:timeout) samples/subsys/nvs/sample.nvs.basic, disco_l475_iot1 (instable: pttpttptttpttpttt) tests/kernel/mem_protect/userspace/kernel.memory_protection.userspace, nucleo_l4r5zi tests/kernel/timer/timer_api/kernel.timer, nucleo_f103rb tests/net/utils/net.util, nucleo_f429zi tests/net/utils/net.util, nucleo_f746zg tests/posix/common/portability.posix.common.newlib, nucleo_wb55rg Total: 18 test(s) failed out of 1799 tests run 5 regression(s) on stable test Signed-off-by: Erwan Gouriou <erwan.gouriou@linaro.org> ) on Shippable.com #builds By Shippable.com <noreply@...> · #2530 ·
[ master ] Build TIMEOUT for zephyrproject-rtos/ci-test ( ci: Update sdk to 0.11.3 Update sdk to 0.11.3 release and update docker image to get that SDK version. Signed-off-by: Kumar Gala <kumar.gala@linaro.org> ) on Shippable.com #builds By Shippable.com <noreply@...> · #2529 ·
[ master ] Build SUCCEEDED for zephyrproject-rtos/test_results ( zephyr-v2.3.0-618-ga53c813ac5: stm32 results Non reg result analysis on last run: (verdicts: T/p: Passed, F/f: Failed, t:timeout) samples/subsys/nvs/sample.nvs.basic, disco_l475_iot1 (instable: pttpttptttpttpttt) tests/kernel/mem_protect/userspace/kernel.memory_protection.userspace, nucleo_l4r5zi tests/kernel/timer/timer_api/kernel.timer, nucleo_f103rb tests/net/utils/net.util, nucleo_f429zi tests/net/utils/net.util, nucleo_f746zg tests/posix/common/portability.posix.common.newlib, nucleo_wb55rg Total: 18 test(s) failed out of 1799 tests run 5 regression(s) on stable test Signed-off-by: Erwan Gouriou <erwan.gouriou@linaro.org> ) on Shippable.com #builds By Shippable.com <noreply@...> · #2528 ·
[ master ] Build TIMEOUT for zephyrproject-rtos/ci-test ( ci: Update sdk to 0.11.3 Update sdk to 0.11.3 release and update docker image to get that SDK version. Signed-off-by: Kumar Gala <kumar.gala@linaro.org> ) on Shippable.com #builds By Shippable.com <noreply@...> · #2527 ·
[ master ] Build FAILED for zephyrproject-rtos/test_results ( zephyr-v2.3.0-618-ga53c813ac5: stm32 results Non reg result analysis on last run: (verdicts: T/p: Passed, F/f: Failed, t:timeout) samples/subsys/nvs/sample.nvs.basic, disco_l475_iot1 (instable: pttpttptttpttpttt) tests/kernel/mem_protect/userspace/kernel.memory_protection.userspace, nucleo_l4r5zi tests/kernel/timer/timer_api/kernel.timer, nucleo_f103rb tests/net/utils/net.util, nucleo_f429zi tests/net/utils/net.util, nucleo_f746zg tests/posix/common/portability.posix.common.newlib, nucleo_wb55rg Total: 18 test(s) failed out of 1799 tests run 5 regression(s) on stable test Signed-off-by: Erwan Gouriou <erwan.gouriou@linaro.org> ) on Shippable.com #builds By Shippable.com <noreply@...> · #2526 ·