Date   
[ master ] Build TIMEOUT for zephyrproject-rtos/ci-test ( ci: Update sdk to 0.11.3 Update sdk to 0.11.3 release and update docker image to get that SDK version. Signed-off-by: Kumar Gala <kumar.gala@linaro.org> ) on Shippable.com #builds By Shippable.com <noreply@...> · #2494 ·
[ master ] Build FAILED for zephyrproject-rtos/test_results ( ci: fix sdk version and add minions Signed-off-by: Anas Nashif <anas.nashif@intel.com> ) on Shippable.com #builds By Shippable.com <noreply@...> · #2493 ·
[ master ] Build FAILED for zephyrproject-rtos/test_results ( ci: fix sdk version and add minions Signed-off-by: Anas Nashif <anas.nashif@intel.com> ) on Shippable.com #builds By Shippable.com <noreply@...> · #2492 ·
[ master ] Build CANCELED for zephyrproject-rtos/test_results ( config: add .gitignore ignore generated files. Signed-off-by: Anas Nashif <anas.nashif@intel.com> ) on Shippable.com #builds By Shippable.com <noreply@...> · #2491 ·
[ master ] Build FAILED for zephyrproject-rtos/test_results ( config: add .gitignore ignore generated files. Signed-off-by: Anas Nashif <anas.nashif@intel.com> ) on Shippable.com #builds By Shippable.com <noreply@...> · #2490 ·
[ master ] Build TIMEOUT for zephyrproject-rtos/ci-test ( ci: Update sdk to 0.11.3 Update sdk to 0.11.3 release and update docker image to get that SDK version. Signed-off-by: Kumar Gala <kumar.gala@linaro.org> ) on Shippable.com #builds By Shippable.com <noreply@...> · #2489 ·
[ master ] Build FAILED for zephyrproject-rtos/test_results ( zephyr-v2.3.0-106-g603c24dec9: stm32 sanitycheck results Test results for STM32 platforms on tag zephyr-v2.3.0-106-g603c24dec9 Signed-off-by: Erwan Gouriou <erwan.gouriou@linaro.org> ) on Shippable.com #builds By Shippable.com <noreply@...> · #2488 ·
[ master ] Build TIMEOUT for zephyrproject-rtos/ci-test ( ci: Update sdk to 0.11.3 Update sdk to 0.11.3 release and update docker image to get that SDK version. Signed-off-by: Kumar Gala <kumar.gala@linaro.org> ) on Shippable.com #builds By Shippable.com <noreply@...> · #2487 ·
[ master ] Build FAILED for zephyrproject-rtos/test_results ( add both qemu_arc_hs and qemu_arc_em ) on Shippable.com #builds By Shippable.com <noreply@...> · #2486 ·
[ master ] Build TIMEOUT for zephyrproject-rtos/ci-test ( ci: Update sdk to 0.11.3 Update sdk to 0.11.3 release and update docker image to get that SDK version. Signed-off-by: Kumar Gala <kumar.gala@linaro.org> ) on Shippable.com #builds By Shippable.com <noreply@...> · #2485 ·
[ master ] Build FAILED for zephyrproject-rtos/test_results ( tests: Add tests results run on Nordic boards Add sanitycheck test results run on nrf52dk_nrf52832 and nrf52840dk_nrf52840 Signed-off-by: Maciej Perkowski <Maciej.Perkowski@nordicsemi.no> ) on Shippable.com #builds By Shippable.com <noreply@...> · #2484 ·
[ master ] Build TIMEOUT for zephyrproject-rtos/ci-test ( ci: Update sdk to 0.11.3 Update sdk to 0.11.3 release and update docker image to get that SDK version. Signed-off-by: Kumar Gala <kumar.gala@linaro.org> ) on Shippable.com #builds By Shippable.com <noreply@...> · #2483 ·
[ master ] Build UNSTABLE for zephyrproject-rtos/test_results ( install forked junit2html ) on Shippable.com #builds By Shippable.com <noreply@...> · #2482 ·
[ master ] Build TIMEOUT for zephyrproject-rtos/ci-test ( ci: Update sdk to 0.11.3 Update sdk to 0.11.3 release and update docker image to get that SDK version. Signed-off-by: Kumar Gala <kumar.gala@linaro.org> ) on Shippable.com #builds By Shippable.com <noreply@...> · #2481 ·
[ master ] Build FAILED for zephyrproject-rtos/test_results ( install forked junit2html ) on Shippable.com #builds By Shippable.com <noreply@...> · #2480 ·
[ master ] Build TIMEOUT for zephyrproject-rtos/ci-test ( ci: Update sdk to 0.11.3 Update sdk to 0.11.3 release and update docker image to get that SDK version. Signed-off-by: Kumar Gala <kumar.gala@linaro.org> ) on Shippable.com #builds By Shippable.com <noreply@...> · #2479 ·
[ master ] Build UNSTABLE for zephyrproject-rtos/test_results ( install forked junit2html ) on Shippable.com #builds By Shippable.com <noreply@...> · #2478 ·
[ master ] Build CANCELED for zephyrproject-rtos/ci-test ( ci: Update sdk to 0.11.3 Update sdk to 0.11.3 release and update docker image to get that SDK version. Signed-off-by: Kumar Gala <kumar.gala@linaro.org> ) on Shippable.com #builds By Shippable.com <noreply@...> · #2477 ·
[ master ] Build UNSTABLE for zephyrproject-rtos/test_results ( tests: reel board test results Testing CI system, run tests on hardware reel board v1 Signed-off-by: Maksim Masalski <maksim.masalski@intel.com> ) on Shippable.com #builds By Shippable.com <noreply@...> · #2476 ·
[ master ] Build TIMEOUT for zephyrproject-rtos/ci-test ( ci: Update sdk to 0.11.3 Update sdk to 0.11.3 release and update docker image to get that SDK version. Signed-off-by: Kumar Gala <kumar.gala@linaro.org> ) on Shippable.com #builds By Shippable.com <noreply@...> · #2475 ·