Date   
[ master ] Build SUCCEEDED for zephyrproject-rtos/test_results ( actions: fix merging ) on Shippable.com #builds By Shippable.com <noreply@...> · #2420 ·
[ master ] Build CANCELED for zephyrproject-rtos/ci-test ( bump matrix to 35 See if 35 builders will get this to not timeout. Signed-off-by: Kumar Gala <kumar.gala@linaro.org> ) on Shippable.com #builds By Shippable.com <noreply@...> · #2419 ·
[ master ] Build FAILED for zephyrproject-rtos/test_results ( actions: fix merging ) on Shippable.com #builds By Shippable.com <noreply@...> · #2418 ·
[ master ] Build CANCELED for zephyrproject-rtos/ci-test ( bump matrix to 35 See if 35 builders will get this to not timeout. Signed-off-by: Kumar Gala <kumar.gala@linaro.org> ) on Shippable.com #builds By Shippable.com <noreply@...> · #2417 ·
[ master ] Build TIMEOUT for zephyrproject-rtos/ci-test ( bump matrix to 35 See if 35 builders will get this to not timeout. Signed-off-by: Kumar Gala <kumar.gala@linaro.org> ) on Shippable.com #builds By Shippable.com <noreply@...> · #2416 ·
[ master ] Build FAILED for zephyrproject-rtos/test_results ( actions: fix merging ) on Shippable.com #builds By Shippable.com <noreply@...> · #2415 ·
[ master ] Build TIMEOUT for zephyrproject-rtos/ci-test ( bump matrix to 35 See if 35 builders will get this to not timeout. Signed-off-by: Kumar Gala <kumar.gala@linaro.org> ) on Shippable.com #builds By Shippable.com <noreply@...> · #2414 ·
[ master ] Build FAILED for zephyrproject-rtos/test_results ( action: upload report to S3 ) on Shippable.com #builds By Shippable.com <noreply@...> · #2413 ·
[ master ] Build TIMEOUT for zephyrproject-rtos/ci-test ( bump matrix to 35 See if 35 builders will get this to not timeout. Signed-off-by: Kumar Gala <kumar.gala@linaro.org> ) on Shippable.com #builds By Shippable.com <noreply@...> · #2412 ·
[ master ] Build FAILED for zephyrproject-rtos/test_results ( actions: create versioned artifact Signed-off-by: Anas Nashif <anas.nashif@intel.com> ) on Shippable.com #builds By Shippable.com <noreply@...> · #2411 ·
[ master ] Build CANCELED for zephyrproject-rtos/test_results ( add merge_junit.py script ) on Shippable.com #builds By Shippable.com <noreply@...> · #2410 ·
[ master ] Build TIMEOUT for zephyrproject-rtos/ci-test ( bump matrix to 35 See if 35 builders will get this to not timeout. Signed-off-by: Kumar Gala <kumar.gala@linaro.org> ) on Shippable.com #builds By Shippable.com <noreply@...> · #2409 ·
[ master ] Build FAILED for zephyrproject-rtos/test_results ( add m2gl025_miv platform ) on Shippable.com #builds By Shippable.com <noreply@...> · #2408 ·
[ master ] Build TIMEOUT for zephyrproject-rtos/ci-test ( bump matrix to 35 See if 35 builders will get this to not timeout. Signed-off-by: Kumar Gala <kumar.gala@linaro.org> ) on Shippable.com #builds By Shippable.com <noreply@...> · #2407 ·
[ master ] Build FAILED for zephyrproject-rtos/test_results ( add m2gl025_miv platform ) on Shippable.com #builds By Shippable.com <noreply@...> · #2406 ·
[ master ] Build TIMEOUT for zephyrproject-rtos/ci-test ( ci: bump to docker image v0.11.6 Signed-off-by: Kumar Gala <kumar.gala@linaro.org> ) on Shippable.com #builds By Shippable.com <noreply@...> · #2405 ·
[ master ] Build TIMEOUT for zephyrproject-rtos/ci-test ( ci: bump to docker image v0.11.6 Signed-off-by: Kumar Gala <kumar.gala@linaro.org> ) on Shippable.com #builds By Shippable.com <noreply@...> · #2404 ·
[ master ] Build TIMEOUT for zephyrproject-rtos/ci-test ( ci: bump to docker image v0.11.6 Signed-off-by: Kumar Gala <kumar.gala@linaro.org> ) on Shippable.com #builds By Shippable.com <noreply@...> · #2403 ·
[ master ] Build FAILED for zephyrproject-rtos/test_results ( add m2gl025_miv platform ) on Shippable.com #builds By Shippable.com <noreply@...> · #2402 ·
[ master ] Build CANCELED for zephyrproject-rtos/test_results ( add m2gl025_miv platform ) on Shippable.com #builds By Shippable.com <noreply@...> · #2401 ·