Date   

zephyr/master: daily build zephyr-kernel-1.6.99-170127-a45dd12 Failure

donotreply@...
 

zephyr/master: daily build zephyr-kernel-1.6.99-170127-a45dd12 Failure



job zephyr-sanity build number 408 failed
see: https://jenkins.zephyrproject.org/job/zephyr-sanity/408/

***** BOOTING ZEPHYR OS v1.6.99 - BUILD: Jan 28 2017 00:31:32 *****
Running test suite test_mpool_api
tc_start() - test_mpool_alloc_free_thread
===================================================================
PASS - test_mpool_alloc_free_thread.
tc_start() - test_mpool_alloc_free_isr
ASSERTION FAIL [!(_kernel.nested != 0)] @ /w/workspace/zephyr-sanity/kernel/include/ksched.h:237:
---------------sanity-out/qemu_x86/tests/kernel/mem_pool/test_mpool_api/test/qemu.log---------------
qemu_nios2 tests/kernel/mem_pool/test_mpool_api/test FAILED: timeout
--------------sanity-out/qemu_nios2/tests/kernel/mem_pool/test_mpool_api/test/qemu.log--------------
***** BOOTING ZEPHYR OS v1.6.99 - BUILD: Jan 28 2017 00:31:38 *****
Running test suite test_mpool_api
tc_start() - test_mpool_alloc_free_thread
===================================================================
PASS - test_mpool_alloc_free_thread.
tc_start() - test_mpool_alloc_free_isr
ASSERTION FAIL [!(_kernel.nested != 0)] @ /w/workspace/zephyr-sanity/kernel/include/ksched.h:237:
--------------sanity-out/qemu_nios2/tests/kernel/mem_pool/test_mpool_api/test/qemu.log--------------
qemu_x86_iamcu tests/kernel/timer/timer_api/test FAILED: timeout
----------------sanity-out/qemu_x86_iamcu/tests/kernel/timer/timer_api/test/qemu.log----------------
Running test suite test_timer_api
tc_start() - test_timer_duration_period
ASSERTION FAIL [!(_kernel.nested != 0)] @ /w/workspace/zephyr-sanity/kernel/timer.c:134:
----------------sanity-out/qemu_x86_iamcu/tests/kernel/timer/timer_api/test/qemu.log----------------
0 of 43 tests passed with 0 warnings in 171 seconds
Extra environment setting:
CONFIG_ASSERT=y
CONFIG_DEBUG=y
Build step 'Execute shell' marked build as failure


job zephyr-sanity build number 407 failed
see: https://jenkins.zephyrproject.org/job/zephyr-sanity/407/

CC ext/lib/crypto/mbedtls/library/x509_crl.o
CC ext/lib/crypto/mbedtls/library/x509_crt.o
CC ext/lib/crypto/mbedtls/library/x509_csr.o
CC ext/lib/crypto/mbedtls/library/x509write_crt.o
CC ext/lib/crypto/mbedtls/library/x509write_csr.o
CC ext/lib/crypto/mbedtls/library/xtea.o
make[7]: Target `__build' not remade because of errors.
make[6]: *** [ext/lib/crypto/mbedtls] Error 2
make[6]: Target `__build' not remade because of errors.
make[5]: *** [ext/lib/crypto] Error 2
make[5]: Target `__build' not remade because of errors.
make[4]: *** [ext/lib] Error 2
make[4]: Target `__build' not remade because of errors.
make[3]: *** [ext] Error 2
make[3]: Target `all' not remade because of errors.
make[3]: Leaving directory `/w/workspace/zephyr-sanity/sanity-out/qemu_x86/tests/crypto/test_mbedtls/test'
make[2]: *** [sub-make] Error 2
make[2]: Target `all' not remade because of errors.
make[2]: Leaving directory `/w/workspace/zephyr-sanity'
make[1]: *** [all] Error 2
make[1]: Leaving directory `/w/workspace/zephyr-sanity/tests/crypto/test_mbedtls'
Generating LALR tables
Platform 'zedboard_pulpino' not specified in any arch .ini file and will not be tested
Platform 'qemu_riscv32' not specified in any arch .ini file and will not be tested
--------------------sanity-out/qemu_x86/tests/crypto/test_mbedtls/test/build.log--------------------
0 of 31 tests passed with 0 warnings in 59 seconds
Extra environment setting:
CONFIG_DEBUG=y
Build step 'Execute shell' marked build as failure


job zephyr-sanity build number 406 failed
see: https://jenkins.zephyrproject.org/job/zephyr-sanity/406/

qemu_cortex_m3 tests/kernel/timer/timer_api/test FAILED: timeout
----------------sanity-out/qemu_cortex_m3/tests/kernel/timer/timer_api/test/qemu.log----------------
Running test suite test_timer_api
tc_start() - test_timer_duration_period
ASSERTION FAIL [!_IsInIsr()] @ /w/workspace/zephyr-sanity/kernel/timer.c:134:
----------------sanity-out/qemu_cortex_m3/tests/kernel/timer/timer_api/test/qemu.log----------------
qemu_nios2 tests/kernel/pipe/test_pipe_api/test FAILED: timeout
----------------sanity-out/qemu_nios2/tests/kernel/pipe/test_pipe_api/test/qemu.log-----------------
Running test suite test_pipe_api
tc_start() - test_pipe_thread2thread
===================================================================
PASS - test_pipe_thread2thread.
tc_start() - test_pipe_thread2isr
ASSERTION FAIL [!(_kernel.nested != 0)] @ /w/workspace/zephyr-sanity/kernel/include/ksched.h:237:
----------------sanity-out/qemu_nios2/tests/kernel/pipe/test_pipe_api/test/qemu.log-----------------
qemu_cortex_m3 tests/kernel/mem_pool/test_mpool_api/test FAILED: timeout
------------sanity-out/qemu_cortex_m3/tests/kernel/mem_pool/test_mpool_api/test/qemu.log------------
***** BOOTING ZEPHYR OS v1.6.99 - BUILD: Jan 28 2017 00:40:03 *****
Running test suite test_mpool_api
tc_start() - test_mpool_alloc_free_thread
===================================================================
PASS - test_mpool_alloc_free_thread.
tc_start() - test_mpool_alloc_free_isr
ASSERTION FAIL [!_IsInIsr()] @ /w/workspace/zephyr-sanity/kernel/include/ksched.h:237:
------------sanity-out/qemu_cortex_m3/tests/kernel/mem_pool/test_mpool_api/test/qemu.log------------
0 of 12 tests passed with 0 warnings in 78 seconds
Extra environment setting:
CONFIG_ASSERT=y
Build step 'Execute shell' marked build as failure


zephyr/master: daily build zephyr-kernel-1.6.99-170128-a45dd12 Failure

donotreply@...
 

zephyr/master: daily build zephyr-kernel-1.6.99-170128-a45dd12 Failure



job zephyr-sanity build number 412 failed
see: https://jenkins.zephyrproject.org/job/zephyr-sanity/412/

------------sanity-out/qemu_cortex_m3/tests/kernel/mem_pool/test_mpool_api/test/qemu.log------------
***** BOOTING ZEPHYR OS v1.6.99 - BUILD: Jan 29 2017 00:19:17 *****
Running test suite test_mpool_api
tc_start() - test_mpool_alloc_free_thread
===================================================================
PASS - test_mpool_alloc_free_thread.
tc_start() - test_mpool_alloc_free_isr
ASSERTION FAIL [!_IsInIsr()] @ /w/workspace/zephyr-sanity/kernel/include/ksched.h:237:
------------sanity-out/qemu_cortex_m3/tests/kernel/mem_pool/test_mpool_api/test/qemu.log------------
qemu_nios2 tests/kernel/pipe/test_pipe_api/test FAILED: timeout
----------------sanity-out/qemu_nios2/tests/kernel/pipe/test_pipe_api/test/qemu.log-----------------
Running test suite test_pipe_api
tc_start() - test_pipe_thread2thread
===================================================================
PASS - test_pipe_thread2thread.
tc_start() - test_pipe_thread2isr
ASSERTION FAIL [!(_kernel.nested != 0)] @ /w/workspace/zephyr-sanity/kernel/include/ksched.h:237:
----------------sanity-out/qemu_nios2/tests/kernel/pipe/test_pipe_api/test/qemu.log-----------------
qemu_cortex_m3 tests/kernel/timer/timer_api/test FAILED: timeout
----------------sanity-out/qemu_cortex_m3/tests/kernel/timer/timer_api/test/qemu.log----------------
Running test suite test_timer_api
tc_start() - test_timer_duration_period
ASSERTION FAIL [!_IsInIsr()] @ /w/workspace/zephyr-sanity/kernel/timer.c:134:
----------------sanity-out/qemu_cortex_m3/tests/kernel/timer/timer_api/test/qemu.log----------------
0 of 43 tests passed with 0 warnings in 171 seconds
Extra environment setting:
CONFIG_ASSERT=y
CONFIG_DEBUG=y
Build step 'Execute shell' marked build as failure


job zephyr-sanity build number 411 failed
see: https://jenkins.zephyrproject.org/job/zephyr-sanity/411/

GDT= 00100070 00000017
IDT= 00104ab0 000007ff
CR0=0000003f CR2=00000000 CR3=00000000 CR4=00000000
DR0=00000000 DR1=00000000 DR2=00000000 DR3=00000000
DR6=ffff0ff0 DR7=00000400
CCS=00000000 CCD=00000030 CCO=ADDB
EFER=0000000000000000
FCW=037f FSW=0000 [ST=0] FTW=00 MXCSR=00001f80
FPR0=0000000000000000 0000 FPR1=0000000000000000 0000
FPR2=0000000000000000 0000 FPR3=0000000000000000 0000
FPR4=0000000000000000 0000 FPR5=0000000000000000 0000
FPR6=0000000000000000 0000 FPR7=0000000000000000 0000
XMM00=00000000000000000000000000000000 XMM01=00000000000000000000000000000000
XMM02=00000000000000000000000000000000 XMM03=00000000000000000000000000000000
XMM04=00000000000000000000000000000000 XMM05=00000000000000000000000000000000
XMM06=00000000000000000000000000000000 XMM07=00000000000000000000000000000000
make[3]: *** [run] Aborted (core dumped)
make[3]: Target `qemu' not remade because of errors.
make[3]: Leaving directory `/w/workspace/zephyr-sanity/sanity-out/qemu_x86/tests/legacy/kernel/test_sema/nanokernel/test'
make[2]: *** [sub-make] Error 2
make[2]: Target `qemu' not remade because of errors.
make[2]: Leaving directory `/w/workspace/zephyr-sanity'
make[1]: *** [qemu] Error 2
make[1]: Leaving directory `/w/workspace/zephyr-sanity/tests/legacy/kernel/test_sema/nanokernel'
-------------sanity-out/qemu_x86/tests/legacy/kernel/test_sema/nanokernel/test/run.log--------------
0 of 31 tests passed with 0 warnings in 55 seconds
Extra environment setting:
CONFIG_DEBUG=y
Build step 'Execute shell' marked build as failure


job zephyr-sanity build number 410 failed
see: https://jenkins.zephyrproject.org/job/zephyr-sanity/410/

qemu_cortex_m3 tests/kernel/mem_pool/test_mpool_api/test FAILED: timeout
------------sanity-out/qemu_cortex_m3/tests/kernel/mem_pool/test_mpool_api/test/qemu.log------------
***** BOOTING ZEPHYR OS v1.6.99 - BUILD: Jan 29 2017 00:20:13 *****
Running test suite test_mpool_api
tc_start() - test_mpool_alloc_free_thread
===================================================================
PASS - test_mpool_alloc_free_thread.
tc_start() - test_mpool_alloc_free_isr
ASSERTION FAIL [!_IsInIsr()] @ /w/workspace/zephyr-sanity/kernel/include/ksched.h:237:
------------sanity-out/qemu_cortex_m3/tests/kernel/mem_pool/test_mpool_api/test/qemu.log------------
qemu_cortex_m3 tests/kernel/pipe/test_pipe_api/test FAILED: timeout
--------------sanity-out/qemu_cortex_m3/tests/kernel/pipe/test_pipe_api/test/qemu.log---------------
Running test suite test_pipe_api
tc_start() - test_pipe_thread2thread
===================================================================
PASS - test_pipe_thread2thread.
tc_start() - test_pipe_thread2isr
ASSERTION FAIL [!_IsInIsr()] @ /w/workspace/zephyr-sanity/kernel/include/ksched.h:237:
--------------sanity-out/qemu_cortex_m3/tests/kernel/pipe/test_pipe_api/test/qemu.log---------------
qemu_x86 tests/kernel/timer/timer_api/test FAILED: timeout
-------------------sanity-out/qemu_x86/tests/kernel/timer/timer_api/test/qemu.log-------------------
Running test suite test_timer_api
tc_start() - test_timer_duration_period
ASSERTION FAIL [!(_kernel.nested != 0)] @ /w/workspace/zephyr-sanity/kernel/timer.c:134:
-------------------sanity-out/qemu_x86/tests/kernel/timer/timer_api/test/qemu.log-------------------
0 of 12 tests passed with 0 warnings in 80 seconds
Extra environment setting:
CONFIG_ASSERT=y
Build step 'Execute shell' marked build as failure


zephyr/master: daily build zephyr-kernel-1.6.99-170129-f086a19 Failure

donotreply@...
 

zephyr/master: daily build zephyr-kernel-1.6.99-170129-f086a19 Failure



job zephyr-sanity build number 416 failed
see: https://jenkins.zephyrproject.org/job/zephyr-sanity/416/

***** BOOTING ZEPHYR OS v1.6.99 - BUILD: Jan 30 2017 00:15:07 *****
Running test suite test_mpool_api
tc_start() - test_mpool_alloc_free_thread
===================================================================
PASS - test_mpool_alloc_free_thread.
tc_start() - test_mpool_alloc_free_isr
ASSERTION FAIL [!(_kernel.nested != 0)] @ /w/workspace/zephyr-sanity/kernel/include/ksched.h:237:
---------------sanity-out/qemu_x86/tests/kernel/mem_pool/test_mpool_api/test/qemu.log---------------
qemu_nios2 tests/kernel/timer/timer_api/test FAILED: timeout
------------------sanity-out/qemu_nios2/tests/kernel/timer/timer_api/test/qemu.log------------------
Running test suite test_timer_api
tc_start() - test_timer_duration_period
ASSERTION FAIL [!(_kernel.nested != 0)] @ /w/workspace/zephyr-sanity/kernel/timer.c:134:
------------------sanity-out/qemu_nios2/tests/kernel/timer/timer_api/test/qemu.log------------------
qemu_x86_iamcu tests/kernel/mem_pool/test_mpool_api/test FAILED: timeout
------------sanity-out/qemu_x86_iamcu/tests/kernel/mem_pool/test_mpool_api/test/qemu.log------------
***** BOOTING ZEPHYR OS v1.6.99 - BUILD: Jan 30 2017 00:15:31 *****
Running test suite test_mpool_api
tc_start() - test_mpool_alloc_free_thread
===================================================================
PASS - test_mpool_alloc_free_thread.
tc_start() - test_mpool_alloc_free_isr
ASSERTION FAIL [!(_kernel.nested != 0)] @ /w/workspace/zephyr-sanity/kernel/include/ksched.h:237:
------------sanity-out/qemu_x86_iamcu/tests/kernel/mem_pool/test_mpool_api/test/qemu.log------------
0 of 43 tests passed with 0 warnings in 178 seconds
Extra environment setting:
CONFIG_ASSERT=y
CONFIG_DEBUG=y
Build step 'Execute shell' marked build as failure


job zephyr-sanity build number 415 failed
see: https://jenkins.zephyrproject.org/job/zephyr-sanity/415/

AS arch/arm/core/cortex_m/reset.o
AS arch/arm/core/cortex_m/nmi_on_reset.o
CC arch/arm/core/cortex_m/prep_c.o
CC arch/arm/core/cortex_m/scs.o
CC arch/arm/core/cortex_m/scb.o
CC arch/arm/core/cortex_m/nmi.o
CC arch/arm/core/cortex_m/exc_manage.o
CC arch/arm/core/cortex_m/irq_vector_table.o
AS arch/arm/core/cortex_m/sw_isr_table.o
LD arch/arm/core/cortex_m/built-in.o
LD arch/arm/core/built-in.o
AR kernel/lib.a
LD arch/arm/built-in.o
LD arch/built-in.o
make[3]: Target `all' not remade because of errors.
make[3]: Leaving directory `/w/workspace/zephyr-sanity/sanity-out/mps2_an385/tests/crypto/test_mbedtls/test'
make[2]: *** [sub-make] Error 2
make[2]: Target `all' not remade because of errors.
make[2]: Leaving directory `/w/workspace/zephyr-sanity'
make[1]: *** [all] Error 2
make[1]: Leaving directory `/w/workspace/zephyr-sanity/tests/crypto/test_mbedtls'
Generating LALR tables
Platform 'zedboard_pulpino' not specified in any arch .ini file and will not be tested
Platform 'qemu_riscv32' not specified in any arch .ini file and will not be tested
-------------------sanity-out/mps2_an385/tests/crypto/test_mbedtls/test/build.log-------------------
0 of 31 tests passed with 0 warnings in 50 seconds
Extra environment setting:
CONFIG_DEBUG=y
Build step 'Execute shell' marked build as failure


job zephyr-sanity build number 414 failed
see: https://jenkins.zephyrproject.org/job/zephyr-sanity/414/

-------------------sanity-out/qemu_x86/tests/kernel/timer/timer_api/test/qemu.log-------------------
qemu_x86_iamcu tests/kernel/pipe/test_pipe_api/test FAILED: timeout
--------------sanity-out/qemu_x86_iamcu/tests/kernel/pipe/test_pipe_api/test/qemu.log---------------
Running test suite test_pipe_api
tc_start() - test_pipe_thread2thread
===================================================================
PASS - test_pipe_thread2thread.
tc_start() - test_pipe_thread2isr
ASSERTION FAIL [!(_kernel.nested != 0)] @ /w/workspace/zephyr-sanity/kernel/include/ksched.h:237:
--------------sanity-out/qemu_x86_iamcu/tests/kernel/pipe/test_pipe_api/test/qemu.log---------------
qemu_cortex_m3 tests/kernel/timer/timer_api/test FAILED: timeout
----------------sanity-out/qemu_cortex_m3/tests/kernel/timer/timer_api/test/qemu.log----------------
Running test suite test_timer_api
tc_start() - test_timer_duration_period
ASSERTION FAIL [!_IsInIsr()] @ /w/workspace/zephyr-sanity/kernel/timer.c:134:
----------------sanity-out/qemu_cortex_m3/tests/kernel/timer/timer_api/test/qemu.log----------------
qemu_cortex_m3 tests/kernel/pipe/test_pipe_api/test FAILED: timeout
--------------sanity-out/qemu_cortex_m3/tests/kernel/pipe/test_pipe_api/test/qemu.log---------------
Running test suite test_pipe_api
tc_start() - test_pipe_thread2thread
===================================================================
PASS - test_pipe_thread2thread.
tc_start() - test_pipe_thread2isr
ASSERTION FAIL [!_IsInIsr()] @ /w/workspace/zephyr-sanity/kernel/include/ksched.h:237:
--------------sanity-out/qemu_cortex_m3/tests/kernel/pipe/test_pipe_api/test/qemu.log---------------
0 of 12 tests passed with 0 warnings in 79 seconds
Extra environment setting:
CONFIG_ASSERT=y
Build step 'Execute shell' marked build as failure


zephyr/master: daily build zephyr-kernel-1.6.99-170130-8436c0a Failure

donotreply@...
 

zephyr/master: daily build zephyr-kernel-1.6.99-170130-8436c0a Failure



job zephyr-sanity build number 420 failed
see: https://jenkins.zephyrproject.org/job/zephyr-sanity/420/

-----------------sanity-out/qemu_x86/tests/kernel/pipe/test_pipe_api/test/qemu.log------------------
qemu_x86_iamcu tests/kernel/mem_pool/test_mpool_api/test FAILED: timeout
------------sanity-out/qemu_x86_iamcu/tests/kernel/mem_pool/test_mpool_api/test/qemu.log------------
***** BOOTING ZEPHYR OS v1.6.99 - BUILD: Jan 31 2017 00:35:13 *****
Running test suite test_mpool_api
tc_start() - test_mpool_alloc_free_thread
===================================================================
PASS - test_mpool_alloc_free_thread.
tc_start() - test_mpool_alloc_free_isr
ASSERTION FAIL [!(_kernel.nested != 0)] @ /w/workspace/zephyr-sanity/kernel/include/ksched.h:237:
------------sanity-out/qemu_x86_iamcu/tests/kernel/mem_pool/test_mpool_api/test/qemu.log------------
qemu_x86 tests/kernel/timer/timer_api/test FAILED: timeout
-------------------sanity-out/qemu_x86/tests/kernel/timer/timer_api/test/qemu.log-------------------
Running test suite test_timer_api
tc_start() - test_timer_duration_period
ASSERTION FAIL [!(_kernel.nested != 0)] @ /w/workspace/zephyr-sanity/kernel/timer.c:134:
-------------------sanity-out/qemu_x86/tests/kernel/timer/timer_api/test/qemu.log-------------------
qemu_riscv32 tests/kernel/timer/timer_api/test FAILED: timeout
-----------------sanity-out/qemu_riscv32/tests/kernel/timer/timer_api/test/qemu.log-----------------
***** BOOTING ZEPHYR OS v1.6.99 *****
Running test suite test_timer_api
tc_start() - test_timer_duration_period
ASSERTION FAIL [!(_kernel.nested != 0)] @ /w/workspace/zephyr-sanity/kernel/timer.c:134:
-----------------sanity-out/qemu_riscv32/tests/kernel/timer/timer_api/test/qemu.log-----------------
0 of 47 tests passed with 0 warnings in 192 seconds
Extra environment setting:
CONFIG_ASSERT=y
CONFIG_DEBUG=y
Build step 'Execute shell' marked build as failure


job zephyr-sanity build number 419 failed
see: https://jenkins.zephyrproject.org/job/zephyr-sanity/419/

GDT= 00100070 00000017
IDT= 00102df0 000007ff
CR0=0000003f CR2=00000000 CR3=00000000 CR4=00000000
DR0=00000000 DR1=00000000 DR2=00000000 DR3=00000000
DR6=ffff0ff0 DR7=00000400
CCS=0000000a CCD=0000003c CCO=CLR
EFER=0000000000000000
FCW=037f FSW=0000 [ST=0] FTW=00 MXCSR=00001f80
FPR0=0000000000000000 0000 FPR1=0000000000000000 0000
FPR2=0000000000000000 0000 FPR3=0000000000000000 0000
FPR4=0000000000000000 0000 FPR5=0000000000000000 0000
FPR6=0000000000000000 0000 FPR7=0000000000000000 0000
XMM00=00000000000000000000000000000000 XMM01=00000000000000000000000000000000
XMM02=00000000000000000000000000000000 XMM03=00000000000000000000000000000000
XMM04=00000000000000000000000000000000 XMM05=00000000000000000000000000000000
XMM06=00000000000000000000000000000000 XMM07=00000000000000000000000000000000
make[3]: *** [run] Aborted (core dumped)
make[3]: Target `qemu' not remade because of errors.
make[3]: Leaving directory `/w/workspace/zephyr-sanity/sanity-out/qemu_x86/tests/legacy/kernel/test_sleep/test'
make[2]: *** [sub-make] Error 2
make[2]: Target `qemu' not remade because of errors.
make[2]: Leaving directory `/w/workspace/zephyr-sanity'
make[1]: *** [qemu] Error 2
make[1]: Leaving directory `/w/workspace/zephyr-sanity/tests/legacy/kernel/test_sleep'
------------------sanity-out/qemu_x86/tests/legacy/kernel/test_sleep/test/run.log-------------------
1 of 33 tests passed with 0 warnings in 65 seconds
Extra environment setting:
CONFIG_DEBUG=y
Build step 'Execute shell' marked build as failure


job zephyr-sanity build number 418 failed
see: https://jenkins.zephyrproject.org/job/zephyr-sanity/418/

qemu_cortex_m3 tests/kernel/pipe/test_pipe_api/test FAILED: timeout
--------------sanity-out/qemu_cortex_m3/tests/kernel/pipe/test_pipe_api/test/qemu.log---------------
Running test suite test_pipe_api
tc_start() - test_pipe_thread2thread
===================================================================
PASS - test_pipe_thread2thread.
tc_start() - test_pipe_thread2isr
ASSERTION FAIL [!_IsInIsr()] @ /w/workspace/zephyr-sanity/kernel/include/ksched.h:237:
Generating LALR tables
--------------sanity-out/qemu_cortex_m3/tests/kernel/pipe/test_pipe_api/test/qemu.log---------------
qemu_x86 tests/kernel/pipe/test_pipe_api/test FAILED: timeout
-----------------sanity-out/qemu_x86/tests/kernel/pipe/test_pipe_api/test/qemu.log------------------
Running test suite test_pipe_api
tc_start() - test_pipe_thread2thread
===================================================================
PASS - test_pipe_thread2thread.
tc_start() - test_pipe_thread2isr
ASSERTION FAIL [!(_kernel.nested != 0)] @ /w/workspace/zephyr-sanity/kernel/include/ksched.h:237:
-----------------sanity-out/qemu_x86/tests/kernel/pipe/test_pipe_api/test/qemu.log------------------
qemu_cortex_m3 tests/kernel/timer/timer_api/test FAILED: timeout
----------------sanity-out/qemu_cortex_m3/tests/kernel/timer/timer_api/test/qemu.log----------------
Running test suite test_timer_api
tc_start() - test_timer_duration_period
ASSERTION FAIL [!_IsInIsr()] @ /w/workspace/zephyr-sanity/kernel/timer.c:134:
----------------sanity-out/qemu_cortex_m3/tests/kernel/timer/timer_api/test/qemu.log----------------
0 of 16 tests passed with 0 warnings in 86 seconds
Extra environment setting:
CONFIG_ASSERT=y
Build step 'Execute shell' marked build as failure


job zephyr-sanity build number 417 failed
see: https://jenkins.zephyrproject.org/job/zephyr-sanity/417/

Vector #00 check Z - FAILURE
[FAIL] Test #1: ECDH - NIST-p256
===================================================================
FAIL - main.
===================================================================
PROJECT EXECUTION FAILED
-------------------sanity-out/qemu_riscv32/tests/crypto/test_ecc_dh/test/qemu.log-------------------
0 of 1 tests passed with 0 warnings in 1639 seconds
Invalid sanity, let's retry #2
sanitycheck --inline-logs +scripts/sanity_chk/sanity_daily.args --only-failed
Generating LALR tables
Cleaning output directory /w/workspace/zephyr-sanity/sanity-out
Selecting all possible platforms per test case
Building testcase defconfigs...
1 tests selected, 11883 tests discarded due to filters
qemu_riscv32 tests/crypto/test_ecc_dh/test FAILED: failed
-------------------sanity-out/qemu_riscv32/tests/crypto/test_ecc_dh/test/qemu.log-------------------
***** BOOTING ZEPHYR OS v1.6.99 - BUILD: Jan 31 2017 00:48:37 *****
tc_start() - TinyCrypt ECC DH tests

Vector #00 check Z - FAILURE
[FAIL] Test #1: ECDH - NIST-p256
===================================================================
FAIL - main.
===================================================================
PROJECT EXECUTION FAILED
-------------------sanity-out/qemu_riscv32/tests/crypto/test_ecc_dh/test/qemu.log-------------------
0 of 1 tests passed with 0 warnings in 4 seconds
Build step 'Execute shell' marked build as failure


zephyr/master: daily build zephyr-kernel-1.6.99-170131-b7180a4 Failure

donotreply@...
 

zephyr/master: daily build zephyr-kernel-1.6.99-170131-b7180a4 Failure



job zephyr-sanity build number 424 failed
see: https://jenkins.zephyrproject.org/job/zephyr-sanity/424/

PASS - test_mpool_alloc_free_thread.
tc_start() - test_mpool_alloc_free_isr
ASSERTION FAIL [!(_kernel.nested != 0)] @ /w/workspace/zephyr-sanity/kernel/include/ksched.h:237:
-------------sanity-out/qemu_riscv32/tests/kernel/mem_pool/test_mpool_api/test/qemu.log-------------
qemu_riscv32 tests/kernel/pipe/test_pipe_api/test FAILED: timeout
---------------sanity-out/qemu_riscv32/tests/kernel/pipe/test_pipe_api/test/qemu.log----------------
***** BOOTING ZEPHYR OS v1.6.99 *****
Running test suite test_pipe_api
tc_start() - test_pipe_thread2thread
===================================================================
PASS - test_pipe_thread2thread.
tc_start() - test_pipe_thread2isr
ASSERTION FAIL [!(_kernel.nested != 0)] @ /w/workspace/zephyr-sanity/kernel/include/ksched.h:237:
---------------sanity-out/qemu_riscv32/tests/kernel/pipe/test_pipe_api/test/qemu.log----------------
qemu_nios2 tests/kernel/mem_pool/test_mpool_api/test FAILED: timeout
--------------sanity-out/qemu_nios2/tests/kernel/mem_pool/test_mpool_api/test/qemu.log--------------
***** BOOTING ZEPHYR OS v1.6.99 - BUILD: Feb 1 2017 00:43:40 *****
Running test suite test_mpool_api
tc_start() - test_mpool_alloc_free_thread
===================================================================
PASS - test_mpool_alloc_free_thread.
tc_start() - test_mpool_alloc_free_isr
ASSERTION FAIL [!(_kernel.nested != 0)] @ /w/workspace/zephyr-sanity/kernel/include/ksched.h:237:
--------------sanity-out/qemu_nios2/tests/kernel/mem_pool/test_mpool_api/test/qemu.log--------------
0 of 47 tests passed with 0 warnings in 190 seconds
Extra environment setting:
CONFIG_ASSERT=y
CONFIG_DEBUG=y
Build step 'Execute shell' marked build as failure


job zephyr-sanity build number 423 failed
see: https://jenkins.zephyrproject.org/job/zephyr-sanity/423/

CC ext/lib/crypto/mbedtls/library/x509.o
CC ext/lib/crypto/mbedtls/library/x509_create.o
CC ext/lib/crypto/mbedtls/library/x509_crl.o
CC ext/lib/crypto/mbedtls/library/x509_crt.o
CC ext/lib/crypto/mbedtls/library/x509_csr.o
CC ext/lib/crypto/mbedtls/library/x509write_crt.o
CC ext/lib/crypto/mbedtls/library/x509write_csr.o
CC ext/lib/crypto/mbedtls/library/xtea.o
make[7]: Target `__build' not remade because of errors.
make[6]: *** [ext/lib/crypto/mbedtls] Error 2
make[6]: Target `__build' not remade because of errors.
make[5]: *** [ext/lib/crypto] Error 2
make[5]: Target `__build' not remade because of errors.
make[4]: *** [ext/lib] Error 2
make[4]: Target `__build' not remade because of errors.
make[3]: *** [ext] Error 2
make[3]: Target `all' not remade because of errors.
make[3]: Leaving directory `/w/workspace/zephyr-sanity/sanity-out/frdm_kw41z/tests/crypto/test_mbedtls/test'
make[2]: *** [sub-make] Error 2
make[2]: Target `all' not remade because of errors.
make[2]: Leaving directory `/w/workspace/zephyr-sanity'
make[1]: *** [all] Error 2
make[1]: Leaving directory `/w/workspace/zephyr-sanity/tests/crypto/test_mbedtls'
Generating LALR tables
-------------------sanity-out/frdm_kw41z/tests/crypto/test_mbedtls/test/build.log-------------------
0 of 32 tests passed with 0 warnings in 62 seconds
Extra environment setting:
CONFIG_DEBUG=y
Build step 'Execute shell' marked build as failure


job zephyr-sanity build number 422 failed
see: https://jenkins.zephyrproject.org/job/zephyr-sanity/422/

--------------sanity-out/qemu_cortex_m3/tests/kernel/pipe/test_pipe_api/test/qemu.log---------------
Running test suite test_pipe_api
tc_start() - test_pipe_thread2thread
===================================================================
PASS - test_pipe_thread2thread.
tc_start() - test_pipe_thread2isr
ASSERTION FAIL [!_IsInIsr()] @ /w/workspace/zephyr-sanity/kernel/include/ksched.h:237:
Generating LALR tables
--------------sanity-out/qemu_cortex_m3/tests/kernel/pipe/test_pipe_api/test/qemu.log---------------
qemu_cortex_m3 tests/kernel/timer/timer_api/test FAILED: timeout
----------------sanity-out/qemu_cortex_m3/tests/kernel/timer/timer_api/test/qemu.log----------------
Running test suite test_timer_api
tc_start() - test_timer_duration_period
ASSERTION FAIL [!_IsInIsr()] @ /w/workspace/zephyr-sanity/kernel/timer.c:134:
----------------sanity-out/qemu_cortex_m3/tests/kernel/timer/timer_api/test/qemu.log----------------
qemu_cortex_m3 tests/kernel/mem_pool/test_mpool_api/test FAILED: timeout
------------sanity-out/qemu_cortex_m3/tests/kernel/mem_pool/test_mpool_api/test/qemu.log------------
***** BOOTING ZEPHYR OS v1.6.99 - BUILD: Feb 1 2017 00:35:08 *****
Running test suite test_mpool_api
tc_start() - test_mpool_alloc_free_thread
===================================================================
PASS - test_mpool_alloc_free_thread.
tc_start() - test_mpool_alloc_free_isr
ASSERTION FAIL [!_IsInIsr()] @ /w/workspace/zephyr-sanity/kernel/include/ksched.h:237:
------------sanity-out/qemu_cortex_m3/tests/kernel/mem_pool/test_mpool_api/test/qemu.log------------
0 of 16 tests passed with 0 warnings in 83 seconds
Extra environment setting:
CONFIG_ASSERT=y
Build step 'Execute shell' marked build as failure


job zephyr-sanity build number 421 failed
see: https://jenkins.zephyrproject.org/job/zephyr-sanity/421/

[FAIL] Test #1: ECDH - NIST-p256
===================================================================
FAIL - main.
===================================================================
PROJECT EXECUTION FAILED
-------------------sanity-out/qemu_riscv32/tests/crypto/test_ecc_dh/test/qemu.log-------------------
qemu_riscv32 tests/kernel/context/test PASSED
1 of 2 tests passed with 0 warnings in 1284 seconds
Invalid sanity, let's retry #2
sanitycheck --inline-logs +scripts/sanity_chk/sanity_daily.args --only-failed
Generating LALR tables
Cleaning output directory /w/workspace/zephyr-sanity/sanity-out
Selecting all possible platforms per test case
Building testcase defconfigs...
1 tests selected, 11923 tests discarded due to filters
qemu_riscv32 tests/crypto/test_ecc_dh/test FAILED: failed
-------------------sanity-out/qemu_riscv32/tests/crypto/test_ecc_dh/test/qemu.log-------------------
***** BOOTING ZEPHYR OS v1.6.99 - BUILD: Feb 1 2017 00:42:09 *****
tc_start() - TinyCrypt ECC DH tests

Vector #00 check Z - FAILURE
[FAIL] Test #1: ECDH - NIST-p256
===================================================================
FAIL - main.
===================================================================
PROJECT EXECUTION FAILED
-------------------sanity-out/qemu_riscv32/tests/crypto/test_ecc_dh/test/qemu.log-------------------
0 of 1 tests passed with 0 warnings in 5 seconds
Build step 'Execute shell' marked build as failure


zephyr/master: daily build zephyr-kernel-1.6.99-170201-f5b3e2a Failure

donotreply@...
 

zephyr/master: daily build zephyr-kernel-1.6.99-170201-f5b3e2a Failure



job zephyr-sanity build number 428 failed
see: https://jenkins.zephyrproject.org/job/zephyr-sanity/428/

===================================================================
PASS - test_mpool_alloc_free_thread.
tc_start() - test_mpool_alloc_free_isr
ASSERTION FAIL [!(_kernel.nested != 0)] @ /w/workspace/zephyr-sanity/kernel/include/ksched.h:237:
---------------sanity-out/qemu_x86/tests/kernel/mem_pool/test_mpool_api/test/qemu.log---------------
qemu_x86_iamcu tests/kernel/mem_pool/test_mpool_api/test FAILED: timeout
------------sanity-out/qemu_x86_iamcu/tests/kernel/mem_pool/test_mpool_api/test/qemu.log------------
***** BOOTING ZEPHYR OS v1.6.99 - BUILD: Feb 2 2017 00:34:19 *****
Running test suite test_mpool_api
tc_start() - test_mpool_alloc_free_thread
===================================================================
PASS - test_mpool_alloc_free_thread.
tc_start() - test_mpool_alloc_free_isr
ASSERTION FAIL [!(_kernel.nested != 0)] @ /w/workspace/zephyr-sanity/kernel/include/ksched.h:237:
------------sanity-out/qemu_x86_iamcu/tests/kernel/mem_pool/test_mpool_api/test/qemu.log------------
qemu_nios2 tests/kernel/pipe/test_pipe_api/test FAILED: timeout
----------------sanity-out/qemu_nios2/tests/kernel/pipe/test_pipe_api/test/qemu.log-----------------
Running test suite test_pipe_api
tc_start() - test_pipe_thread2thread
===================================================================
PASS - test_pipe_thread2thread.
tc_start() - test_pipe_thread2isr
ASSERTION FAIL [!(_kernel.nested != 0)] @ /w/workspace/zephyr-sanity/kernel/include/ksched.h:237:
----------------sanity-out/qemu_nios2/tests/kernel/pipe/test_pipe_api/test/qemu.log-----------------
0 of 47 tests passed with 0 warnings in 195 seconds
Extra environment setting:
CONFIG_ASSERT=y
CONFIG_DEBUG=y
Build step 'Execute shell' marked build as failure


job zephyr-sanity build number 427 failed
see: https://jenkins.zephyrproject.org/job/zephyr-sanity/427/

GDT= 00100070 00000017
IDT= 00103c70 000007ff
CR0=0000003f CR2=00000000 CR3=00000000 CR4=00000000
DR0=00000000 DR1=00000000 DR2=00000000 DR3=00000000
DR6=ffff0ff0 DR7=00000400
CCS=00000000 CCD=00000030 CCO=ADDB
EFER=0000000000000000
FCW=037f FSW=0000 [ST=0] FTW=00 MXCSR=00001f80
FPR0=0000000000000000 0000 FPR1=0000000000000000 0000
FPR2=0000000000000000 0000 FPR3=0000000000000000 0000
FPR4=0000000000000000 0000 FPR5=0000000000000000 0000
FPR6=0000000000000000 0000 FPR7=0000000000000000 0000
XMM00=00000000000000000000000000000000 XMM01=00000000000000000000000000000000
XMM02=00000000000000000000000000000000 XMM03=00000000000000000000000000000000
XMM04=00000000000000000000000000000000 XMM05=00000000000000000000000000000000
XMM06=00000000000000000000000000000000 XMM07=00000000000000000000000000000000
make[3]: *** [run] Aborted (core dumped)
make[3]: Target `qemu' not remade because of errors.
make[3]: Leaving directory `/w/workspace/zephyr-sanity/sanity-out/qemu_x86/tests/kernel/context/test'
make[2]: *** [sub-make] Error 2
make[2]: Target `qemu' not remade because of errors.
make[2]: Leaving directory `/w/workspace/zephyr-sanity'
make[1]: *** [qemu] Error 2
make[1]: Leaving directory `/w/workspace/zephyr-sanity/tests/kernel/context'
-----------------------sanity-out/qemu_x86/tests/kernel/context/test/run.log------------------------
0 of 32 tests passed with 0 warnings in 62 seconds
Extra environment setting:
CONFIG_DEBUG=y
Build step 'Execute shell' marked build as failure


job zephyr-sanity build number 426 failed
see: https://jenkins.zephyrproject.org/job/zephyr-sanity/426/

--------------sanity-out/qemu_x86_iamcu/tests/kernel/pipe/test_pipe_api/test/qemu.log---------------
Running test suite test_pipe_api
tc_start() - test_pipe_thread2thread
===================================================================
PASS - test_pipe_thread2thread.
tc_start() - test_pipe_thread2isr
ASSERTION FAIL [!(_kernel.nested != 0)] @ /w/workspace/zephyr-sanity/kernel/include/ksched.h:237:
Generating LALR tables
Platform 'sam_e70_xplained' not specified in any arch .ini file and will not be tested
--------------sanity-out/qemu_x86_iamcu/tests/kernel/pipe/test_pipe_api/test/qemu.log---------------
qemu_cortex_m3 tests/kernel/timer/timer_api/test FAILED: timeout
----------------sanity-out/qemu_cortex_m3/tests/kernel/timer/timer_api/test/qemu.log----------------
Running test suite test_timer_api
tc_start() - test_timer_duration_period
ASSERTION FAIL [!_IsInIsr()] @ /w/workspace/zephyr-sanity/kernel/timer.c:134:
----------------sanity-out/qemu_cortex_m3/tests/kernel/timer/timer_api/test/qemu.log----------------
qemu_cortex_m3 tests/kernel/pipe/test_pipe_api/test FAILED: timeout
--------------sanity-out/qemu_cortex_m3/tests/kernel/pipe/test_pipe_api/test/qemu.log---------------
Running test suite test_pipe_api
tc_start() - test_pipe_thread2thread
===================================================================
PASS - test_pipe_thread2thread.
tc_start() - test_pipe_thread2isr
ASSERTION FAIL [!_IsInIsr()] @ /w/workspace/zephyr-sanity/kernel/include/ksched.h:237:
--------------sanity-out/qemu_cortex_m3/tests/kernel/pipe/test_pipe_api/test/qemu.log---------------
0 of 16 tests passed with 0 warnings in 85 seconds
Extra environment setting:
CONFIG_ASSERT=y
Build step 'Execute shell' marked build as failure


job zephyr-sanity build number 425 failed
see: https://jenkins.zephyrproject.org/job/zephyr-sanity/425/

[FAIL] Test #1: ECDH - NIST-p256
===================================================================
FAIL - main.
===================================================================
PROJECT EXECUTION FAILED
-------------------sanity-out/qemu_riscv32/tests/crypto/test_ecc_dh/test/qemu.log-------------------
0 of 1 tests passed with 0 warnings in 1270 seconds
Invalid sanity, let's retry #2
sanitycheck --inline-logs +scripts/sanity_chk/sanity_daily.args --only-failed
Generating LALR tables
Platform 'sam_e70_xplained' not specified in any arch .ini file and will not be tested
Cleaning output directory /w/workspace/zephyr-sanity/sanity-out
Selecting all possible platforms per test case
Building testcase defconfigs...
1 tests selected, 11923 tests discarded due to filters
qemu_riscv32 tests/crypto/test_ecc_dh/test FAILED: failed
-------------------sanity-out/qemu_riscv32/tests/crypto/test_ecc_dh/test/qemu.log-------------------
***** BOOTING ZEPHYR OS v1.6.99 - BUILD: Feb 2 2017 00:41:58 *****
tc_start() - TinyCrypt ECC DH tests

Vector #01 check Z - FAILURE
[FAIL] Test #1: ECDH - NIST-p256
===================================================================
FAIL - main.
===================================================================
PROJECT EXECUTION FAILED
-------------------sanity-out/qemu_riscv32/tests/crypto/test_ecc_dh/test/qemu.log-------------------
0 of 1 tests passed with 0 warnings in 4 seconds
Build step 'Execute shell' marked build as failure


zephyr/master: daily build zephyr-kernel-1.6.99-170202-4fc9606 Failure

donotreply@...
 

zephyr/master: daily build zephyr-kernel-1.6.99-170202-4fc9606 Failure



job zephyr-sanity build number 432 failed
see: https://jenkins.zephyrproject.org/job/zephyr-sanity/432/

***** BOOTING ZEPHYR OS v1.6.99 - BUILD: Feb 3 2017 00:43:28 *****
Running test suite test_mpool_api
tc_start() - test_mpool_alloc_free_thread
===================================================================
PASS - test_mpool_alloc_free_thread.
tc_start() - test_mpool_alloc_free_isr
ASSERTION FAIL [!(_kernel.nested != 0)] @ /w/workspace/zephyr-sanity/kernel/include/ksched.h:237:
--------------sanity-out/qemu_nios2/tests/kernel/mem_pool/test_mpool_api/test/qemu.log--------------
qemu_x86_iamcu tests/kernel/pipe/test_pipe_api/test FAILED: timeout
--------------sanity-out/qemu_x86_iamcu/tests/kernel/pipe/test_pipe_api/test/qemu.log---------------
Running test suite test_pipe_api
tc_start() - test_pipe_thread2thread
===================================================================
PASS - test_pipe_thread2thread.
tc_start() - test_pipe_thread2isr
ASSERTION FAIL [!(_kernel.nested != 0)] @ /w/workspace/zephyr-sanity/kernel/include/ksched.h:237:
--------------sanity-out/qemu_x86_iamcu/tests/kernel/pipe/test_pipe_api/test/qemu.log---------------
qemu_riscv32 tests/kernel/timer/timer_api/test FAILED: timeout
-----------------sanity-out/qemu_riscv32/tests/kernel/timer/timer_api/test/qemu.log-----------------
***** BOOTING ZEPHYR OS v1.6.99 *****
Running test suite test_timer_api
tc_start() - test_timer_duration_period
ASSERTION FAIL [!(_kernel.nested != 0)] @ /w/workspace/zephyr-sanity/kernel/timer.c:134:
-----------------sanity-out/qemu_riscv32/tests/kernel/timer/timer_api/test/qemu.log-----------------
0 of 47 tests passed with 0 warnings in 198 seconds
Extra environment setting:
CONFIG_ASSERT=y
CONFIG_DEBUG=y
Build step 'Execute shell' marked build as failure


job zephyr-sanity build number 431 failed
see: https://jenkins.zephyrproject.org/job/zephyr-sanity/431/

CC ext/lib/crypto/mbedtls/library/x509_create.o
CC ext/lib/crypto/mbedtls/library/x509_crl.o
CC ext/lib/crypto/mbedtls/library/x509_crt.o
CC ext/lib/crypto/mbedtls/library/x509_csr.o
CC ext/lib/crypto/mbedtls/library/x509write_crt.o
CC ext/lib/crypto/mbedtls/library/x509write_csr.o
CC ext/lib/crypto/mbedtls/library/xtea.o
make[7]: Target `__build' not remade because of errors.
make[6]: *** [ext/lib/crypto/mbedtls] Error 2
make[6]: Target `__build' not remade because of errors.
make[5]: *** [ext/lib/crypto] Error 2
make[5]: Target `__build' not remade because of errors.
make[4]: *** [ext/lib] Error 2
make[4]: Target `__build' not remade because of errors.
make[3]: *** [ext] Error 2
make[3]: Target `all' not remade because of errors.
make[3]: Leaving directory `/w/workspace/zephyr-sanity/sanity-out/quark_se_c1000_devboard/tests/crypto/test_mbedtls/test'
make[2]: *** [sub-make] Error 2
make[2]: Target `all' not remade because of errors.
make[2]: Leaving directory `/w/workspace/zephyr-sanity'
make[1]: *** [all] Error 2
make[1]: Leaving directory `/w/workspace/zephyr-sanity/tests/crypto/test_mbedtls'
Generating LALR tables
Platform 'sam_e70_xplained' not specified in any arch .ini file and will not be tested
------------sanity-out/quark_se_c1000_devboard/tests/crypto/test_mbedtls/test/build.log-------------
0 of 32 tests passed with 0 warnings in 62 seconds
Extra environment setting:
CONFIG_DEBUG=y
Build step 'Execute shell' marked build as failure


job zephyr-sanity build number 430 failed
see: https://jenkins.zephyrproject.org/job/zephyr-sanity/430/

Running test suite test_timer_api
tc_start() - test_timer_duration_period
ASSERTION FAIL [!_IsInIsr()] @ /w/workspace/zephyr-sanity/kernel/timer.c:134:
Generating LALR tables
Platform 'sam_e70_xplained' not specified in any arch .ini file and will not be tested
----------------sanity-out/qemu_cortex_m3/tests/kernel/timer/timer_api/test/qemu.log----------------
qemu_cortex_m3 tests/kernel/mem_pool/test_mpool_api/test FAILED: timeout
------------sanity-out/qemu_cortex_m3/tests/kernel/mem_pool/test_mpool_api/test/qemu.log------------
***** BOOTING ZEPHYR OS v1.6.99 - BUILD: Feb 3 2017 00:49:41 *****
Running test suite test_mpool_api
tc_start() - test_mpool_alloc_free_thread
===================================================================
PASS - test_mpool_alloc_free_thread.
tc_start() - test_mpool_alloc_free_isr
ASSERTION FAIL [!_IsInIsr()] @ /w/workspace/zephyr-sanity/kernel/include/ksched.h:237:
------------sanity-out/qemu_cortex_m3/tests/kernel/mem_pool/test_mpool_api/test/qemu.log------------
qemu_cortex_m3 tests/kernel/pipe/test_pipe_api/test FAILED: timeout
--------------sanity-out/qemu_cortex_m3/tests/kernel/pipe/test_pipe_api/test/qemu.log---------------
Running test suite test_pipe_api
tc_start() - test_pipe_thread2thread
===================================================================
PASS - test_pipe_thread2thread.
tc_start() - test_pipe_thread2isr
ASSERTION FAIL [!_IsInIsr()] @ /w/workspace/zephyr-sanity/kernel/include/ksched.h:237:
--------------sanity-out/qemu_cortex_m3/tests/kernel/pipe/test_pipe_api/test/qemu.log---------------
0 of 16 tests passed with 0 warnings in 89 seconds
Extra environment setting:
CONFIG_ASSERT=y
Build step 'Execute shell' marked build as failure


job zephyr-sanity build number 429 failed
see: https://jenkins.zephyrproject.org/job/zephyr-sanity/429/

===================================================================
FAIL - main.
===================================================================
PROJECT EXECUTION FAILED
-------------------sanity-out/qemu_riscv32/tests/crypto/test_ecc_dh/test/qemu.log-------------------
qemu_riscv32 tests/legacy/kernel/test_sleep/test PASSED
1 of 2 tests passed with 0 warnings in 1326 seconds
Invalid sanity, let's retry #2
sanitycheck --inline-logs +scripts/sanity_chk/sanity_daily.args --only-failed
Generating LALR tables
Platform 'sam_e70_xplained' not specified in any arch .ini file and will not be tested
Cleaning output directory /w/workspace/zephyr-sanity/sanity-out
Selecting all possible platforms per test case
Building testcase defconfigs...
1 tests selected, 12003 tests discarded due to filters
qemu_riscv32 tests/crypto/test_ecc_dh/test FAILED: failed
-------------------sanity-out/qemu_riscv32/tests/crypto/test_ecc_dh/test/qemu.log-------------------
***** BOOTING ZEPHYR OS v1.6.99 - BUILD: Feb 3 2017 00:49:33 *****
tc_start() - TinyCrypt ECC DH tests

Vector #00 check Z - FAILURE
[FAIL] Test #1: ECDH - NIST-p256
===================================================================
FAIL - main.
===================================================================
PROJECT EXECUTION FAILED
-------------------sanity-out/qemu_riscv32/tests/crypto/test_ecc_dh/test/qemu.log-------------------
0 of 1 tests passed with 0 warnings in 4 seconds
Build step 'Execute shell' marked build as failure


zephyr/master: daily build zephyr-kernel-1.6.99-170203-aa58ba2 Failure

donotreply@...
 

zephyr/master: daily build zephyr-kernel-1.6.99-170203-aa58ba2 Failure



job zephyr-sanity build number 436 failed
see: https://jenkins.zephyrproject.org/job/zephyr-sanity/436/

eflags: 0x2
Fatal fault in thread 0x001106a0! Aborting.
***** CPU exception 7
Current thread ID = 0x001106a0
Faulting segment:address = 0x8:0x10e17c
eax: 0x10e17c, ebx: 0x1106a0, ecx: 0x3f8, edx: 0x3f8
esi: 0x6, edi: 0x2, ebp: 0110110, esp: 0x110104
eflags: 0x2
Fatal fault in thread 0x001106a0! Aborting.
***** CPU exception 7
Current thread ID = 0x001106a0
Faulting segment:address = 0x8:0x10e17c
eax: 0x10e17c, ebx: 0x1106a0, ecx: 0x3f8, edx: 0x3f8
esi: 0x6, edi: 0x2, ebp: 010fff8, esp: 0x10ffec
eflags: 0x2
Fatal fault in thread 0x001106a0! Aborting.
***** CPU exception 7
Current thread ID = 0x001106a0
Faulting segment:address = 0x8:0x10e17c
eax: 0x10e17c, ebx: 0x1106a0, ecx: 0x3f8, edx: 0x3f8
esi: 0x6, edi: 0x2, ebp: 010fee0, esp: 0x10fed4
eflags: 0x2
Fatal fault in ISR! Spinning...
--------------------------sanity-out/qemu_x86/tests/net/udp/test/qemu.log---------------------------
0 of 136 tests passed with 0 warnings in 208 seconds
Extra environment setting:
CONFIG_ASSERT=y
CONFIG_DEBUG=y
Build step 'Execute shell' marked build as failure


job zephyr-sanity build number 435 failed
see: https://jenkins.zephyrproject.org/job/zephyr-sanity/435/

make[5]: Target `__build' not remade because of errors.
make[4]: *** [drivers/timer] Error 2
make[4]: Target `__build' not remade because of errors.
make[3]: *** [drivers] Error 2
AR kernel/lib.a
make[3]: Target `all' not remade because of errors.
make[3]: Leaving directory `/w/workspace/zephyr-sanity/sanity-out/zedboard_pulpino/tests/legacy/kernel/test_nano_work/test'
make[2]: *** [sub-make] Error 2
make[2]: Target `all' not remade because of errors.
make[2]: Leaving directory `/w/workspace/zephyr-sanity'
make[1]: *** [all] Error 2
make[1]: Leaving directory `/w/workspace/zephyr-sanity/tests/legacy/kernel/test_nano_work'
-----------sanity-out/zedboard_pulpino/tests/legacy/kernel/test_nano_work/test/build.log------------
qemu_x86 tests/net/udp/test FAILED: timeout
--------------------------sanity-out/qemu_x86/tests/net/udp/test/qemu.log---------------------------
***** BOOTING ZEPHYR OS v1.6.99 - BUILD: Feb 4 2017 01:26:24 *****
***** CPU exception 13
***** Exception code: 0xd65c
Current thread ID = 0x0010fb80
Faulting segment:address = 0x8:0x10fbac
eax: 0x1102c8, ebx: 0x10d606, ecx: 0x10d66c, edx: 0xffffff7f
esi: 0x0, edi: 0x0, ebp: 0fffffff5, esp: 0x10fb64
eflags: 0x282
Fatal fault in thread 0x0010fb80! Aborting.
--------------------------sanity-out/qemu_x86/tests/net/udp/test/qemu.log---------------------------
1 of 122 tests passed with 0 warnings in 134 seconds
Extra environment setting:
CONFIG_DEBUG=y
Build step 'Execute shell' marked build as failure


job zephyr-sanity build number 434 failed
see: https://jenkins.zephyrproject.org/job/zephyr-sanity/434/

ASSERTION FAIL [!(_kernel.nested != 0)] @ /w/workspace/zephyr-sanity/kernel/include/ksched.h:237:
---------------sanity-out/qemu_riscv32/tests/kernel/pipe/test_pipe_api/test/qemu.log----------------
qemu_nios2 tests/kernel/timer/timer_api/test FAILED: timeout
------------------sanity-out/qemu_nios2/tests/kernel/timer/timer_api/test/qemu.log------------------
Running test suite test_timer_api
tc_start() - test_timer_duration_period
ASSERTION FAIL [!(_kernel.nested != 0)] @ /w/workspace/zephyr-sanity/kernel/timer.c:134:
------------------sanity-out/qemu_nios2/tests/kernel/timer/timer_api/test/qemu.log------------------
qemu_x86 tests/kernel/mem_pool/test_mpool_api/test FAILED: timeout
---------------sanity-out/qemu_x86/tests/kernel/mem_pool/test_mpool_api/test/qemu.log---------------
***** BOOTING ZEPHYR OS v1.6.99 - BUILD: Feb 4 2017 01:29:52 *****
Running test suite test_mpool_api
tc_start() - test_mpool_alloc_free_thread
===================================================================
PASS - test_mpool_alloc_free_thread.
tc_start() - test_mpool_alloc_free_isr
ASSERTION FAIL [!(_kernel.nested != 0)] @ /w/workspace/zephyr-sanity/kernel/include/ksched.h:237:
---------------sanity-out/qemu_x86/tests/kernel/mem_pool/test_mpool_api/test/qemu.log---------------
qemu_riscv32 tests/kernel/timer/timer_api/test FAILED: timeout
-----------------sanity-out/qemu_riscv32/tests/kernel/timer/timer_api/test/qemu.log-----------------
***** BOOTING ZEPHYR OS v1.6.99 *****
Running test suite test_timer_api
tc_start() - test_timer_duration_period
ASSERTION FAIL [!(_kernel.nested != 0)] @ /w/workspace/zephyr-sanity/kernel/timer.c:134:
-----------------sanity-out/qemu_riscv32/tests/kernel/timer/timer_api/test/qemu.log-----------------
0 of 104 tests passed with 0 warnings in 171 seconds
Extra environment setting:
CONFIG_ASSERT=y
Build step 'Execute shell' marked build as failure


zephyr/master: daily build zephyr-kernel-1.6.99-170204-fd74c0c Failure

donotreply@...
 

zephyr/master: daily build zephyr-kernel-1.6.99-170204-fd74c0c Failure



job zephyr-sanity build number 440 failed
see: https://jenkins.zephyrproject.org/job/zephyr-sanity/440/

===================================================================
PASS - test_mpool_alloc_free_thread.
tc_start() - test_mpool_alloc_free_isr
ASSERTION FAIL [!(_kernel.nested != 0)] @ /w/workspace/zephyr-sanity/kernel/include/ksched.h:237:
-------------sanity-out/qemu_riscv32/tests/kernel/mem_pool/test_mpool_api/test/qemu.log-------------
qemu_x86 tests/kernel/pipe/test_pipe_api/test FAILED: timeout
-----------------sanity-out/qemu_x86/tests/kernel/pipe/test_pipe_api/test/qemu.log------------------
Running test suite test_pipe_api
tc_start() - test_pipe_thread2thread
===================================================================
PASS - test_pipe_thread2thread.
tc_start() - test_pipe_thread2isr
ASSERTION FAIL [!(_kernel.nested != 0)] @ /w/workspace/zephyr-sanity/kernel/include/ksched.h:237:
-----------------sanity-out/qemu_x86/tests/kernel/pipe/test_pipe_api/test/qemu.log------------------
qemu_x86_iamcu tests/kernel/mem_pool/test_mpool_api/test FAILED: timeout
------------sanity-out/qemu_x86_iamcu/tests/kernel/mem_pool/test_mpool_api/test/qemu.log------------
***** BOOTING ZEPHYR OS v1.6.99 - BUILD: Feb 5 2017 01:28:14 *****
Running test suite test_mpool_api
tc_start() - test_mpool_alloc_free_thread
===================================================================
PASS - test_mpool_alloc_free_thread.
tc_start() - test_mpool_alloc_free_isr
ASSERTION FAIL [!(_kernel.nested != 0)] @ /w/workspace/zephyr-sanity/kernel/include/ksched.h:237:
------------sanity-out/qemu_x86_iamcu/tests/kernel/mem_pool/test_mpool_api/test/qemu.log------------
0 of 133 tests passed with 0 warnings in 201 seconds
Extra environment setting:
CONFIG_ASSERT=y
CONFIG_DEBUG=y
Build step 'Execute shell' marked build as failure


job zephyr-sanity build number 439 failed
see: https://jenkins.zephyrproject.org/job/zephyr-sanity/439/

make[4]: Target `__build' not remade because of errors.
make[3]: *** [drivers] Error 2
LD kernel/built-in.o
AR kernel/lib.a
make[3]: Target `all' not remade because of errors.
make[3]: Leaving directory `/w/workspace/zephyr-sanity/sanity-out/zedboard_pulpino/tests/crypto/test_ecc_dh/test'
make[2]: *** [sub-make] Error 2
make[2]: Target `all' not remade because of errors.
make[2]: Leaving directory `/w/workspace/zephyr-sanity'
make[1]: *** [all] Error 2
make[1]: Leaving directory `/w/workspace/zephyr-sanity/tests/crypto/test_ecc_dh'
Generating LALR tables
----------------sanity-out/zedboard_pulpino/tests/crypto/test_ecc_dh/test/build.log-----------------
qemu_x86 tests/net/udp/test FAILED: timeout
--------------------------sanity-out/qemu_x86/tests/net/udp/test/qemu.log---------------------------
***** BOOTING ZEPHYR OS v1.6.99 - BUILD: Feb 5 2017 01:17:55 *****
***** CPU exception 13
***** Exception code: 0xd65c
Current thread ID = 0x0010fb80
Faulting segment:address = 0x8:0x10fbac
eax: 0x1102c8, ebx: 0x10d606, ecx: 0x10d66c, edx: 0xffffff7f
esi: 0x0, edi: 0x0, ebp: 0fffffff5, esp: 0x10fb64
eflags: 0x282
Fatal fault in thread 0x0010fb80! Aborting.
--------------------------sanity-out/qemu_x86/tests/net/udp/test/qemu.log---------------------------
0 of 124 tests passed with 0 warnings in 137 seconds
Extra environment setting:
CONFIG_DEBUG=y
Build step 'Execute shell' marked build as failure


job zephyr-sanity build number 438 failed
see: https://jenkins.zephyrproject.org/job/zephyr-sanity/438/

tc_start() - test_mpool_alloc_free_thread
===================================================================
PASS - test_mpool_alloc_free_thread.
tc_start() - test_mpool_alloc_free_isr
ASSERTION FAIL [!(_kernel.nested != 0)] @ /w/workspace/zephyr-sanity/kernel/include/ksched.h:237:
------------sanity-out/qemu_x86_iamcu/tests/kernel/mem_pool/test_mpool_api/test/qemu.log------------
qemu_x86 tests/kernel/mem_pool/test_mpool_api/test FAILED: timeout
---------------sanity-out/qemu_x86/tests/kernel/mem_pool/test_mpool_api/test/qemu.log---------------
***** BOOTING ZEPHYR OS v1.6.99 - BUILD: Feb 5 2017 01:16:59 *****
Running test suite test_mpool_api
tc_start() - test_mpool_alloc_free_thread
===================================================================
PASS - test_mpool_alloc_free_thread.
tc_start() - test_mpool_alloc_free_isr
ASSERTION FAIL [!(_kernel.nested != 0)] @ /w/workspace/zephyr-sanity/kernel/include/ksched.h:237:
---------------sanity-out/qemu_x86/tests/kernel/mem_pool/test_mpool_api/test/qemu.log---------------
qemu_cortex_m3 tests/kernel/pipe/test_pipe_api/test FAILED: timeout
--------------sanity-out/qemu_cortex_m3/tests/kernel/pipe/test_pipe_api/test/qemu.log---------------
Running test suite test_pipe_api
tc_start() - test_pipe_thread2thread
===================================================================
PASS - test_pipe_thread2thread.
tc_start() - test_pipe_thread2isr
ASSERTION FAIL [!_IsInIsr()] @ /w/workspace/zephyr-sanity/kernel/include/ksched.h:237:
--------------sanity-out/qemu_cortex_m3/tests/kernel/pipe/test_pipe_api/test/qemu.log---------------
0 of 100 tests passed with 0 warnings in 168 seconds
Extra environment setting:
CONFIG_ASSERT=y
Build step 'Execute shell' marked build as failure


job zephyr-sanity build number 437 failed
see: https://jenkins.zephyrproject.org/job/zephyr-sanity/437/

CC kernel/work_q.o
/w/workspace/zephyr-sanity/drivers/timer/riscv_machine_timer.c:19:27: error: ‘RISCV_MTIME_BASE’ undeclared here (not in a function)
(riscv_machine_timer_t *)RISCV_MTIME_BASE;
^~~~~~~~~~~~~~~~
/w/workspace/zephyr-sanity/drivers/timer/riscv_machine_timer.c:21:27: error: ‘RISCV_MTIMECMP_BASE’ undeclared here (not in a function)
(riscv_machine_timer_t *)RISCV_MTIMECMP_BASE;
^~~~~~~~~~~~~~~~~~~
/w/workspace/zephyr-sanity/drivers/timer/riscv_machine_timer.c: In function ‘_sys_clock_driver_init’:
/w/workspace/zephyr-sanity/drivers/timer/riscv_machine_timer.c:78:18: error: ‘RISCV_MACHINE_TIMER_IRQ’ undeclared (first use in this function)
IRQ_CONNECT(RISCV_MACHINE_TIMER_IRQ, 0,
^~~~~~~~~~~~~~~~~~~~~~~
/w/workspace/zephyr-sanity/drivers/timer/riscv_machine_timer.c:78:18: note: each undeclared identifier is reported only once for each function it appears in
make[5]: *** [drivers/timer/riscv_machine_timer.o] Error 1
make[5]: Target `__build' not remade because of errors.
make[4]: *** [drivers/timer] Error 2
make[4]: Target `__build' not remade because of errors.
make[3]: *** [drivers] Error 2
LD kernel/built-in.o
AR kernel/lib.a
make[3]: Target `all' not remade because of errors.
make[3]: Leaving directory `/w/workspace/zephyr-sanity/sanity-out/zedboard_pulpino/tests/legacy/kernel/test_fifo/microkernel/test'
make[2]: *** [sub-make] Error 2
make[2]: Target `all' not remade because of errors.
make[2]: Leaving directory `/w/workspace/zephyr-sanity'
make[1]: *** [all] Error 2
make[1]: Leaving directory `/w/workspace/zephyr-sanity/tests/legacy/kernel/test_fifo/microkernel'
--------sanity-out/zedboard_pulpino/tests/legacy/kernel/test_fifo/microkernel/test/build.log--------
0 of 90 tests passed with 0 warnings in 66 seconds
Build step 'Execute shell' marked build as failure


zephyr/master: daily build zephyr-kernel-1.6.99-170205-fd74c0c Failure

donotreply@...
 

zephyr/master: daily build zephyr-kernel-1.6.99-170205-fd74c0c Failure



job zephyr-sanity build number 444 failed
see: https://jenkins.zephyrproject.org/job/zephyr-sanity/444/

===================================================================
PASS - test_mpool_alloc_free_thread.
tc_start() - test_mpool_alloc_free_isr
ASSERTION FAIL [!(_kernel.nested != 0)] @ /w/workspace/zephyr-sanity/kernel/include/ksched.h:237:
------------sanity-out/qemu_x86_iamcu/tests/kernel/mem_pool/test_mpool_api/test/qemu.log------------
qemu_nios2 tests/kernel/pipe/test_pipe_api/test FAILED: timeout
----------------sanity-out/qemu_nios2/tests/kernel/pipe/test_pipe_api/test/qemu.log-----------------
Running test suite test_pipe_api
tc_start() - test_pipe_thread2thread
===================================================================
PASS - test_pipe_thread2thread.
tc_start() - test_pipe_thread2isr
ASSERTION FAIL [!(_kernel.nested != 0)] @ /w/workspace/zephyr-sanity/kernel/include/ksched.h:237:
----------------sanity-out/qemu_nios2/tests/kernel/pipe/test_pipe_api/test/qemu.log-----------------
qemu_riscv32 tests/kernel/mem_pool/test_mpool_api/test FAILED: timeout
-------------sanity-out/qemu_riscv32/tests/kernel/mem_pool/test_mpool_api/test/qemu.log-------------
***** BOOTING ZEPHYR OS v1.6.99 - BUILD: Feb 6 2017 01:30:37 *****
Running test suite test_mpool_api
tc_start() - test_mpool_alloc_free_thread
===================================================================
PASS - test_mpool_alloc_free_thread.
tc_start() - test_mpool_alloc_free_isr
ASSERTION FAIL [!(_kernel.nested != 0)] @ /w/workspace/zephyr-sanity/kernel/include/ksched.h:237:
-------------sanity-out/qemu_riscv32/tests/kernel/mem_pool/test_mpool_api/test/qemu.log-------------
0 of 133 tests passed with 0 warnings in 197 seconds
Extra environment setting:
CONFIG_ASSERT=y
CONFIG_DEBUG=y
Build step 'Execute shell' marked build as failure


job zephyr-sanity build number 443 failed
see: https://jenkins.zephyrproject.org/job/zephyr-sanity/443/

XMM00=00000000000000000000000000000000 XMM01=00000000000000000000000000000000
XMM02=00000000000000000000000000000000 XMM03=00000000000000000000000000000000
XMM04=00000000000000000000000000000000 XMM05=00000000000000000000000000000000
XMM06=00000000000000000000000000000000 XMM07=00000000000000000000000000000000
make[3]: *** [run] Aborted (core dumped)
make[3]: Target `qemu' not remade because of errors.
make[3]: Leaving directory `/w/workspace/zephyr-sanity/sanity-out/qemu_x86/tests/legacy/kernel/test_sema/nanokernel/test'
make[2]: *** [sub-make] Error 2
make[2]: Target `qemu' not remade because of errors.
make[2]: Leaving directory `/w/workspace/zephyr-sanity'
make[1]: *** [qemu] Error 2
make[1]: Leaving directory `/w/workspace/zephyr-sanity/tests/legacy/kernel/test_sema/nanokernel'
-------------sanity-out/qemu_x86/tests/legacy/kernel/test_sema/nanokernel/test/run.log--------------
qemu_x86 tests/net/udp/test FAILED: timeout
--------------------------sanity-out/qemu_x86/tests/net/udp/test/qemu.log---------------------------
***** BOOTING ZEPHYR OS v1.6.99 - BUILD: Feb 6 2017 01:23:04 *****
***** CPU exception 13
***** Exception code: 0xd65c
Current thread ID = 0x0010fb80
Faulting segment:address = 0x8:0x10fbac
eax: 0x1102c8, ebx: 0x10d606, ecx: 0x10d66c, edx: 0xffffff7f
esi: 0x0, edi: 0x0, ebp: 0fffffff5, esp: 0x10fb64
eflags: 0x282
Fatal fault in thread 0x0010fb80! Aborting.
--------------------------sanity-out/qemu_x86/tests/net/udp/test/qemu.log---------------------------
0 of 123 tests passed with 0 warnings in 124 seconds
Extra environment setting:
CONFIG_DEBUG=y
Build step 'Execute shell' marked build as failure


job zephyr-sanity build number 442 failed
see: https://jenkins.zephyrproject.org/job/zephyr-sanity/442/

===================================================================
PASS - test_pipe_thread2thread.
tc_start() - test_pipe_thread2isr
ASSERTION FAIL [!_IsInIsr()] @ /w/workspace/zephyr-sanity/kernel/include/ksched.h:237:
--------------sanity-out/qemu_cortex_m3/tests/kernel/pipe/test_pipe_api/test/qemu.log---------------
qemu_riscv32 tests/kernel/mem_pool/test_mpool_api/test FAILED: timeout
-------------sanity-out/qemu_riscv32/tests/kernel/mem_pool/test_mpool_api/test/qemu.log-------------
***** BOOTING ZEPHYR OS v1.6.99 - BUILD: Feb 6 2017 01:37:02 *****
Running test suite test_mpool_api
tc_start() - test_mpool_alloc_free_thread
===================================================================
PASS - test_mpool_alloc_free_thread.
tc_start() - test_mpool_alloc_free_isr
ASSERTION FAIL [!(_kernel.nested != 0)] @ /w/workspace/zephyr-sanity/kernel/include/ksched.h:237:
-------------sanity-out/qemu_riscv32/tests/kernel/mem_pool/test_mpool_api/test/qemu.log-------------
qemu_cortex_m3 tests/kernel/mem_pool/test_mpool_api/test FAILED: timeout
------------sanity-out/qemu_cortex_m3/tests/kernel/mem_pool/test_mpool_api/test/qemu.log------------
***** BOOTING ZEPHYR OS v1.6.99 - BUILD: Feb 6 2017 01:37:06 *****
Running test suite test_mpool_api
tc_start() - test_mpool_alloc_free_thread
===================================================================
PASS - test_mpool_alloc_free_thread.
tc_start() - test_mpool_alloc_free_isr
ASSERTION FAIL [!_IsInIsr()] @ /w/workspace/zephyr-sanity/kernel/include/ksched.h:237:
------------sanity-out/qemu_cortex_m3/tests/kernel/mem_pool/test_mpool_api/test/qemu.log------------
0 of 100 tests passed with 0 warnings in 170 seconds
Extra environment setting:
CONFIG_ASSERT=y
Build step 'Execute shell' marked build as failure


job zephyr-sanity build number 441 failed
see: https://jenkins.zephyrproject.org/job/zephyr-sanity/441/

/w/workspace/zephyr-sanity/drivers/timer/riscv_machine_timer.c: In function ‘_sys_clock_driver_init’:
/w/workspace/zephyr-sanity/drivers/timer/riscv_machine_timer.c:78:18: error: ‘RISCV_MACHINE_TIMER_IRQ’ undeclared (first use in this function)
IRQ_CONNECT(RISCV_MACHINE_TIMER_IRQ, 0,
^~~~~~~~~~~~~~~~~~~~~~~
/w/workspace/zephyr-sanity/drivers/timer/riscv_machine_timer.c:78:18: note: each undeclared identifier is reported only once for each function it appears in
CC kernel/sys_clock.o
make[5]: *** [drivers/timer/riscv_machine_timer.o] Error 1
make[5]: Target `__build' not remade because of errors.
make[4]: *** [drivers/timer] Error 2
make[4]: Target `__build' not remade because of errors.
make[3]: *** [drivers] Error 2
CC kernel/system_work_q.o
CC kernel/thread.o
CC kernel/thread_abort.o
CC kernel/timer.o
CC kernel/work_q.o
LD kernel/built-in.o
AR kernel/lib.a
make[3]: Target `all' not remade because of errors.
make[3]: Leaving directory `/w/workspace/zephyr-sanity/sanity-out/zedboard_pulpino/tests/kernel/timer/timer_api/test'
make[2]: *** [sub-make] Error 2
make[2]: Target `all' not remade because of errors.
make[2]: Leaving directory `/w/workspace/zephyr-sanity'
make[1]: *** [all] Error 2
make[1]: Leaving directory `/w/workspace/zephyr-sanity/tests/kernel/timer/timer_api'
Generating LALR tables
--------------sanity-out/zedboard_pulpino/tests/kernel/timer/timer_api/test/build.log---------------
0 of 90 tests passed with 0 warnings in 68 seconds
Build step 'Execute shell' marked build as failure


zephyr/master: daily build zephyr-kernel-1.6.99-170206-08e0ade Failure

donotreply@...
 

zephyr/master: daily build zephyr-kernel-1.6.99-170206-08e0ade Failure



job zephyr-sanity build number 448 failed
see: https://jenkins.zephyrproject.org/job/zephyr-sanity/448/

PASS - test_pipe_thread2thread.
tc_start() - test_pipe_thread2isr
ASSERTION FAIL [!(_kernel.nested != 0)] @ /w/workspace/zephyr-sanity/kernel/include/ksched.h:237:
-----------------sanity-out/qemu_x86/tests/kernel/pipe/test_pipe_api/test/qemu.log------------------
qemu_x86 tests/kernel/mem_pool/test_mpool_api/test FAILED: timeout
---------------sanity-out/qemu_x86/tests/kernel/mem_pool/test_mpool_api/test/qemu.log---------------
***** BOOTING ZEPHYR OS v1.6.99 - BUILD: Feb 7 2017 01:23:48 *****
Running test suite test_mpool_api
tc_start() - test_mpool_alloc_free_thread
===================================================================
PASS - test_mpool_alloc_free_thread.
tc_start() - test_mpool_alloc_free_isr
ASSERTION FAIL [!(_kernel.nested != 0)] @ /w/workspace/zephyr-sanity/kernel/include/ksched.h:237:
---------------sanity-out/qemu_x86/tests/kernel/mem_pool/test_mpool_api/test/qemu.log---------------
qemu_x86_iamcu tests/kernel/mem_pool/test_mpool_api/test FAILED: timeout
------------sanity-out/qemu_x86_iamcu/tests/kernel/mem_pool/test_mpool_api/test/qemu.log------------
***** BOOTING ZEPHYR OS v1.6.99 - BUILD: Feb 7 2017 01:23:52 *****
Running test suite test_mpool_api
tc_start() - test_mpool_alloc_free_thread
===================================================================
PASS - test_mpool_alloc_free_thread.
tc_start() - test_mpool_alloc_free_isr
ASSERTION FAIL [!(_kernel.nested != 0)] @ /w/workspace/zephyr-sanity/kernel/include/ksched.h:237:
------------sanity-out/qemu_x86_iamcu/tests/kernel/mem_pool/test_mpool_api/test/qemu.log------------
0 of 134 tests passed with 0 warnings in 198 seconds
Extra environment setting:
CONFIG_ASSERT=y
CONFIG_DEBUG=y
Build step 'Execute shell' marked build as failure


job zephyr-sanity build number 447 failed
see: https://jenkins.zephyrproject.org/job/zephyr-sanity/447/

CC kernel/thread_abort.o
CC kernel/timer.o
CC kernel/work_q.o
LD kernel/built-in.o
AR kernel/lib.a
make[3]: Target `all' not remade because of errors.
make[3]: Leaving directory `/w/workspace/zephyr-sanity/sanity-out/zedboard_pulpino/tests/kernel/msgq/msgq_api/test'
make[2]: *** [sub-make] Error 2
make[2]: Target `all' not remade because of errors.
make[2]: Leaving directory `/w/workspace/zephyr-sanity'
make[1]: *** [all] Error 2
make[1]: Leaving directory `/w/workspace/zephyr-sanity/tests/kernel/msgq/msgq_api'
---------------sanity-out/zedboard_pulpino/tests/kernel/msgq/msgq_api/test/build.log----------------
qemu_x86 tests/net/udp/test FAILED: timeout
--------------------------sanity-out/qemu_x86/tests/net/udp/test/qemu.log---------------------------
***** BOOTING ZEPHYR OS v1.6.99 - BUILD: Feb 7 2017 01:31:23 *****
***** CPU exception 13
***** Exception code: 0xd65c
Current thread ID = 0x0010fb80
Faulting segment:address = 0x8:0x10fbac
eax: 0x1102c8, ebx: 0x10d606, ecx: 0x10d66c, edx: 0xffffff7f
esi: 0x0, edi: 0x0, ebp: 0fffffff5, esp: 0x10fb64
eflags: 0x282
Fatal fault in thread 0x0010fb80! Aborting.
--------------------------sanity-out/qemu_x86/tests/net/udp/test/qemu.log---------------------------
0 of 124 tests passed with 0 warnings in 112 seconds
Extra environment setting:
CONFIG_DEBUG=y
Build step 'Execute shell' marked build as failure


job zephyr-sanity build number 446 failed
see: https://jenkins.zephyrproject.org/job/zephyr-sanity/446/

===================================================================
PASS - test_pipe_thread2thread.
tc_start() - test_pipe_thread2isr
ASSERTION FAIL [!(_kernel.nested != 0)] @ /w/workspace/zephyr-sanity/kernel/include/ksched.h:237:
-----------------sanity-out/qemu_x86/tests/kernel/pipe/test_pipe_api/test/qemu.log------------------
qemu_riscv32 tests/kernel/pipe/test_pipe_api/test FAILED: timeout
---------------sanity-out/qemu_riscv32/tests/kernel/pipe/test_pipe_api/test/qemu.log----------------
***** BOOTING ZEPHYR OS v1.6.99 *****
Running test suite test_pipe_api
tc_start() - test_pipe_thread2thread
===================================================================
PASS - test_pipe_thread2thread.
tc_start() - test_pipe_thread2isr
ASSERTION FAIL [!(_kernel.nested != 0)] @ /w/workspace/zephyr-sanity/kernel/include/ksched.h:237:
---------------sanity-out/qemu_riscv32/tests/kernel/pipe/test_pipe_api/test/qemu.log----------------
qemu_cortex_m3 tests/kernel/mem_pool/test_mpool_api/test FAILED: timeout
------------sanity-out/qemu_cortex_m3/tests/kernel/mem_pool/test_mpool_api/test/qemu.log------------
***** BOOTING ZEPHYR OS v1.6.99 - BUILD: Feb 7 2017 01:46:51 *****
Running test suite test_mpool_api
tc_start() - test_mpool_alloc_free_thread
===================================================================
PASS - test_mpool_alloc_free_thread.
tc_start() - test_mpool_alloc_free_isr
ASSERTION FAIL [!_IsInIsr()] @ /w/workspace/zephyr-sanity/kernel/include/ksched.h:237:
------------sanity-out/qemu_cortex_m3/tests/kernel/mem_pool/test_mpool_api/test/qemu.log------------
0 of 100 tests passed with 0 warnings in 161 seconds
Extra environment setting:
CONFIG_ASSERT=y
Build step 'Execute shell' marked build as failure


job zephyr-sanity build number 445 failed
see: https://jenkins.zephyrproject.org/job/zephyr-sanity/445/

CC kernel/lifo.o
CC kernel/mailbox.o
CC kernel/mem_pool.o
CC kernel/mem_slab.o
CC kernel/mutex.o
CC kernel/msg_q.o
CC kernel/pipes.o
CC kernel/sched.o
CC kernel/sem.o
CC kernel/stack.o
CC kernel/sys_clock.o
CC kernel/system_work_q.o
CC kernel/thread.o
CC kernel/thread_abort.o
CC kernel/timer.o
CC kernel/work_q.o
LD kernel/built-in.o
AR kernel/lib.a
make[3]: Target `all' not remade because of errors.
make[3]: Leaving directory `/w/workspace/zephyr-sanity/sanity-out/zedboard_pulpino/tests/kernel/common/test'
make[2]: *** [sub-make] Error 2
make[2]: Target `all' not remade because of errors.
make[2]: Leaving directory `/w/workspace/zephyr-sanity'
make[1]: *** [all] Error 2
make[1]: Leaving directory `/w/workspace/zephyr-sanity/tests/kernel/common'
Generating LALR tables
-------------------sanity-out/zedboard_pulpino/tests/kernel/common/test/build.log-------------------
0 of 91 tests passed with 0 warnings in 59 seconds
Build step 'Execute shell' marked build as failure


zephyr/master: daily build zephyr-kernel-1.6.99-170207-e67828b Failure

donotreply@...
 

zephyr/master: daily build zephyr-kernel-1.6.99-170207-e67828b Failure



job zephyr-sanity build number 452 failed
see: https://jenkins.zephyrproject.org/job/zephyr-sanity/452/

eflags: 0x2
Fatal fault in thread 0x001106a0! Aborting.
***** CPU exception 7
Current thread ID = 0x001106a0
Faulting segment:address = 0x8:0x10e17c
eax: 0x10e17c, ebx: 0x1106a0, ecx: 0x3f8, edx: 0x3f8
esi: 0x6, edi: 0x2, ebp: 0110110, esp: 0x110104
eflags: 0x2
Fatal fault in thread 0x001106a0! Aborting.
***** CPU exception 7
Current thread ID = 0x001106a0
Faulting segment:address = 0x8:0x10e17c
eax: 0x10e17c, ebx: 0x1106a0, ecx: 0x3f8, edx: 0x3f8
esi: 0x6, edi: 0x2, ebp: 010fff8, esp: 0x10ffec
eflags: 0x2
Fatal fault in thread 0x001106a0! Aborting.
***** CPU exception 7
Current thread ID = 0x001106a0
Faulting segment:address = 0x8:0x10e17c
eax: 0x10e17c, ebx: 0x1106a0, ecx: 0x3f8, edx: 0x3f8
esi: 0x6, edi: 0x2, ebp: 010fee0, esp: 0x10fed4
eflags: 0x2
Fatal fault in ISR! Spinning...
--------------------------sanity-out/qemu_x86/tests/net/udp/test/qemu.log---------------------------
0 of 134 tests passed with 0 warnings in 197 seconds
Extra environment setting:
CONFIG_ASSERT=y
CONFIG_DEBUG=y
Build step 'Execute shell' marked build as failure


job zephyr-sanity build number 451 failed
see: https://jenkins.zephyrproject.org/job/zephyr-sanity/451/

XMM00=00000000000000000000000000000000 XMM01=00000000000000000000000000000000
XMM02=00000000000000000000000000000000 XMM03=00000000000000000000000000000000
XMM04=00000000000000000000000000000000 XMM05=00000000000000000000000000000000
XMM06=00000000000000000000000000000000 XMM07=00000000000000000000000000000000
make[3]: *** [run] Aborted (core dumped)
make[3]: Target `qemu' not remade because of errors.
make[3]: Leaving directory `/w/workspace/zephyr-sanity/sanity-out/qemu_x86/tests/legacy/kernel/test_context/test'
make[2]: *** [sub-make] Error 2
make[2]: Target `qemu' not remade because of errors.
make[2]: Leaving directory `/w/workspace/zephyr-sanity'
make[1]: *** [qemu] Error 2
make[1]: Leaving directory `/w/workspace/zephyr-sanity/tests/legacy/kernel/test_context'
-----------------sanity-out/qemu_x86/tests/legacy/kernel/test_context/test/run.log------------------
qemu_x86 tests/net/udp/test FAILED: timeout
--------------------------sanity-out/qemu_x86/tests/net/udp/test/qemu.log---------------------------
***** BOOTING ZEPHYR OS v1.6.99 - BUILD: Feb 8 2017 01:11:04 *****
***** CPU exception 13
***** Exception code: 0xd65c
Current thread ID = 0x0010fb80
Faulting segment:address = 0x8:0x10fbac
eax: 0x1102c8, ebx: 0x10d606, ecx: 0x10d66c, edx: 0xffffff7f
esi: 0x0, edi: 0x0, ebp: 0fffffff5, esp: 0x10fb64
eflags: 0x282
Fatal fault in thread 0x0010fb80! Aborting.
--------------------------sanity-out/qemu_x86/tests/net/udp/test/qemu.log---------------------------
1 of 124 tests passed with 0 warnings in 116 seconds
Extra environment setting:
CONFIG_DEBUG=y
Build step 'Execute shell' marked build as failure


job zephyr-sanity build number 450 failed
see: https://jenkins.zephyrproject.org/job/zephyr-sanity/450/

tc_start() - test_mpool_alloc_free_thread
===================================================================
PASS - test_mpool_alloc_free_thread.
tc_start() - test_mpool_alloc_free_isr
ASSERTION FAIL [!_IsInIsr()] @ /w/workspace/zephyr-sanity/kernel/include/ksched.h:237:
------------sanity-out/qemu_cortex_m3/tests/kernel/mem_pool/test_mpool_api/test/qemu.log------------
qemu_riscv32 tests/kernel/pipe/test_pipe_api/test FAILED: timeout
---------------sanity-out/qemu_riscv32/tests/kernel/pipe/test_pipe_api/test/qemu.log----------------
***** BOOTING ZEPHYR OS v1.6.99 *****
Running test suite test_pipe_api
tc_start() - test_pipe_thread2thread
===================================================================
PASS - test_pipe_thread2thread.
tc_start() - test_pipe_thread2isr
ASSERTION FAIL [!(_kernel.nested != 0)] @ /w/workspace/zephyr-sanity/kernel/include/ksched.h:237:
---------------sanity-out/qemu_riscv32/tests/kernel/pipe/test_pipe_api/test/qemu.log----------------
qemu_cortex_m3 tests/kernel/pipe/test_pipe_api/test FAILED: timeout
--------------sanity-out/qemu_cortex_m3/tests/kernel/pipe/test_pipe_api/test/qemu.log---------------
Running test suite test_pipe_api
tc_start() - test_pipe_thread2thread
===================================================================
PASS - test_pipe_thread2thread.
tc_start() - test_pipe_thread2isr
ASSERTION FAIL [!_IsInIsr()] @ /w/workspace/zephyr-sanity/kernel/include/ksched.h:237:
--------------sanity-out/qemu_cortex_m3/tests/kernel/pipe/test_pipe_api/test/qemu.log---------------
0 of 100 tests passed with 0 warnings in 158 seconds
Extra environment setting:
CONFIG_ASSERT=y
Build step 'Execute shell' marked build as failure


job zephyr-sanity build number 449 failed
see: https://jenkins.zephyrproject.org/job/zephyr-sanity/449/

CC kernel/legacy_offload.o
CC kernel/lifo.o
CC kernel/mailbox.o
CC kernel/mem_pool.o
CC kernel/mem_slab.o
CC kernel/msg_q.o
CC kernel/mutex.o
CC kernel/pipes.o
CC kernel/sched.o
CC kernel/sem.o
CC kernel/stack.o
CC kernel/sys_clock.o
CC kernel/system_work_q.o
CC kernel/thread.o
CC kernel/thread_abort.o
CC kernel/timer.o
CC kernel/work_q.o
LD kernel/built-in.o
AR kernel/lib.a
make[3]: Target `all' not remade because of errors.
make[3]: Leaving directory `/w/workspace/zephyr-sanity/sanity-out/zedboard_pulpino/tests/kernel/mem_pool/test_mpool_options/test_mpool_defrag_split'
make[2]: *** [sub-make] Error 2
make[2]: Target `all' not remade because of errors.
make[2]: Leaving directory `/w/workspace/zephyr-sanity'
make[1]: *** [all] Error 2
make[1]: Leaving directory `/w/workspace/zephyr-sanity/tests/kernel/mem_pool/test_mpool_options'
sanity-out/zedboard_pulpino/tests/kernel/mem_pool/test_mpool_options/test_mpool_defrag_split/build.log
0 of 90 tests passed with 0 warnings in 59 seconds
Build step 'Execute shell' marked build as failure


zephyr/master: daily build zephyr-kernel-1.6.99-170208-d81e033 Failure

donotreply@...
 

zephyr/master: daily build zephyr-kernel-1.6.99-170208-d81e033 Failure



job zephyr-sanity build number 456 failed
see: https://jenkins.zephyrproject.org/job/zephyr-sanity/456/

qemu_x86 tests/net/udp/test FAILED: timeout
--------------------------sanity-out/qemu_x86/tests/net/udp/test/qemu.log---------------------------
***** BOOTING ZEPHYR OS v1.6.99 - BUILD: Feb 9 2017 01:40:23 *****
Timeout, packet not received
ASSERTION FAIL [_is_prio_higher(thread->base.prio, 15) || ((thread->base.prio == 15) && (thread == _idle_thread))] @ /w/workspace/zephyr-sanity/kernel/include/ksched.h:388:
--------------------------sanity-out/qemu_x86/tests/net/udp/test/qemu.log---------------------------
qemu_cortex_m3 tests/kernel/pipe/test_pipe_api/test FAILED: timeout
--------------sanity-out/qemu_cortex_m3/tests/kernel/pipe/test_pipe_api/test/qemu.log---------------
Running test suite test_pipe_api
tc_start() - test_pipe_thread2thread
===================================================================
PASS - test_pipe_thread2thread.
tc_start() - test_pipe_thread2isr
ASSERTION FAIL [!_IsInIsr()] @ /w/workspace/zephyr-sanity/kernel/include/ksched.h:237:
--------------sanity-out/qemu_cortex_m3/tests/kernel/pipe/test_pipe_api/test/qemu.log---------------
qemu_x86_iamcu tests/kernel/pipe/test_pipe_api/test FAILED: timeout
--------------sanity-out/qemu_x86_iamcu/tests/kernel/pipe/test_pipe_api/test/qemu.log---------------
Running test suite test_pipe_api
tc_start() - test_pipe_thread2thread
===================================================================
PASS - test_pipe_thread2thread.
tc_start() - test_pipe_thread2isr
ASSERTION FAIL [!(_kernel.nested != 0)] @ /w/workspace/zephyr-sanity/kernel/include/ksched.h:237:
--------------sanity-out/qemu_x86_iamcu/tests/kernel/pipe/test_pipe_api/test/qemu.log---------------
0 of 131 tests passed with 0 warnings in 199 seconds
Extra environment setting:
CONFIG_ASSERT=y
CONFIG_DEBUG=y
Build step 'Execute shell' marked build as failure


job zephyr-sanity build number 455 failed
see: https://jenkins.zephyrproject.org/job/zephyr-sanity/455/

make[5]: *** [drivers/timer/riscv_machine_timer.o] Error 1
make[5]: Target `__build' not remade because of errors.
make[4]: *** [drivers/timer] Error 2
make[4]: Target `__build' not remade because of errors.
make[3]: *** [drivers] Error 2
CC kernel/sched.o
CC kernel/sem.o
CC kernel/stack.o
CC kernel/sys_clock.o
CC kernel/system_work_q.o
CC kernel/thread.o
CC kernel/thread_abort.o
CC kernel/timer.o
CC kernel/work_q.o
LD kernel/built-in.o
AR kernel/lib.a
make[3]: Target `all' not remade because of errors.
make[3]: Leaving directory `/w/workspace/zephyr-sanity/sanity-out/zedboard_pulpino/tests/legacy/kernel/test_fifo_priv/test'
make[2]: *** [sub-make] Error 2
make[2]: Target `all' not remade because of errors.
make[2]: Leaving directory `/w/workspace/zephyr-sanity'
make[1]: *** [all] Error 2
make[1]: Leaving directory `/w/workspace/zephyr-sanity/tests/legacy/kernel/test_fifo_priv'
Generating LALR tables
-----------sanity-out/zedboard_pulpino/tests/legacy/kernel/test_fifo_priv/test/build.log------------
1 of 121 tests passed with 0 warnings in 91 seconds
Extra environment setting:
CONFIG_DEBUG=y
Build step 'Execute shell' marked build as failure


job zephyr-sanity build number 454 failed
see: https://jenkins.zephyrproject.org/job/zephyr-sanity/454/

tc_start() - test_mpool_alloc_free_thread
===================================================================
PASS - test_mpool_alloc_free_thread.
tc_start() - test_mpool_alloc_free_isr
ASSERTION FAIL [!(_kernel.nested != 0)] @ /w/workspace/zephyr-sanity/kernel/include/ksched.h:237:
---------------sanity-out/qemu_x86/tests/kernel/mem_pool/test_mpool_api/test/qemu.log---------------
qemu_cortex_m3 tests/kernel/pipe/test_pipe_api/test FAILED: timeout
--------------sanity-out/qemu_cortex_m3/tests/kernel/pipe/test_pipe_api/test/qemu.log---------------
Running test suite test_pipe_api
tc_start() - test_pipe_thread2thread
===================================================================
PASS - test_pipe_thread2thread.
tc_start() - test_pipe_thread2isr
ASSERTION FAIL [!_IsInIsr()] @ /w/workspace/zephyr-sanity/kernel/include/ksched.h:237:
--------------sanity-out/qemu_cortex_m3/tests/kernel/pipe/test_pipe_api/test/qemu.log---------------
qemu_nios2 tests/kernel/mem_pool/test_mpool_api/test FAILED: timeout
--------------sanity-out/qemu_nios2/tests/kernel/mem_pool/test_mpool_api/test/qemu.log--------------
***** BOOTING ZEPHYR OS v1.6.99 - BUILD: Feb 9 2017 01:55:15 *****
Running test suite test_mpool_api
tc_start() - test_mpool_alloc_free_thread
===================================================================
PASS - test_mpool_alloc_free_thread.
tc_start() - test_mpool_alloc_free_isr
ASSERTION FAIL [!(_kernel.nested != 0)] @ /w/workspace/zephyr-sanity/kernel/include/ksched.h:237:
--------------sanity-out/qemu_nios2/tests/kernel/mem_pool/test_mpool_api/test/qemu.log--------------
0 of 100 tests passed with 0 warnings in 173 seconds
Extra environment setting:
CONFIG_ASSERT=y
Build step 'Execute shell' marked build as failure


zephyr/master: daily build zephyr-kernel-1.6.99-170209-98d4836 Failure

donotreply@...
 

zephyr/master: daily build zephyr-kernel-1.6.99-170209-98d4836 Failure



job zephyr-sanity build number 460 failed
see: https://jenkins.zephyrproject.org/job/zephyr-sanity/460/

===================================================================
PASS - test_mpool_alloc_free_thread.
tc_start() - test_mpool_alloc_free_isr
ASSERTION FAIL [!(_kernel.nested != 0)] @ /w/workspace/zephyr-sanity/kernel/include/ksched.h:237:
-------------sanity-out/qemu_riscv32/tests/kernel/mem_pool/test_mpool_api/test/qemu.log-------------
qemu_cortex_m3 tests/kernel/pipe/test_pipe_api/test FAILED: timeout
--------------sanity-out/qemu_cortex_m3/tests/kernel/pipe/test_pipe_api/test/qemu.log---------------
Running test suite test_pipe_api
tc_start() - test_pipe_thread2thread
===================================================================
PASS - test_pipe_thread2thread.
tc_start() - test_pipe_thread2isr
ASSERTION FAIL [!_IsInIsr()] @ /w/workspace/zephyr-sanity/kernel/include/ksched.h:237:
--------------sanity-out/qemu_cortex_m3/tests/kernel/pipe/test_pipe_api/test/qemu.log---------------
qemu_x86_iamcu tests/kernel/mem_pool/test_mpool_api/test FAILED: timeout
------------sanity-out/qemu_x86_iamcu/tests/kernel/mem_pool/test_mpool_api/test/qemu.log------------
***** BOOTING ZEPHYR OS v1.6.99 - BUILD: Feb 10 2017 01:29:05 *****
Running test suite test_mpool_api
tc_start() - test_mpool_alloc_free_thread
===================================================================
PASS - test_mpool_alloc_free_thread.
tc_start() - test_mpool_alloc_free_isr
ASSERTION FAIL [!(_kernel.nested != 0)] @ /w/workspace/zephyr-sanity/kernel/include/ksched.h:237:
------------sanity-out/qemu_x86_iamcu/tests/kernel/mem_pool/test_mpool_api/test/qemu.log------------
0 of 46 tests passed with 0 warnings in 132 seconds
Extra environment setting:
CONFIG_ASSERT=y
CONFIG_DEBUG=y
Build step 'Execute shell' marked build as failure


job zephyr-sanity build number 459 failed
see: https://jenkins.zephyrproject.org/job/zephyr-sanity/459/

GDT= 00100070 00000017
IDT= 00102d10 000007ff
CR0=0000003f CR2=00000000 CR3=00000000 CR4=00000000
DR0=00000000 DR1=00000000 DR2=00000000 DR3=00000000
DR6=ffff0ff0 DR7=00000400
CCS=0000000a CCD=0000003c CCO=CLR
EFER=0000000000000000
FCW=037f FSW=0000 [ST=0] FTW=00 MXCSR=00001f80
FPR0=0000000000000000 0000 FPR1=0000000000000000 0000
FPR2=0000000000000000 0000 FPR3=0000000000000000 0000
FPR4=0000000000000000 0000 FPR5=0000000000000000 0000
FPR6=0000000000000000 0000 FPR7=0000000000000000 0000
XMM00=00000000000000000000000000000000 XMM01=00000000000000000000000000000000
XMM02=00000000000000000000000000000000 XMM03=00000000000000000000000000000000
XMM04=00000000000000000000000000000000 XMM05=00000000000000000000000000000000
XMM06=00000000000000000000000000000000 XMM07=00000000000000000000000000000000
make[3]: *** [run] Aborted (core dumped)
make[3]: Target `qemu' not remade because of errors.
make[3]: Leaving directory `/w/workspace/zephyr-sanity/sanity-out/qemu_x86/tests/legacy/kernel/test_sleep/test'
make[2]: *** [sub-make] Error 2
make[2]: Target `qemu' not remade because of errors.
make[2]: Leaving directory `/w/workspace/zephyr-sanity'
make[1]: *** [qemu] Error 2
make[1]: Leaving directory `/w/workspace/zephyr-sanity/tests/legacy/kernel/test_sleep'
------------------sanity-out/qemu_x86/tests/legacy/kernel/test_sleep/test/run.log-------------------
0 of 36 tests passed with 0 warnings in 31 seconds
Extra environment setting:
CONFIG_DEBUG=y
Build step 'Execute shell' marked build as failure


job zephyr-sanity build number 458 failed
see: https://jenkins.zephyrproject.org/job/zephyr-sanity/458/

===================================================================
PASS - test_pipe_thread2thread.
tc_start() - test_pipe_thread2isr
ASSERTION FAIL [!(_kernel.nested != 0)] @ /w/workspace/zephyr-sanity/kernel/include/ksched.h:237:
--------------sanity-out/qemu_x86_iamcu/tests/kernel/pipe/test_pipe_api/test/qemu.log---------------
qemu_x86_iamcu tests/kernel/mem_pool/test_mpool_api/test FAILED: timeout
------------sanity-out/qemu_x86_iamcu/tests/kernel/mem_pool/test_mpool_api/test/qemu.log------------
***** BOOTING ZEPHYR OS v1.6.99 - BUILD: Feb 10 2017 01:20:53 *****
Running test suite test_mpool_api
tc_start() - test_mpool_alloc_free_thread
===================================================================
PASS - test_mpool_alloc_free_thread.
tc_start() - test_mpool_alloc_free_isr
ASSERTION FAIL [!(_kernel.nested != 0)] @ /w/workspace/zephyr-sanity/kernel/include/ksched.h:237:
------------sanity-out/qemu_x86_iamcu/tests/kernel/mem_pool/test_mpool_api/test/qemu.log------------
qemu_x86 tests/kernel/mem_pool/test_mpool_api/test FAILED: timeout
---------------sanity-out/qemu_x86/tests/kernel/mem_pool/test_mpool_api/test/qemu.log---------------
***** BOOTING ZEPHYR OS v1.6.99 - BUILD: Feb 10 2017 01:20:54 *****
Running test suite test_mpool_api
tc_start() - test_mpool_alloc_free_thread
===================================================================
PASS - test_mpool_alloc_free_thread.
tc_start() - test_mpool_alloc_free_isr
ASSERTION FAIL [!(_kernel.nested != 0)] @ /w/workspace/zephyr-sanity/kernel/include/ksched.h:237:
---------------sanity-out/qemu_x86/tests/kernel/mem_pool/test_mpool_api/test/qemu.log---------------
0 of 16 tests passed with 0 warnings in 70 seconds
Extra environment setting:
CONFIG_ASSERT=y
Build step 'Execute shell' marked build as failure


job zephyr-sanity build number 457 failed
see: https://jenkins.zephyrproject.org/job/zephyr-sanity/457/

/w/workspace/zephyr-sanity/kernel/init.c:223: undefined reference to `__data_rom_start'
/w/workspace/zephyr-sanity/kernel/init.c:223: undefined reference to `__data_ram_start'
collect2: error: ld returned 1 exit status
make[3]: *** [zephyr_prebuilt.elf] Error 1
make[3]: Target `all' not remade because of errors.
make[3]: Leaving directory `/w/workspace/zephyr-sanity/sanity-out/zedboard_pulpino/tests/kernel/xip/test'
make[2]: *** [sub-make] Error 2
make[2]: Target `all' not remade because of errors.
make[2]: Leaving directory `/w/workspace/zephyr-sanity'
make[1]: *** [all] Error 2
make[1]: Leaving directory `/w/workspace/zephyr-sanity/tests/kernel/xip'
Generating LALR tables
Platform 'panther' not specified in any arch .ini file and will not be tested
Platform 'panther_ss' not specified in any arch .ini file and will not be tested
--------------------sanity-out/zedboard_pulpino/tests/kernel/xip/test/build.log---------------------
qemu_riscv32 tests/crypto/test_ecc_dh/test FAILED: failed
-------------------sanity-out/qemu_riscv32/tests/crypto/test_ecc_dh/test/qemu.log-------------------
***** BOOTING ZEPHYR OS v1.6.99 - BUILD: Feb 10 2017 01:45:00 *****
tc_start() - TinyCrypt ECC DH tests

Vector #00 check Z - FAILURE
[FAIL] Test #1: ECDH - NIST-p256
===================================================================
FAIL - main.
===================================================================
PROJECT EXECUTION FAILED
-------------------sanity-out/qemu_riscv32/tests/crypto/test_ecc_dh/test/qemu.log-------------------
0 of 6 tests passed with 0 warnings in 5 seconds
Build step 'Execute shell' marked build as failure


zephyr/master: daily build zephyr-kernel-1.6.99-170210-b4b3958 Failure

donotreply@...
 

zephyr/master: daily build zephyr-kernel-1.6.99-170210-b4b3958 Failure



job zephyr-sanity build number 464 failed
see: https://jenkins.zephyrproject.org/job/zephyr-sanity/464/

ASSERTION FAIL [!(_kernel.nested != 0)] @ /w/workspace/zephyr-sanity/kernel/include/ksched.h:237:
--------------sanity-out/qemu_x86_iamcu/tests/kernel/pipe/test_pipe_api/test/qemu.log---------------
qemu_cortex_m3 tests/kernel/pipe/test_pipe_api/test FAILED: timeout
--------------sanity-out/qemu_cortex_m3/tests/kernel/pipe/test_pipe_api/test/qemu.log---------------
Running test suite test_pipe_api
tc_start() - test_pipe_thread2thread
===================================================================
PASS - test_pipe_thread2thread.
tc_start() - test_pipe_thread2isr
ASSERTION FAIL [!_IsInIsr()] @ /w/workspace/zephyr-sanity/kernel/include/ksched.h:237:
Generating LALR tables
Platform 'panther' not specified in any arch .ini file and will not be tested
Platform 'panther_ss' not specified in any arch .ini file and will not be tested
--------------sanity-out/qemu_cortex_m3/tests/kernel/pipe/test_pipe_api/test/qemu.log---------------
qemu_x86 tests/kernel/mem_pool/test_mpool_api/test FAILED: timeout
---------------sanity-out/qemu_x86/tests/kernel/mem_pool/test_mpool_api/test/qemu.log---------------
***** BOOTING ZEPHYR OS v1.6.99 - BUILD: Feb 11 2017 02:01:18 *****
Running test suite test_mpool_api
tc_start() - test_mpool_alloc_free_thread
===================================================================
PASS - test_mpool_alloc_free_thread.
tc_start() - test_mpool_alloc_free_isr
ASSERTION FAIL [!(_kernel.nested != 0)] @ /w/workspace/zephyr-sanity/kernel/include/ksched.h:237:
---------------sanity-out/qemu_x86/tests/kernel/mem_pool/test_mpool_api/test/qemu.log---------------
0 of 136 tests passed with 0 warnings in 231 seconds
Extra environment setting:
CONFIG_ASSERT=y
CONFIG_DEBUG=y
Build step 'Execute shell' marked build as failure


job zephyr-sanity build number 463 failed
see: https://jenkins.zephyrproject.org/job/zephyr-sanity/463/

CC kernel/work_q.o
LD kernel/built-in.o
AR kernel/lib.a
make[3]: Target `all' not remade because of errors.
make[3]: Leaving directory `/w/workspace/zephyr-sanity/sanity-out/stm3210c_eval/tests/crypto/test_mbedtls/test'
make[2]: *** [sub-make] Error 2
make[2]: Target `all' not remade because of errors.
make[2]: Leaving directory `/w/workspace/zephyr-sanity'
make[1]: *** [all] Error 2
make[1]: Leaving directory `/w/workspace/zephyr-sanity/tests/crypto/test_mbedtls'
Generating LALR tables
Platform 'panther' not specified in any arch .ini file and will not be tested
Platform 'panther_ss' not specified in any arch .ini file and will not be tested
-----------------sanity-out/stm3210c_eval/tests/crypto/test_mbedtls/test/build.log------------------
qemu_x86 tests/net/udp/test FAILED: timeout
--------------------------sanity-out/qemu_x86/tests/net/udp/test/qemu.log---------------------------
***** BOOTING ZEPHYR OS v1.6.99 - BUILD: Feb 11 2017 01:17:32 *****
Timeout, packet not received
Timeout, packet not received
Timeout, packet not received
Timeout, packet not received
Cannot recv buf 0xff53f000, ret -78
Timeout, packet not received
Timeout, packet not received
--------------------------sanity-out/qemu_x86/tests/net/udp/test/qemu.log---------------------------
0 of 126 tests passed with 0 warnings in 140 seconds
Extra environment setting:
CONFIG_DEBUG=y
Build step 'Execute shell' marked build as failure


job zephyr-sanity build number 462 failed
see: https://jenkins.zephyrproject.org/job/zephyr-sanity/462/

ASSERTION FAIL [!(_kernel.nested != 0)] @ /w/workspace/zephyr-sanity/kernel/include/ksched.h:237:
--------------sanity-out/qemu_x86_iamcu/tests/kernel/pipe/test_pipe_api/test/qemu.log---------------
qemu_x86_iamcu tests/kernel/mem_pool/test_mpool_api/test FAILED: timeout
------------sanity-out/qemu_x86_iamcu/tests/kernel/mem_pool/test_mpool_api/test/qemu.log------------
Generating LALR tables
Platform 'panther' not specified in any arch .ini file and will not be tested
Platform 'panther_ss' not specified in any arch .ini file and will not be tested
***** BOOTING ZEPHYR OS v1.6.99 - BUILD: Feb 11 2017 02:49:13 *****
Running test suite test_mpool_api
tc_start() - test_mpool_alloc_free_thread
===================================================================
PASS - test_mpool_alloc_free_thread.
tc_start() - test_mpool_alloc_free_isr
ASSERTION FAIL [!(_kernel.nested != 0)] @ /w/workspace/zephyr-sanity/kernel/include/ksched.h:237:
------------sanity-out/qemu_x86_iamcu/tests/kernel/mem_pool/test_mpool_api/test/qemu.log------------
qemu_nios2 tests/kernel/mem_pool/test_mpool_api/test FAILED: timeout
--------------sanity-out/qemu_nios2/tests/kernel/mem_pool/test_mpool_api/test/qemu.log--------------
***** BOOTING ZEPHYR OS v1.6.99 - BUILD: Feb 11 2017 02:49:26 *****
Running test suite test_mpool_api
tc_start() - test_mpool_alloc_free_thread
===================================================================
PASS - test_mpool_alloc_free_thread.
tc_start() - test_mpool_alloc_free_isr
ASSERTION FAIL [!(_kernel.nested != 0)] @ /w/workspace/zephyr-sanity/kernel/include/ksched.h:237:
--------------sanity-out/qemu_nios2/tests/kernel/mem_pool/test_mpool_api/test/qemu.log--------------
0 of 112 tests passed with 0 warnings in 193 seconds
Extra environment setting:
CONFIG_ASSERT=y
Build step 'Execute shell' marked build as failure


zephyr/master: daily build zephyr-kernel-1.6.99-170211-f16f6ec Failure

donotreply@...
 

zephyr/master: daily build zephyr-kernel-1.6.99-170211-f16f6ec Failure



job zephyr-sanity build number 468 failed
see: https://jenkins.zephyrproject.org/job/zephyr-sanity/468/

FPR2=0000000000000000 0000 FPR3=0000000000000000 0000
FPR4=0000000000000000 0000 FPR5=0000000000000000 0000
FPR6=0000000000000000 0000 FPR7=0000000000000000 0000
XMM00=00000000000000000000000000000000 XMM01=00000000000000000000000000000000
XMM02=00000000000000000000000000000000 XMM03=00000000000000000000000000000000
XMM04=00000000000000000000000000000000 XMM05=00000000000000000000000000000000
XMM06=00000000000000000000000000000000 XMM07=00000000000000000000000000000000
make[3]: *** [run] Aborted (core dumped)
make[3]: Target `qemu' not remade because of errors.
make[3]: Leaving directory `/w/workspace/zephyr-sanity/sanity-out/qemu_x86/tests/legacy/kernel/test_sleep/test'
make[2]: *** [sub-make] Error 2
make[2]: Target `qemu' not remade because of errors.
make[2]: Leaving directory `/w/workspace/zephyr-sanity'
make[1]: *** [qemu] Error 2
make[1]: Leaving directory `/w/workspace/zephyr-sanity/tests/legacy/kernel/test_sleep'
------------------sanity-out/qemu_x86/tests/legacy/kernel/test_sleep/test/run.log-------------------
qemu_x86 tests/net/udp/test FAILED: timeout
--------------------------sanity-out/qemu_x86/tests/net/udp/test/qemu.log---------------------------
***** BOOTING ZEPHYR OS v1.6.99 - BUILD: Feb 12 2017 01:20:39 *****
Timeout, packet not received
ASSERTION FAIL [_is_prio_higher(thread->base.prio, 15) || ((thread->base.prio == 15) && (thread == _idle_thread))] @ /w/workspace/zephyr-sanity/kernel/include/ksched.h:388:
--------------------------sanity-out/qemu_x86/tests/net/udp/test/qemu.log---------------------------
qemu_nios2 tests/legacy/kernel/test_sleep/test WARNING: rom_size +1280, is now 18876 +7.27%
Deltas based on metrics from last release
1 of 27 tests passed with 1 warnings in 80 seconds
Extra environment setting:
CONFIG_ASSERT=y
CONFIG_DEBUG=y
Build step 'Execute shell' marked build as failure


job zephyr-sanity build number 467 failed
see: https://jenkins.zephyrproject.org/job/zephyr-sanity/467/

GDT= 00100070 00000017
IDT= 00102e10 000007ff
CR0=0000003f CR2=00000000 CR3=00000000 CR4=00000000
DR0=00000000 DR1=00000000 DR2=00000000 DR3=00000000
DR6=ffff0ff0 DR7=00000400
CCS=0000000a CCD=0000003c CCO=CLR
EFER=0000000000000000
FCW=037f FSW=0000 [ST=0] FTW=00 MXCSR=00001f80
FPR0=0000000000000000 0000 FPR1=0000000000000000 0000
FPR2=0000000000000000 0000 FPR3=0000000000000000 0000
FPR4=0000000000000000 0000 FPR5=0000000000000000 0000
FPR6=0000000000000000 0000 FPR7=0000000000000000 0000
XMM00=00000000000000000000000000000000 XMM01=00000000000000000000000000000000
XMM02=00000000000000000000000000000000 XMM03=00000000000000000000000000000000
XMM04=00000000000000000000000000000000 XMM05=00000000000000000000000000000000
XMM06=00000000000000000000000000000000 XMM07=00000000000000000000000000000000
make[3]: *** [run] Aborted (core dumped)
make[3]: Target `qemu' not remade because of errors.
make[3]: Leaving directory `/w/workspace/zephyr-sanity/sanity-out/qemu_x86/tests/legacy/kernel/test_sleep/test'
make[2]: *** [sub-make] Error 2
make[2]: Target `qemu' not remade because of errors.
make[2]: Leaving directory `/w/workspace/zephyr-sanity'
make[1]: *** [qemu] Error 2
make[1]: Leaving directory `/w/workspace/zephyr-sanity/tests/legacy/kernel/test_sleep'
------------------sanity-out/qemu_x86/tests/legacy/kernel/test_sleep/test/run.log-------------------
1 of 27 tests passed with 0 warnings in 26 seconds
Extra environment setting:
CONFIG_DEBUG=y
Build step 'Execute shell' marked build as failure


zephyr/master: daily build zephyr-kernel-1.6.99-170212-0c87784 Failure

donotreply@...
 

zephyr/master: daily build zephyr-kernel-1.6.99-170212-0c87784 Failure



job zephyr-sanity build number 472 failed
see: https://jenkins.zephyrproject.org/job/zephyr-sanity/472/

FCW=037f FSW=0000 [ST=0] FTW=00 MXCSR=00001f80
FPR0=0000000000000000 0000 FPR1=0000000000000000 0000
FPR2=0000000000000000 0000 FPR3=0000000000000000 0000
FPR4=0000000000000000 0000 FPR5=0000000000000000 0000
FPR6=0000000000000000 0000 FPR7=0000000000000000 0000
XMM00=00000000000000000000000000000000 XMM01=00000000000000000000000000000000
XMM02=00000000000000000000000000000000 XMM03=00000000000000000000000000000000
XMM04=00000000000000000000000000000000 XMM05=00000000000000000000000000000000
XMM06=00000000000000000000000000000000 XMM07=00000000000000000000000000000000
make[3]: *** [run] Aborted (core dumped)
make[3]: Target `qemu' not remade because of errors.
make[3]: Leaving directory `/w/workspace/zephyr-sanity/sanity-out/qemu_x86/tests/legacy/kernel/test_sleep/test'
make[2]: *** [sub-make] Error 2
make[2]: Target `qemu' not remade because of errors.
make[2]: Leaving directory `/w/workspace/zephyr-sanity'
make[1]: *** [qemu] Error 2
make[1]: Leaving directory `/w/workspace/zephyr-sanity/tests/legacy/kernel/test_sleep'
------------------sanity-out/qemu_x86/tests/legacy/kernel/test_sleep/test/run.log-------------------
qemu_x86 tests/net/udp/test FAILED: timeout
--------------------------sanity-out/qemu_x86/tests/net/udp/test/qemu.log---------------------------
***** BOOTING ZEPHYR OS v1.6.99 - BUILD: Feb 13 2017 01:24:06 *****
Timeout, packet not received
ASSERTION FAIL [_is_prio_higher(thread->base.prio, 15) || ((thread->base.prio == 15) && (thread == _idle_thread))] @ /w/workspace/zephyr-sanity/kernel/include/ksched.h:388:
--------------------------sanity-out/qemu_x86/tests/net/udp/test/qemu.log---------------------------
0 of 26 tests passed with 0 warnings in 81 seconds
Extra environment setting:
CONFIG_ASSERT=y
CONFIG_DEBUG=y
Build step 'Execute shell' marked build as failure


job zephyr-sanity build number 471 failed
see: https://jenkins.zephyrproject.org/job/zephyr-sanity/471/

LD arch/built-in.o
LD drivers/serial/built-in.o
LD drivers/built-in.o
AR kernel/lib.a
make[3]: Target `all' not remade because of errors.
make[3]: Leaving directory `/w/workspace/zephyr-sanity/sanity-out/sam_e70_xplained/tests/crypto/test_mbedtls/test'
make[2]: *** [sub-make] Error 2
make[2]: Target `all' not remade because of errors.
make[2]: Leaving directory `/w/workspace/zephyr-sanity'
make[1]: *** [all] Error 2
make[1]: Leaving directory `/w/workspace/zephyr-sanity/tests/crypto/test_mbedtls'
Generating LALR tables
Platform 'panther' not specified in any arch .ini file and will not be tested
Platform 'panther_ss' not specified in any arch .ini file and will not be tested
----------------sanity-out/sam_e70_xplained/tests/crypto/test_mbedtls/test/build.log----------------
qemu_x86 tests/net/udp/test FAILED: failed
--------------------------sanity-out/qemu_x86/tests/net/udp/test/qemu.log---------------------------
***** BOOTING ZEPHYR OS v1.6.99 - BUILD: Feb 13 2017 01:07:17 *****
Timeout, packet not received
Timeout, packet not received
IPv4 wrong user data 0x0010dfc8 returned, expected 0x0010dfb4
507: UDP test "&any_addr4-&any_addr4-1234-4242" fail
===================================================================
PROJECT EXECUTION FAILED
--------------------------sanity-out/qemu_x86/tests/net/udp/test/qemu.log---------------------------
0 of 26 tests passed with 0 warnings in 37 seconds
Extra environment setting:
CONFIG_DEBUG=y
Build step 'Execute shell' marked build as failure


zephyr/master: daily build zephyr-kernel-1.6.99-170213-f1260fb Failure

donotreply@...
 

zephyr/master: daily build zephyr-kernel-1.6.99-170213-f1260fb Failure



job zephyr-sanity build number 476 failed
see: https://jenkins.zephyrproject.org/job/zephyr-sanity/476/

CC kernel/work_q.o
LD kernel/built-in.o
AR kernel/lib.a
make[3]: Target `all' not remade because of errors.
make[3]: Leaving directory `/w/workspace/zephyr-sanity/sanity-out/stm32_mini_a15/tests/crypto/test_mbedtls/test'
make[2]: *** [sub-make] Error 2
make[2]: Target `all' not remade because of errors.
make[2]: Leaving directory `/w/workspace/zephyr-sanity'
make[1]: *** [all] Error 2
make[1]: Leaving directory `/w/workspace/zephyr-sanity/tests/crypto/test_mbedtls'
Generating LALR tables
Platform 'panther' not specified in any arch .ini file and will not be tested
Platform 'panther_ss' not specified in any arch .ini file and will not be tested
-----------------sanity-out/stm32_mini_a15/tests/crypto/test_mbedtls/test/build.log-----------------
qemu_x86 tests/net/udp/test FAILED: failed
--------------------------sanity-out/qemu_x86/tests/net/udp/test/qemu.log---------------------------
***** BOOTING ZEPHYR OS v1.6.99 - BUILD: Feb 14 2017 02:05:28 *****
Timeout, packet not received
Timeout, packet not received
IPv4 wrong user data 0x0010eae8 returned, expected 0x0010ead4
507: UDP test "&any_addr4-&any_addr4-1234-4242" fail
===================================================================
PROJECT EXECUTION FAILED
--------------------------sanity-out/qemu_x86/tests/net/udp/test/qemu.log---------------------------
0 of 26 tests passed with 0 warnings in 28 seconds
Extra environment setting:
CONFIG_ASSERT=y
CONFIG_DEBUG=y
Build step 'Execute shell' marked build as failure


job zephyr-sanity build number 475 failed
see: https://jenkins.zephyrproject.org/job/zephyr-sanity/475/

CC kernel/msg_q.o
CC kernel/mutex.o
CC kernel/pipes.o
CC kernel/sched.o
CC kernel/sem.o
CC kernel/stack.o
CC kernel/sys_clock.o
CC kernel/system_work_q.o
CC kernel/thread.o
CC kernel/thread_abort.o
CC kernel/timer.o
CC kernel/work_q.o
LD kernel/built-in.o
AR kernel/lib.a
make[3]: Target `all' not remade because of errors.
make[3]: Leaving directory `/w/workspace/zephyr-sanity/sanity-out/stm32373c_eval/tests/crypto/test_mbedtls/test'
make[2]: *** [sub-make] Error 2
make[2]: Target `all' not remade because of errors.
make[2]: Leaving directory `/w/workspace/zephyr-sanity'
make[1]: *** [all] Error 2
make[1]: Leaving directory `/w/workspace/zephyr-sanity/tests/crypto/test_mbedtls'
Generating LALR tables
Platform 'panther' not specified in any arch .ini file and will not be tested
Platform 'panther_ss' not specified in any arch .ini file and will not be tested
-----------------sanity-out/stm32373c_eval/tests/crypto/test_mbedtls/test/build.log-----------------
0 of 26 tests passed with 0 warnings in 41 seconds
Extra environment setting:
CONFIG_DEBUG=y
Build step 'Execute shell' marked build as failure


zephyr/master: daily build zephyr-kernel-1.6.99-170214-047ae40 Failure

donotreply@...
 

zephyr/master: daily build zephyr-kernel-1.6.99-170214-047ae40 Failure



job zephyr-sanity build number 480 failed
see: https://jenkins.zephyrproject.org/job/zephyr-sanity/480/

FCW=037f FSW=0000 [ST=0] FTW=00 MXCSR=00001f80
FPR0=0000000000000000 0000 FPR1=0000000000000000 0000
FPR2=0000000000000000 0000 FPR3=0000000000000000 0000
FPR4=0000000000000000 0000 FPR5=0000000000000000 0000
FPR6=0000000000000000 0000 FPR7=0000000000000000 0000
XMM00=00000000000000000000000000000000 XMM01=00000000000000000000000000000000
XMM02=00000000000000000000000000000000 XMM03=00000000000000000000000000000000
XMM04=00000000000000000000000000000000 XMM05=00000000000000000000000000000000
XMM06=00000000000000000000000000000000 XMM07=00000000000000000000000000000000
make[3]: *** [run] Aborted (core dumped)
make[3]: Target `qemu' not remade because of errors.
make[3]: Leaving directory `/w/workspace/zephyr-sanity/sanity-out/qemu_x86/tests/legacy/kernel/test_sleep/test'
make[2]: *** [sub-make] Error 2
make[2]: Target `qemu' not remade because of errors.
make[2]: Leaving directory `/w/workspace/zephyr-sanity'
make[1]: *** [qemu] Error 2
make[1]: Leaving directory `/w/workspace/zephyr-sanity/tests/legacy/kernel/test_sleep'
------------------sanity-out/qemu_x86/tests/legacy/kernel/test_sleep/test/run.log-------------------
qemu_x86 tests/net/udp/test FAILED: timeout
--------------------------sanity-out/qemu_x86/tests/net/udp/test/qemu.log---------------------------
***** BOOTING ZEPHYR OS v1.6.99 - BUILD: Feb 15 2017 02:02:37 *****
Timeout, packet not received
ASSERTION FAIL [_is_prio_higher(thread->base.prio, 15) || ((thread->base.prio == 15) && (thread == _idle_thread))] @ /w/workspace/zephyr-sanity/kernel/include/ksched.h:388:
--------------------------sanity-out/qemu_x86/tests/net/udp/test/qemu.log---------------------------
1 of 33 tests passed with 0 warnings in 96 seconds
Extra environment setting:
CONFIG_ASSERT=y
CONFIG_DEBUG=y
Build step 'Execute shell' marked build as failure


job zephyr-sanity build number 479 failed
see: https://jenkins.zephyrproject.org/job/zephyr-sanity/479/

CC ext/lib/crypto/mbedtls/library/x509_csr.o
CC ext/lib/crypto/mbedtls/library/x509write_crt.o
CC ext/lib/crypto/mbedtls/library/x509write_csr.o
CC ext/lib/crypto/mbedtls/library/xtea.o
LD ext/lib/crypto/mbedtls/built-in.o
LD ext/lib/crypto/built-in.o
LD ext/lib/built-in.o
LD ext/built-in.o
AR libzephyr.a
LINK zephyr.lnk
/opt/zephyr-sdk-0.9/sysroots/x86_64-pokysdk-linux/usr/libexec/i586-zephyr-elf/gcc/i586-zephyr-elf/6.2.0/real-ld: zephyr_prebuilt.elf section `bss' will not fit in region `RAM'
/opt/zephyr-sdk-0.9/sysroots/x86_64-pokysdk-linux/usr/libexec/i586-zephyr-elf/gcc/i586-zephyr-elf/6.2.0/real-ld: region `RAM' overflowed by 28832 bytes
collect2: error: ld returned 1 exit status
make[3]: *** [zephyr_prebuilt.elf] Error 1
make[3]: Target `all' not remade because of errors.
make[3]: Leaving directory `/w/workspace/zephyr-sanity/sanity-out/qemu_x86/samples/net/http_server/test'
make[2]: *** [sub-make] Error 2
make[2]: Target `all' not remade because of errors.
make[2]: Leaving directory `/w/workspace/zephyr-sanity'
make[1]: *** [all] Error 2
make[1]: Leaving directory `/w/workspace/zephyr-sanity/samples/net/http_server'
Generating LALR tables
Platform 'panther' not specified in any arch .ini file and will not be tested
Platform 'panther_ss' not specified in any arch .ini file and will not be tested
---------------------sanity-out/qemu_x86/samples/net/http_server/test/build.log---------------------
0 of 32 tests passed with 0 warnings in 34 seconds
Extra environment setting:
CONFIG_DEBUG=y
Build step 'Execute shell' marked build as failure


job zephyr-sanity build number 478 failed
see: https://jenkins.zephyrproject.org/job/zephyr-sanity/478/

CC kernel/mailbox.o
LD arch/built-in.o
CC kernel/mem_pool.o
CC kernel/mem_slab.o
CC kernel/msg_q.o
CC kernel/pipes.o
CC kernel/sched.o
CC kernel/sem.o
CC kernel/mutex.o
CC kernel/stack.o
CC kernel/system_work_q.o
CC kernel/sys_clock.o
CC kernel/thread.o
CC kernel/thread_abort.o
CC kernel/work_q.o
LD kernel/built-in.o
AR kernel/lib.a
make[3]: Target `all' not remade because of errors.
make[3]: Leaving directory `/w/workspace/zephyr-sanity/sanity-out/tinytile/tests/legacy/benchmark/footprint/nanokernel/footprint-min'
make[2]: *** [sub-make] Error 2
make[2]: Target `all' not remade because of errors.
make[2]: Leaving directory `/w/workspace/zephyr-sanity'
make[1]: *** [all] Error 2
make[1]: Leaving directory `/w/workspace/zephyr-sanity/tests/legacy/benchmark/footprint/nanokernel'
------sanity-out/tinytile/tests/legacy/benchmark/footprint/nanokernel/footprint-min/build.log-------
0 of 6 tests passed with 0 warnings in 7 seconds
Extra environment setting:
CONFIG_ASSERT=y
Build step 'Execute shell' marked build as failure


job zephyr-sanity build number 477 failed
see: https://jenkins.zephyrproject.org/job/zephyr-sanity/477/

CC kernel/mailbox.o
LD drivers/built-in.o
CC kernel/mem_pool.o
LD arch/x86/built-in.o
CC kernel/mem_slab.o
CC kernel/msg_q.o
CC kernel/mutex.o
CC kernel/pipes.o
LD arch/built-in.o
CC kernel/sched.o
CC kernel/sem.o
CC kernel/stack.o
CC kernel/sys_clock.o
CC kernel/system_work_q.o
CC kernel/thread.o
CC kernel/thread_abort.o
CC kernel/work_q.o
LD kernel/built-in.o
AR kernel/lib.a
make[3]: Target `all' not remade because of errors.
make[3]: Leaving directory `/w/workspace/zephyr-sanity/sanity-out/tinytile/tests/legacy/benchmark/footprint/nanokernel/footprint-min'
make[2]: *** [sub-make] Error 2
make[2]: Target `all' not remade because of errors.
make[2]: Leaving directory `/w/workspace/zephyr-sanity'
make[1]: *** [all] Error 2
make[1]: Leaving directory `/w/workspace/zephyr-sanity/tests/legacy/benchmark/footprint/nanokernel'
------sanity-out/tinytile/tests/legacy/benchmark/footprint/nanokernel/footprint-min/build.log-------
0 of 5 tests passed with 0 warnings in 7 seconds
Build step 'Execute shell' marked build as failure


zephyr/refs/tags/v1.7.0-rc1: tag build zephyr-kernel-1.7.0-rc1 Successful

donotreply@...
 

zephyr/refs/tags/v1.7.0-rc1: tag build zephyr-kernel-1.7.0-rc1 Successful

Check console output at https://jenkins.zephyrproject.org/job/zephyr-tag/9/ to view the results.