Date   

zephyr/master: daily build zephyr-kernel-1.7.99-170318-1436e44 Failure

donotreply@...
 

zephyr/master: daily build zephyr-kernel-1.7.99-170318-1436e44 Failure



job zephyr-sanity build number 608 failed
see: https://jenkins.zephyrproject.org/job/zephyr-sanity/608/

Faulting segment:address = 0x8:0x1101b5
eax: 0xd8, ebx: 0x0, ecx: 0x111f40, edx: 0x10fe4c
esi: 0x0, edi: 0x0, ebp: 00, esp: 0x11232c
eflags: 0x246
Fatal fault in essential thread! Spinning...
--------------------------sanity-out/qemu_x86/tests/net/udp/test/qemu.log---------------------------
qemu_x86 tests/net/nbuf/test FAILED: timeout
--------------------------sanity-out/qemu_x86/tests/net/nbuf/test/qemu.log--------------------------
***** BOOTING ZEPHYR OS v1.7.99 - BUILD: Mar 19 2017 07:48:37 *****
ASSERTION FAIL [num_events > 0] @ /w/workspace/zephyr-sanity/kernel/poll.c:177:
zero events
--------------------------sanity-out/qemu_x86/tests/net/nbuf/test/qemu.log--------------------------
qemu_x86 tests/net/lib/http_header_fields/test FAILED: timeout
-----------------sanity-out/qemu_x86/tests/net/lib/http_header_fields/test/qemu.log-----------------
***** BOOTING ZEPHYR OS v1.7.99 - BUILD: Mar 19 2017 07:48:50 *****
ASSERTION FAIL [num_events > 0] @ /w/workspace/zephyr-sanity/kernel/poll.c:177:
zero events
-----------------sanity-out/qemu_x86/tests/net/lib/http_header_fields/test/qemu.log-----------------
qemu_x86 tests/net/lib/dns_packet/test FAILED: timeout
---------------------sanity-out/qemu_x86/tests/net/lib/dns_packet/test/qemu.log---------------------
***** BOOTING ZEPHYR OS v1.7.99 - BUILD: Mar 19 2017 07:48:22 *****
ASSERTION FAIL [num_events > 0] @ /w/workspace/zephyr-sanity/kernel/poll.c:177:
zero events
---------------------sanity-out/qemu_x86/tests/net/lib/dns_packet/test/qemu.log---------------------
1 of 145 tests passed with 0 warnings in 10938 seconds
Extra environment setting:
CONFIG_ASSERT=y
CONFIG_DEBUG=y
Build step 'Execute shell' marked build as failure


job zephyr-sanity build number 607 failed
see: https://jenkins.zephyrproject.org/job/zephyr-sanity/607/

[PASS] Test #2: ECC KeyGen - NIST-p256
[PASS] Test #3: PubKeyVerify - NIST-p256-SHA2-256
Shared secrets are not identical!
Shared secret 1 = 9799e64c ee22d522 365eef89 4a89c014 006c9504 e0567328 6a66c092 cd74be7f
Shared secret 2 = f9a000c4 6034bf05 5f68688f 9450fc98 1ac710d3 ecfc45d3 2a9ae83a abcaa445
Private key 1 = 00000000 00000000 00000000 00000000 00000000 00000000 00000000 00000000
Private key 2 = 5f380b11 093ee25b c1c12d49 b919f4ea 9bd50236 54ffde2d dc7a12b5 b250efcc
[FAIL] Test #4: Monte Carlo (Randomized EC-DH key-exchange) - NIST-p256
===================================================================
FAIL - main.
===================================================================
PROJECT EXECUTION FAILED
------------------sanity-out/qemu_cortex_m3/tests/crypto/test_ecc_dh/test/qemu.log------------------
qemu_x86 tests/net/udp/test FAILED: timeout
--------------------------sanity-out/qemu_x86/tests/net/udp/test/qemu.log---------------------------
***** BOOTING ZEPHYR OS v1.7.99 - BUILD: Mar 19 2017 02:10:08 *****
***** CPU exception 13
***** Exception code: 0x2b18
Current thread ID = 0x00110e80
Faulting segment:address = 0x8:0x10f001
eax: 0x0, ebx: 0x0, ecx: 0x110e80, edx: 0x10ed8c
esi: 0x0, edi: 0x1, ebp: 00, esp: 0x11126c
eflags: 0x216
Fatal fault in essential thread! Spinning...
--------------------------sanity-out/qemu_x86/tests/net/udp/test/qemu.log---------------------------
1 of 34 tests passed with 0 warnings in 98 seconds
Extra environment setting:
CONFIG_DEBUG=y
Build step 'Execute shell' marked build as failure


job zephyr-sanity build number 606 failed
see: https://jenkins.zephyrproject.org/job/zephyr-sanity/606/

--------------------sanity-out/qemu_nios2/tests/crypto/test_ecc_dh/test/run.log---------------------
qemu_x86 tests/net/utils/test FAILED: timeout
-------------------------sanity-out/qemu_x86/tests/net/utils/test/qemu.log--------------------------
***** BOOTING ZEPHYR OS v1.7.99 - BUILD: Mar 19 2017 07:17:07 *****
ASSERTION FAIL [num_events > 0] @ /w/workspace/zephyr-sanity/kernel/poll.c:177:
zero events
-------------------------sanity-out/qemu_x86/tests/net/utils/test/qemu.log--------------------------
qemu_x86 tests/net/lib/http_header_fields/test FAILED: timeout
-----------------sanity-out/qemu_x86/tests/net/lib/http_header_fields/test/qemu.log-----------------
***** BOOTING ZEPHYR OS v1.7.99 - BUILD: Mar 19 2017 07:17:23 *****
ASSERTION FAIL [num_events > 0] @ /w/workspace/zephyr-sanity/kernel/poll.c:177:
zero events
-----------------sanity-out/qemu_x86/tests/net/lib/http_header_fields/test/qemu.log-----------------
qemu_x86 tests/net/trickle/test FAILED: timeout
------------------------sanity-out/qemu_x86/tests/net/trickle/test/qemu.log-------------------------
***** BOOTING ZEPHYR OS v1.7.99 - BUILD: Mar 19 2017 07:18:02 *****
ASSERTION FAIL [num_events > 0] @ /w/workspace/zephyr-sanity/kernel/poll.c:177:
zero events
------------------------sanity-out/qemu_x86/tests/net/trickle/test/qemu.log-------------------------
qemu_x86 tests/net/lib/dns_packet/test FAILED: timeout
---------------------sanity-out/qemu_x86/tests/net/lib/dns_packet/test/qemu.log---------------------
***** BOOTING ZEPHYR OS v1.7.99 - BUILD: Mar 19 2017 07:17:30 *****
ASSERTION FAIL [num_events > 0] @ /w/workspace/zephyr-sanity/kernel/poll.c:177:
zero events
---------------------sanity-out/qemu_x86/tests/net/lib/dns_packet/test/qemu.log---------------------
0 of 120 tests passed with 0 warnings in 10954 seconds
Extra environment setting:
CONFIG_ASSERT=y
Build step 'Execute shell' marked build as failure


job zephyr-sanity build number 605 failed
see: https://jenkins.zephyrproject.org/job/zephyr-sanity/605/

zero=00000000 at=00000000 r2=00000001 r3=00201000
r4=00000000 r5=0000000a r6=00423630 r7=004017bc
r8=004016c4 r9=00000001 r10=00000001 r11=00000000
r12=00000040 r13=00000011 r14=0040162c r15=00000000
r16=00000000 r17=00000000 r18=00000000 r19=00000000
r20=00000000 r21=00000000 r22=00000000 r23=00000000
et=00000001 bt=00000000 gp=00408680 sp=004018d4
fp=00000000 ea=0042171c ba=00000000 ra=00000000
status=00000001 estatus=00000001 bstatus=00000000 ienable=00000004
ipending=00000000 cpuid=00000000 reserved=00000000 exception=00000008
pteaddr=00000000 tlbacc=00000000 tlbmisc=00000000 reserved=00000000
badaddr=00000000 config=00000000 mpubase=00000000 mpuacc=00000000
reserved=00000000 reserved=00000000 reserved=00000000 reserved=00000000
reserved=00000000 reserved=00000000 reserved=00000000 reserved=00000000
reserved=00000000 reserved=00000000 reserved=00000000 reserved=00000000
reserved=00000000 reserved=00000000 reserved=00000000 reserved=00000000
rpc=00000000 mmu write: VPN=00000 PID 00 TLBACC 00000000


make[3]: *** [run] Aborted (core dumped)
make[3]: Leaving directory `/w/workspace/zephyr-sanity/sanity-out/qemu_nios2/tests/crypto/test_ecc_dh/test'
make[2]: *** [sub-make] Error 2
make[2]: Target `run' not remade because of errors.
make[2]: Leaving directory `/w/workspace/zephyr-sanity'
make[1]: *** [run] Error 2
make[1]: Leaving directory `/w/workspace/zephyr-sanity/tests/crypto/test_ecc_dh'
--------------------sanity-out/qemu_nios2/tests/crypto/test_ecc_dh/test/run.log---------------------
0 of 1 tests passed with 0 warnings in 4 seconds
Build step 'Execute shell' marked build as failure


zephyr/master: daily build zephyr-kernel-1.7.99-170319-7d7b3b7 Failure

donotreply@...
 

zephyr/master: daily build zephyr-kernel-1.7.99-170319-7d7b3b7 Failure



job zephyr-sanity build number 612 failed
see: https://jenkins.zephyrproject.org/job/zephyr-sanity/612/

qemu_x86 tests/net/icmpv6/test FAILED: timeout
-------------------------sanity-out/qemu_x86/tests/net/icmpv6/test/qemu.log-------------------------
***** BOOTING ZEPHYR OS v1.7.99 - BUILD: Mar 20 2017 07:14:07 *****
ASSERTION FAIL [num_events > 0] @ /w/workspace/zephyr-sanity/kernel/poll.c:177:
zero events
-------------------------sanity-out/qemu_x86/tests/net/icmpv6/test/qemu.log-------------------------
qemu_x86 tests/net/lib/mqtt_packet/test FAILED: timeout
--------------------sanity-out/qemu_x86/tests/net/lib/mqtt_packet/test/qemu.log---------------------
***** BOOTING ZEPHYR OS v1.7.99 - BUILD: Mar 20 2017 07:14:22 *****
ASSERTION FAIL [num_events > 0] @ /w/workspace/zephyr-sanity/kernel/poll.c:177:
zero events
--------------------sanity-out/qemu_x86/tests/net/lib/mqtt_packet/test/qemu.log---------------------
qemu_x86 tests/net/lib/http_header_fields/test FAILED: timeout
-----------------sanity-out/qemu_x86/tests/net/lib/http_header_fields/test/qemu.log-----------------
***** BOOTING ZEPHYR OS v1.7.99 - BUILD: Mar 20 2017 07:14:45 *****
ASSERTION FAIL [num_events > 0] @ /w/workspace/zephyr-sanity/kernel/poll.c:177:
zero events
-----------------sanity-out/qemu_x86/tests/net/lib/http_header_fields/test/qemu.log-----------------
qemu_x86 tests/net/lib/dns_packet/test FAILED: timeout
---------------------sanity-out/qemu_x86/tests/net/lib/dns_packet/test/qemu.log---------------------
***** BOOTING ZEPHYR OS v1.7.99 - BUILD: Mar 20 2017 07:12:16 *****
ASSERTION FAIL [num_events > 0] @ /w/workspace/zephyr-sanity/kernel/poll.c:177:
zero events
---------------------sanity-out/qemu_x86/tests/net/lib/dns_packet/test/qemu.log---------------------
1 of 145 tests passed with 0 warnings in 10846 seconds
Extra environment setting:
CONFIG_ASSERT=y
CONFIG_DEBUG=y
Build step 'Execute shell' marked build as failure


job zephyr-sanity build number 611 failed
see: https://jenkins.zephyrproject.org/job/zephyr-sanity/611/

[PASS] Test #1: ECDH - NIST-p256
[PASS] Test #2: ECC KeyGen - NIST-p256
[PASS] Test #3: PubKeyVerify - NIST-p256-SHA2-256
Shared secrets are not identical!
Shared secret 1 = 232dbe15 0f3217e5 a1726ed5 f30770d6 93e0c165 22739f8a 9916962e c134ee1d
Shared secret 2 = b771389f 3e985053 adaec211 459b7929 6c429c64 a5563771 e606ca97 115b06cf
Private key 1 = 00000000 00000000 00000000 00000000 00000000 00000000 00000000 00000000
Private key 2 = 611b0368 12adbbe0 c94d0e87 c0a5d628 a17deb1a 54ffde2c da971a64 b06df784
[FAIL] Test #4: Monte Carlo (Randomized EC-DH key-exchange) - NIST-p256
===================================================================
FAIL - main.
===================================================================
PROJECT EXECUTION FAILED
------------------sanity-out/qemu_cortex_m3/tests/crypto/test_ecc_dh/test/qemu.log------------------
qemu_x86 tests/net/udp/test FAILED: timeout
--------------------------sanity-out/qemu_x86/tests/net/udp/test/qemu.log---------------------------
***** BOOTING ZEPHYR OS v1.7.99 - BUILD: Mar 20 2017 02:05:43 *****
***** CPU exception 7
Current thread ID = 0x00111180
Faulting segment:address = 0x8:0x10f3e9
eax: 0x80, ebx: 0x0, ecx: 0x111180, edx: 0x10f024
esi: 0x0, edi: 0x1, ebp: 00, esp: 0x11156c
eflags: 0x282
Fatal fault in essential thread! Spinning...
--------------------------sanity-out/qemu_x86/tests/net/udp/test/qemu.log---------------------------
0 of 33 tests passed with 0 warnings in 87 seconds
Extra environment setting:
CONFIG_DEBUG=y
Build step 'Execute shell' marked build as failure


job zephyr-sanity build number 610 failed
see: https://jenkins.zephyrproject.org/job/zephyr-sanity/610/

-------------------------sanity-out/qemu_x86/tests/net/utils/test/qemu.log--------------------------
qemu_x86 tests/net/nbuf/test FAILED: timeout
--------------------------sanity-out/qemu_x86/tests/net/nbuf/test/qemu.log--------------------------
***** BOOTING ZEPHYR OS v1.7.99 - BUILD: Mar 20 2017 06:23:35 *****
ASSERTION FAIL [num_events > 0] @ /w/workspace/zephyr-sanity/kernel/poll.c:177:
zero events
--------------------------sanity-out/qemu_x86/tests/net/nbuf/test/qemu.log--------------------------
qemu_x86 tests/net/icmpv6/test FAILED: timeout
-------------------------sanity-out/qemu_x86/tests/net/icmpv6/test/qemu.log-------------------------
***** BOOTING ZEPHYR OS v1.7.99 - BUILD: Mar 20 2017 06:23:37 *****
ASSERTION FAIL [num_events > 0] @ /w/workspace/zephyr-sanity/kernel/poll.c:177:
zero events
-------------------------sanity-out/qemu_x86/tests/net/icmpv6/test/qemu.log-------------------------
qemu_x86 tests/net/lib/mqtt_packet/test FAILED: timeout
--------------------sanity-out/qemu_x86/tests/net/lib/mqtt_packet/test/qemu.log---------------------
***** BOOTING ZEPHYR OS v1.7.99 - BUILD: Mar 20 2017 06:23:37 *****
ASSERTION FAIL [num_events > 0] @ /w/workspace/zephyr-sanity/kernel/poll.c:177:
zero events
--------------------sanity-out/qemu_x86/tests/net/lib/mqtt_packet/test/qemu.log---------------------
qemu_x86 tests/net/lib/dns_packet/test FAILED: timeout
---------------------sanity-out/qemu_x86/tests/net/lib/dns_packet/test/qemu.log---------------------
***** BOOTING ZEPHYR OS v1.7.99 - BUILD: Mar 20 2017 06:22:56 *****
ASSERTION FAIL [num_events > 0] @ /w/workspace/zephyr-sanity/kernel/poll.c:177:
zero events
---------------------sanity-out/qemu_x86/tests/net/lib/dns_packet/test/qemu.log---------------------
0 of 120 tests passed with 0 warnings in 10880 seconds
Extra environment setting:
CONFIG_ASSERT=y
Build step 'Execute shell' marked build as failure


job zephyr-sanity build number 609 failed
see: https://jenkins.zephyrproject.org/job/zephyr-sanity/609/

zero=00000000 at=00000000 r2=00000001 r3=00201000
r4=00000000 r5=0000000a r6=00423630 r7=004017bc
r8=004016c4 r9=00000001 r10=00000001 r11=00000000
r12=00000040 r13=00000011 r14=0040162c r15=00000000
r16=00000000 r17=00000000 r18=00000000 r19=00000000
r20=00000000 r21=00000000 r22=00000000 r23=00000000
et=00000001 bt=00000000 gp=00408680 sp=004018d4
fp=00000000 ea=00421984 ba=00000000 ra=00000000
status=00000001 estatus=00000001 bstatus=00000000 ienable=00000004
ipending=00000000 cpuid=00000000 reserved=00000000 exception=00000008
pteaddr=00000000 tlbacc=00000000 tlbmisc=00000000 reserved=00000000
badaddr=00000000 config=00000000 mpubase=00000000 mpuacc=00000000
reserved=00000000 reserved=00000000 reserved=00000000 reserved=00000000
reserved=00000000 reserved=00000000 reserved=00000000 reserved=00000000
reserved=00000000 reserved=00000000 reserved=00000000 reserved=00000000
reserved=00000000 reserved=00000000 reserved=00000000 reserved=00000000
rpc=00000000 mmu write: VPN=00000 PID 00 TLBACC 00000000


make[3]: *** [run] Aborted (core dumped)
make[3]: Leaving directory `/w/workspace/zephyr-sanity/sanity-out/qemu_nios2/tests/crypto/test_ecc_dh/test'
make[2]: *** [sub-make] Error 2
make[2]: Target `run' not remade because of errors.
make[2]: Leaving directory `/w/workspace/zephyr-sanity'
make[1]: *** [run] Error 2
make[1]: Leaving directory `/w/workspace/zephyr-sanity/tests/crypto/test_ecc_dh'
--------------------sanity-out/qemu_nios2/tests/crypto/test_ecc_dh/test/run.log---------------------
0 of 1 tests passed with 0 warnings in 6 seconds
Build step 'Execute shell' marked build as failure


zephyr/master: daily build zephyr-kernel-1.7.99-170320-c9cff15 Failure

donotreply@...
 

zephyr/master: daily build zephyr-kernel-1.7.99-170320-c9cff15 Failure



job zephyr-sanity build number 616 failed
see: https://jenkins.zephyrproject.org/job/zephyr-sanity/616/

make[2]: Leaving directory `/w/workspace/zephyr-sanity'
make[1]: *** [all] Error 2
make[1]: Leaving directory `/w/workspace/zephyr-sanity/samples/bluetooth/central_hr'
Generating LALR tables
Platform 'arduino_101_mcuboot' not specified in any arch .ini file and will not be tested
------------------sanity-out/qemu_x86/samples/bluetooth/central_hr/test/build.log-------------------
qemu_x86 tests/net/neighbor/test FAILED: timeout
------------------------sanity-out/qemu_x86/tests/net/neighbor/test/qemu.log------------------------
***** BOOTING ZEPHYR OS v1.7.99 - BUILD: Mar 21 2017 05:46:04 *****
ASSERTION FAIL [num_events > 0] @ /w/workspace/zephyr-sanity/kernel/poll.c:177:
zero events
------------------------sanity-out/qemu_x86/tests/net/neighbor/test/qemu.log------------------------
qemu_x86 tests/net/trickle/test FAILED: timeout
------------------------sanity-out/qemu_x86/tests/net/trickle/test/qemu.log-------------------------
***** BOOTING ZEPHYR OS v1.7.99 - BUILD: Mar 21 2017 05:46:19 *****
ASSERTION FAIL [num_events > 0] @ /w/workspace/zephyr-sanity/kernel/poll.c:177:
zero events
------------------------sanity-out/qemu_x86/tests/net/trickle/test/qemu.log-------------------------
qemu_x86 tests/net/lib/dns_packet/test FAILED: timeout
---------------------sanity-out/qemu_x86/tests/net/lib/dns_packet/test/qemu.log---------------------
***** BOOTING ZEPHYR OS v1.7.99 - BUILD: Mar 21 2017 05:44:16 *****
ASSERTION FAIL [num_events > 0] @ /w/workspace/zephyr-sanity/kernel/poll.c:177:
zero events
---------------------sanity-out/qemu_x86/tests/net/lib/dns_packet/test/qemu.log---------------------
1 of 145 tests passed with 0 warnings in 10859 seconds
Extra environment setting:
CONFIG_ASSERT=y
CONFIG_DEBUG=y
Build step 'Execute shell' marked build as failure


job zephyr-sanity build number 615 failed
see: https://jenkins.zephyrproject.org/job/zephyr-sanity/615/

[PASS] Test #1: ECDH - NIST-p256
[PASS] Test #2: ECC KeyGen - NIST-p256
[PASS] Test #3: PubKeyVerify - NIST-p256-SHA2-256
Shared secrets are not identical!
Shared secret 1 = 861210fe 218ef2c4 5c227632 bf718c7e 403ad0d1 01698f34 4d0d03e1 ca3e6211
Shared secret 2 = 1235ac8e 9e6db8f6 3e08847b b33e5533 b84b9c3e a5e59f67 a9681822 fa0d5cac
Private key 1 = 00000000 00000000 00000000 00000000 00000000 00000000 00000000 00000000
Private key 2 = 5eb697df 06b7a200 bfbb6041 b71427e4 9a50a860 54ffde2f dcfb85f7 b2d26320
[FAIL] Test #4: Monte Carlo (Randomized EC-DH key-exchange) - NIST-p256
===================================================================
FAIL - main.
===================================================================
PROJECT EXECUTION FAILED
------------------sanity-out/qemu_cortex_m3/tests/crypto/test_ecc_dh/test/qemu.log------------------
qemu_x86 tests/net/udp/test FAILED: timeout
--------------------------sanity-out/qemu_x86/tests/net/udp/test/qemu.log---------------------------
***** BOOTING ZEPHYR OS v1.7.99 - BUILD: Mar 21 2017 02:00:17 *****
***** CPU exception 7
Current thread ID = 0x00111180
Faulting segment:address = 0x8:0x10f3e9
eax: 0x80, ebx: 0x0, ecx: 0x111180, edx: 0x10f024
esi: 0x0, edi: 0x1, ebp: 00, esp: 0x11156c
eflags: 0x282
Fatal fault in essential thread! Spinning...
--------------------------sanity-out/qemu_x86/tests/net/udp/test/qemu.log---------------------------
0 of 33 tests passed with 0 warnings in 85 seconds
Extra environment setting:
CONFIG_DEBUG=y
Build step 'Execute shell' marked build as failure


job zephyr-sanity build number 614 failed
see: https://jenkins.zephyrproject.org/job/zephyr-sanity/614/

--------------------sanity-out/qemu_x86/tests/net/lib/mqtt_packet/test/qemu.log---------------------
qemu_x86 tests/net/lib/zoap/test FAILED: timeout
------------------------sanity-out/qemu_x86/tests/net/lib/zoap/test/qemu.log------------------------
***** BOOTING ZEPHYR OS v1.7.99 - BUILD: Mar 21 2017 05:36:40 *****
ASSERTION FAIL [num_events > 0] @ /w/workspace/zephyr-sanity/kernel/poll.c:177:
zero events
------------------------sanity-out/qemu_x86/tests/net/lib/zoap/test/qemu.log------------------------
qemu_x86 tests/net/nbuf/test FAILED: timeout
--------------------------sanity-out/qemu_x86/tests/net/nbuf/test/qemu.log--------------------------
***** BOOTING ZEPHYR OS v1.7.99 - BUILD: Mar 21 2017 05:36:59 *****
ASSERTION FAIL [num_events > 0] @ /w/workspace/zephyr-sanity/kernel/poll.c:177:
zero events
--------------------------sanity-out/qemu_x86/tests/net/nbuf/test/qemu.log--------------------------
qemu_x86 tests/net/utils/test FAILED: timeout
-------------------------sanity-out/qemu_x86/tests/net/utils/test/qemu.log--------------------------
***** BOOTING ZEPHYR OS v1.7.99 - BUILD: Mar 21 2017 05:37:23 *****
ASSERTION FAIL [num_events > 0] @ /w/workspace/zephyr-sanity/kernel/poll.c:177:
zero events
-------------------------sanity-out/qemu_x86/tests/net/utils/test/qemu.log--------------------------
qemu_x86 tests/net/lib/dns_packet/test FAILED: timeout
---------------------sanity-out/qemu_x86/tests/net/lib/dns_packet/test/qemu.log---------------------
***** BOOTING ZEPHYR OS v1.7.99 - BUILD: Mar 21 2017 05:35:32 *****
ASSERTION FAIL [num_events > 0] @ /w/workspace/zephyr-sanity/kernel/poll.c:177:
zero events
---------------------sanity-out/qemu_x86/tests/net/lib/dns_packet/test/qemu.log---------------------
0 of 120 tests passed with 0 warnings in 10840 seconds
Extra environment setting:
CONFIG_ASSERT=y
Build step 'Execute shell' marked build as failure


job zephyr-sanity build number 613 failed
see: https://jenkins.zephyrproject.org/job/zephyr-sanity/613/

zero=00000000 at=00000000 r2=00000001 r3=00201000
r4=00000000 r5=0000000a r6=00423630 r7=004017bc
r8=004016c4 r9=00000001 r10=00000001 r11=00000000
r12=00000040 r13=00000011 r14=0040162c r15=00000000
r16=00000000 r17=00000000 r18=00000000 r19=00000000
r20=00000000 r21=00000000 r22=00000000 r23=00000000
et=00000001 bt=00000000 gp=00408680 sp=004018d4
fp=00000000 ea=00420bd0 ba=00000000 ra=00000000
status=00000001 estatus=00000001 bstatus=00000000 ienable=00000004
ipending=00000000 cpuid=00000000 reserved=00000000 exception=00000008
pteaddr=00000000 tlbacc=00000000 tlbmisc=00000000 reserved=00000000
badaddr=00000000 config=00000000 mpubase=00000000 mpuacc=00000000
reserved=00000000 reserved=00000000 reserved=00000000 reserved=00000000
reserved=00000000 reserved=00000000 reserved=00000000 reserved=00000000
reserved=00000000 reserved=00000000 reserved=00000000 reserved=00000000
reserved=00000000 reserved=00000000 reserved=00000000 reserved=00000000
rpc=00000000 mmu write: VPN=00000 PID 00 TLBACC 00000000


make[3]: *** [run] Aborted (core dumped)
make[3]: Leaving directory `/w/workspace/zephyr-sanity/sanity-out/qemu_nios2/tests/crypto/test_ecc_dh/test'
make[2]: *** [sub-make] Error 2
make[2]: Target `run' not remade because of errors.
make[2]: Leaving directory `/w/workspace/zephyr-sanity'
make[1]: *** [run] Error 2
make[1]: Leaving directory `/w/workspace/zephyr-sanity/tests/crypto/test_ecc_dh'
--------------------sanity-out/qemu_nios2/tests/crypto/test_ecc_dh/test/run.log---------------------
0 of 1 tests passed with 0 warnings in 6 seconds
Build step 'Execute shell' marked build as failure


zephyr/refs/tags/v1.1.0: tag build zephyr-kernel-1.1.0 Failure

donotreply@...
 

zephyr/refs/tags/v1.1.0: tag build zephyr-kernel-1.1.0 Failure

Check console output at https://jenkins.zephyrproject.org/sandbox/job/zephyr-tag/1/ to view the results.


zephyr/refs/tags/v1.3.0: tag build zephyr-kernel-1.3.0 Still Failing

donotreply@...
 

zephyr/refs/tags/v1.3.0: tag build zephyr-kernel-1.3.0 Still Failing

Check console output at https://jenkins.zephyrproject.org/sandbox/job/zephyr-tag/2/ to view the results.


zephyr/refs/tags/v1.3.0: tag build zephyr-kernel-1.3.0 Still Failing

donotreply@...
 

zephyr/refs/tags/v1.3.0: tag build zephyr-kernel-1.3.0 Still Failing

Check console output at https://jenkins.zephyrproject.org/sandbox/job/zephyr-tag/3/ to view the results.


zephyr/refs/tags/v1.1.0: tag build zephyr-kernel-1.1.0 Aborted

donotreply@...
 

zephyr/refs/tags/v1.1.0: tag build zephyr-kernel-1.1.0 Aborted

Check console output at https://jenkins.zephyrproject.org/sandbox/job/zephyr-tag/4/ to view the results.


zephyr/refs/tags/v1.1.0: tag build zephyr-kernel-1.1.0 Failure

donotreply@...
 

zephyr/refs/tags/v1.1.0: tag build zephyr-kernel-1.1.0 Failure

Check console output at https://jenkins.zephyrproject.org/sandbox/job/zephyr-tag/5/ to view the results.


zephyr/refs/tags/v1.2.0: tag build zephyr-kernel-1.2.0 Still Failing

donotreply@...
 

zephyr/refs/tags/v1.2.0: tag build zephyr-kernel-1.2.0 Still Failing

Check console output at https://jenkins.zephyrproject.org/sandbox/job/zephyr-tag/6/ to view the results.


zephyr/refs/tags/v1.3.0: tag build zephyr-kernel-1.3.0 Still Failing

donotreply@...
 

zephyr/refs/tags/v1.3.0: tag build zephyr-kernel-1.3.0 Still Failing

Check console output at https://jenkins.zephyrproject.org/sandbox/job/zephyr-tag/7/ to view the results.


zephyr/refs/tags/v1.4.0: tag build zephyr-kernel-1.4.0 Still Failing

donotreply@...
 

zephyr/refs/tags/v1.4.0: tag build zephyr-kernel-1.4.0 Still Failing

Check console output at https://jenkins.zephyrproject.org/sandbox/job/zephyr-tag/8/ to view the results.


zephyr/refs/tags/v1.7.0: tag build zephyr-kernel-1.7.0 Still Failing

donotreply@...
 

zephyr/refs/tags/v1.7.0: tag build zephyr-kernel-1.7.0 Still Failing

Check console output at https://jenkins.zephyrproject.org/sandbox/job/zephyr-tag/9/ to view the results.


zephyr/refs/tags/v1.2.0: tag build zephyr-kernel-1.2.0 Still Failing

donotreply@...
 

zephyr/refs/tags/v1.2.0: tag build zephyr-kernel-1.2.0 Still Failing

Check console output at https://jenkins.zephyrproject.org/sandbox/job/zephyr-tag/10/ to view the results.


zephyr/refs/tags/v1.2.0: tag build zephyr-kernel-1.2.0 Still Failing

donotreply@...
 

zephyr/refs/tags/v1.2.0: tag build zephyr-kernel-1.2.0 Still Failing

Check console output at https://jenkins.zephyrproject.org/sandbox/job/zephyr-tag/11/ to view the results.


zephyr/refs/tags/v1.2.0: tag build zephyr-kernel-1.2.0 Aborted

donotreply@...
 

zephyr/refs/tags/v1.2.0: tag build zephyr-kernel-1.2.0 Aborted

Check console output at https://jenkins.zephyrproject.org/sandbox/job/zephyr-tag/12/ to view the results.


zephyr/refs/tags/v1.2.0: tag build zephyr-kernel-1.2.0 Failure

donotreply@...
 

zephyr/refs/tags/v1.2.0: tag build zephyr-kernel-1.2.0 Failure

Check console output at https://jenkins.zephyrproject.org/sandbox/job/zephyr-tag/13/ to view the results.


zephyr/refs/tags/v1.2.0: tag build zephyr-kernel-1.2.0 Still Failing

donotreply@...
 

zephyr/refs/tags/v1.2.0: tag build zephyr-kernel-1.2.0 Still Failing

Check console output at https://jenkins.zephyrproject.org/sandbox/job/zephyr-tag/14/ to view the results.


zephyr/master: daily build zephyr-kernel-1.7.99-170321-e4aa741 Failure

donotreply@...
 

zephyr/master: daily build zephyr-kernel-1.7.99-170321-e4aa741 Failure



job zephyr-sanity build number 620 failed
see: https://jenkins.zephyrproject.org/job/zephyr-sanity/620/

Faulting segment:address = 0x8:0x1104cc
eax: 0xd5, ebx: 0x0, ecx: 0x112240, edx: 0x1101e0
esi: 0x0, edi: 0x0, ebp: 00, esp: 0x11262c
eflags: 0x213
Fatal fault in essential thread! Spinning...
--------------------------sanity-out/qemu_x86/tests/net/udp/test/qemu.log---------------------------
qemu_x86 tests/net/lib/zoap/test FAILED: timeout
------------------------sanity-out/qemu_x86/tests/net/lib/zoap/test/qemu.log------------------------
***** BOOTING ZEPHYR OS v1.7.99 - BUILD: Mar 22 2017 07:54:58 *****
ASSERTION FAIL [num_events > 0] @ /w/workspace/zephyr-sanity/kernel/poll.c:177:
zero events
------------------------sanity-out/qemu_x86/tests/net/lib/zoap/test/qemu.log------------------------
qemu_x86 tests/net/lib/mqtt_packet/test FAILED: timeout
--------------------sanity-out/qemu_x86/tests/net/lib/mqtt_packet/test/qemu.log---------------------
***** BOOTING ZEPHYR OS v1.7.99 - BUILD: Mar 22 2017 07:55:12 *****
ASSERTION FAIL [num_events > 0] @ /w/workspace/zephyr-sanity/kernel/poll.c:177:
zero events
--------------------sanity-out/qemu_x86/tests/net/lib/mqtt_packet/test/qemu.log---------------------
qemu_x86 tests/net/lib/dns_packet/test FAILED: timeout
---------------------sanity-out/qemu_x86/tests/net/lib/dns_packet/test/qemu.log---------------------
***** BOOTING ZEPHYR OS v1.7.99 - BUILD: Mar 22 2017 07:53:59 *****
ASSERTION FAIL [num_events > 0] @ /w/workspace/zephyr-sanity/kernel/poll.c:177:
zero events
---------------------sanity-out/qemu_x86/tests/net/lib/dns_packet/test/qemu.log---------------------
0 of 144 tests passed with 0 warnings in 10900 seconds
Extra environment setting:
CONFIG_ASSERT=y
CONFIG_DEBUG=y
Build step 'Execute shell' marked build as failure


job zephyr-sanity build number 619 failed
see: https://jenkins.zephyrproject.org/job/zephyr-sanity/619/

[PASS] Test #1: ECDH - NIST-p256
[PASS] Test #2: ECC KeyGen - NIST-p256
[PASS] Test #3: PubKeyVerify - NIST-p256-SHA2-256
Shared secrets are not identical!
Shared secret 1 = 5c6bd804 e20e4319 cd414649 57b66ce5 d4e88452 96f80bce c89c504d 63d2fa92
Shared secret 2 = a0555e56 a235d8fd be02be48 81c2ffc3 e1e04bd4 3a03539c c7e60160 dab8e033
Private key 1 = 00000000 00000000 00000000 00000000 00000000 00000000 00000000 00000000
Private key 2 = a2b80d11 4e35ff13 1a9a656e f888d6d6 61f641e7 3ed7077e 22fc454f 26760a19
[FAIL] Test #4: Monte Carlo (Randomized EC-DH key-exchange) - NIST-p256
===================================================================
FAIL - main.
===================================================================
PROJECT EXECUTION FAILED
---------------------sanity-out/qemu_x86/tests/crypto/test_ecc_dh/test/qemu.log---------------------
qemu_x86 tests/net/udp/test FAILED: timeout
--------------------------sanity-out/qemu_x86/tests/net/udp/test/qemu.log---------------------------
***** BOOTING ZEPHYR OS v1.7.99 - BUILD: Mar 22 2017 02:11:24 *****
***** CPU exception 7
Current thread ID = 0x00111180
Faulting segment:address = 0x8:0x10f3e9
eax: 0x80, ebx: 0x0, ecx: 0x111180, edx: 0x10f024
esi: 0x0, edi: 0x1, ebp: 00, esp: 0x11156c
eflags: 0x282
Fatal fault in essential thread! Spinning...
--------------------------sanity-out/qemu_x86/tests/net/udp/test/qemu.log---------------------------
2 of 35 tests passed with 0 warnings in 104 seconds
Extra environment setting:
CONFIG_DEBUG=y
Build step 'Execute shell' marked build as failure


job zephyr-sanity build number 618 failed
see: https://jenkins.zephyrproject.org/job/zephyr-sanity/618/

Generating LALR tables
Platform 'arduino_101_mcuboot' not specified in any arch .ini file and will not be tested
-------------------------sanity-out/qemu_x86/tests/net/icmpv6/test/qemu.log-------------------------
***** BOOTING ZEPHYR OS v1.7.99 - BUILD: Mar 22 2017 06:18:41 *****
ASSERTION FAIL [num_events > 0] @ /w/workspace/zephyr-sanity/kernel/poll.c:177:
zero events
-------------------------sanity-out/qemu_x86/tests/net/icmpv6/test/qemu.log-------------------------
qemu_x86 tests/net/lib/mqtt_packet/test FAILED: timeout
--------------------sanity-out/qemu_x86/tests/net/lib/mqtt_packet/test/qemu.log---------------------
***** BOOTING ZEPHYR OS v1.7.99 - BUILD: Mar 22 2017 06:18:42 *****
ASSERTION FAIL [num_events > 0] @ /w/workspace/zephyr-sanity/kernel/poll.c:177:
zero events
--------------------sanity-out/qemu_x86/tests/net/lib/mqtt_packet/test/qemu.log---------------------
qemu_x86 tests/net/lib/zoap/test FAILED: timeout
------------------------sanity-out/qemu_x86/tests/net/lib/zoap/test/qemu.log------------------------
***** BOOTING ZEPHYR OS v1.7.99 - BUILD: Mar 22 2017 06:19:08 *****
ASSERTION FAIL [num_events > 0] @ /w/workspace/zephyr-sanity/kernel/poll.c:177:
zero events
------------------------sanity-out/qemu_x86/tests/net/lib/zoap/test/qemu.log------------------------
qemu_x86 tests/net/lib/dns_packet/test FAILED: timeout
---------------------sanity-out/qemu_x86/tests/net/lib/dns_packet/test/qemu.log---------------------
***** BOOTING ZEPHYR OS v1.7.99 - BUILD: Mar 22 2017 06:19:20 *****
ASSERTION FAIL [num_events > 0] @ /w/workspace/zephyr-sanity/kernel/poll.c:177:
zero events
---------------------sanity-out/qemu_x86/tests/net/lib/dns_packet/test/qemu.log---------------------
0 of 119 tests passed with 0 warnings in 10929 seconds
Extra environment setting:
CONFIG_ASSERT=y
Build step 'Execute shell' marked build as failure


job zephyr-sanity build number 617 failed
see: https://jenkins.zephyrproject.org/job/zephyr-sanity/617/

zero=00000000 at=00000000 r2=00000001 r3=00201000
r4=00000000 r5=0000000a r6=00423630 r7=004017bc
r8=004016c4 r9=00000001 r10=00000001 r11=00000000
r12=00000040 r13=00000011 r14=0040162c r15=00000000
r16=00000000 r17=00000000 r18=00000000 r19=00000000
r20=00000000 r21=00000000 r22=00000000 r23=00000000
et=00000001 bt=00000000 gp=00408680 sp=004018d4
fp=00000000 ea=00421960 ba=00000000 ra=00000000
status=00000001 estatus=00000001 bstatus=00000000 ienable=00000004
ipending=00000000 cpuid=00000000 reserved=00000000 exception=00000008
pteaddr=00000000 tlbacc=00000000 tlbmisc=00000000 reserved=00000000
badaddr=00000000 config=00000000 mpubase=00000000 mpuacc=00000000
reserved=00000000 reserved=00000000 reserved=00000000 reserved=00000000
reserved=00000000 reserved=00000000 reserved=00000000 reserved=00000000
reserved=00000000 reserved=00000000 reserved=00000000 reserved=00000000
reserved=00000000 reserved=00000000 reserved=00000000 reserved=00000000
rpc=00000000 mmu write: VPN=00000 PID 00 TLBACC 00000000


make[3]: *** [run] Aborted (core dumped)
make[3]: Leaving directory `/w/workspace/zephyr-sanity/sanity-out/qemu_nios2/tests/crypto/test_ecc_dh/test'
make[2]: *** [sub-make] Error 2
make[2]: Target `run' not remade because of errors.
make[2]: Leaving directory `/w/workspace/zephyr-sanity'
make[1]: *** [run] Error 2
make[1]: Leaving directory `/w/workspace/zephyr-sanity/tests/crypto/test_ecc_dh'
--------------------sanity-out/qemu_nios2/tests/crypto/test_ecc_dh/test/run.log---------------------
0 of 1 tests passed with 0 warnings in 6 seconds
Build step 'Execute shell' marked build as failure


zephyr/refs/tags/v1.2.0: tag build zephyr-kernel-1.2.0 Still Failing

donotreply@...
 

zephyr/refs/tags/v1.2.0: tag build zephyr-kernel-1.2.0 Still Failing

Check console output at https://jenkins.zephyrproject.org/sandbox/job/zephyr-tag/15/ to view the results.


zephyr/refs/tags/v1.2.0: tag build zephyr-kernel-1.2.0 Still Failing

donotreply@...
 

zephyr/refs/tags/v1.2.0: tag build zephyr-kernel-1.2.0 Still Failing

Check console output at https://jenkins.zephyrproject.org/sandbox/job/zephyr-tag/16/ to view the results.

121 - 140 of 2863