Date   

zephyr/refs/tags/v1.2.0: tag build zephyr-kernel-1.2.0 Still Failing

donotreply@...
 

zephyr/refs/tags/v1.2.0: tag build zephyr-kernel-1.2.0 Still Failing

Check console output at https://jenkins.zephyrproject.org/sandbox/job/zephyr-tag/17/ to view the results.


zephyr/master: daily build zephyr-kernel-1.7.99-170322-8e27ad4 Failure

donotreply@...
 

zephyr/master: daily build zephyr-kernel-1.7.99-170322-8e27ad4 Failure



job zephyr-sanity build number 624 failed
see: https://jenkins.zephyrproject.org/job/zephyr-sanity/624/

***** BOOTING ZEPHYR OS v1.7.99 - BUILD: Mar 23 2017 07:38:33 *****
ASSERTION FAIL [num_events > 0] @ /w/workspace/zephyr-sanity/kernel/poll.c:177:
zero events
-------------------------sanity-out/qemu_x86/tests/net/utils/test/qemu.log--------------------------
qemu_x86 tests/net/icmpv6/test FAILED: timeout
-------------------------sanity-out/qemu_x86/tests/net/icmpv6/test/qemu.log-------------------------
***** BOOTING ZEPHYR OS v1.7.99 - BUILD: Mar 23 2017 07:38:34 *****
ASSERTION FAIL [num_events > 0] @ /w/workspace/zephyr-sanity/kernel/poll.c:177:
zero events
-------------------------sanity-out/qemu_x86/tests/net/icmpv6/test/qemu.log-------------------------
qemu_x86 tests/net/lib/mqtt_packet/test FAILED: timeout
--------------------sanity-out/qemu_x86/tests/net/lib/mqtt_packet/test/qemu.log---------------------
***** BOOTING ZEPHYR OS v1.7.99 - BUILD: Mar 23 2017 07:39:26 *****
ASSERTION FAIL [num_events > 0] @ /w/workspace/zephyr-sanity/kernel/poll.c:177:
zero events
--------------------sanity-out/qemu_x86/tests/net/lib/mqtt_packet/test/qemu.log---------------------
qemu_x86 tests/net/lib/dns_packet/test FAILED: timeout
---------------------sanity-out/qemu_x86/tests/net/lib/dns_packet/test/qemu.log---------------------
***** BOOTING ZEPHYR OS v1.7.99 - BUILD: Mar 23 2017 07:39:16 *****
ASSERTION FAIL [num_events > 0] @ /w/workspace/zephyr-sanity/kernel/poll.c:177:
zero events
---------------------sanity-out/qemu_x86/tests/net/lib/dns_packet/test/qemu.log---------------------
qemu_nios2 tests/legacy/kernel/test_sleep/test WARNING: rom_size +1208, is now 18804 +6.87%
Deltas based on metrics from last release
1 of 145 tests passed with 1 warnings in 10966 seconds
Extra environment setting:
CONFIG_ASSERT=y
CONFIG_DEBUG=y
Build step 'Execute shell' marked build as failure


job zephyr-sanity build number 623 failed
see: https://jenkins.zephyrproject.org/job/zephyr-sanity/623/

[PASS] Test #1: ECDH - NIST-p256
[PASS] Test #2: ECC KeyGen - NIST-p256
[PASS] Test #3: PubKeyVerify - NIST-p256-SHA2-256
Shared secrets are not identical!
Shared secret 1 = 71b31cba c0468afa ff18f81f 4bbb8879 6991eb99 beb023c3 402825c5 451ea5da
Shared secret 2 = 34b2bb0a 0298d6a5 67e44d49 a2a2d811 cfae3251 02fc73fb c7a39ad3 90cec35b
Private key 1 = 00000000 00000000 00000000 00000000 00000000 00000000 00000000 00000000
Private key 2 = 5ed0615f 07389183 c0228647 b77b4de9 9a9e04de 54ffde28 dce1bc6e b2b8999b
[FAIL] Test #4: Monte Carlo (Randomized EC-DH key-exchange) - NIST-p256
===================================================================
FAIL - main.
===================================================================
PROJECT EXECUTION FAILED
------------------sanity-out/qemu_cortex_m3/tests/crypto/test_ecc_dh/test/qemu.log------------------
qemu_x86 tests/net/udp/test FAILED: timeout
--------------------------sanity-out/qemu_x86/tests/net/udp/test/qemu.log---------------------------
***** BOOTING ZEPHYR OS v1.7.99 - BUILD: Mar 23 2017 01:54:31 *****
***** CPU exception 7
Current thread ID = 0x00111180
Faulting segment:address = 0x8:0x10f3e9
eax: 0x80, ebx: 0x0, ecx: 0x111180, edx: 0x10f024
esi: 0x0, edi: 0x1, ebp: 00, esp: 0x11156c
eflags: 0x282
Fatal fault in essential thread! Spinning...
--------------------------sanity-out/qemu_x86/tests/net/udp/test/qemu.log---------------------------
0 of 33 tests passed with 0 warnings in 87 seconds
Extra environment setting:
CONFIG_DEBUG=y
Build step 'Execute shell' marked build as failure


job zephyr-sanity build number 622 failed
see: https://jenkins.zephyrproject.org/job/zephyr-sanity/622/

------------------------sanity-out/qemu_x86/tests/net/neighbor/test/qemu.log------------------------
qemu_x86 tests/net/icmpv6/test FAILED: timeout
-------------------------sanity-out/qemu_x86/tests/net/icmpv6/test/qemu.log-------------------------
***** BOOTING ZEPHYR OS v1.7.99 - BUILD: Mar 23 2017 05:32:33 *****
ASSERTION FAIL [num_events > 0] @ /w/workspace/zephyr-sanity/kernel/poll.c:177:
zero events
-------------------------sanity-out/qemu_x86/tests/net/icmpv6/test/qemu.log-------------------------
qemu_x86 tests/net/lib/http_header_fields/test FAILED: timeout
-----------------sanity-out/qemu_x86/tests/net/lib/http_header_fields/test/qemu.log-----------------
***** BOOTING ZEPHYR OS v1.7.99 - BUILD: Mar 23 2017 05:33:04 *****
ASSERTION FAIL [num_events > 0] @ /w/workspace/zephyr-sanity/kernel/poll.c:177:
zero events
-----------------sanity-out/qemu_x86/tests/net/lib/http_header_fields/test/qemu.log-----------------
qemu_x86 tests/net/utils/test FAILED: timeout
-------------------------sanity-out/qemu_x86/tests/net/utils/test/qemu.log--------------------------
***** BOOTING ZEPHYR OS v1.7.99 - BUILD: Mar 23 2017 05:33:04 *****
ASSERTION FAIL [num_events > 0] @ /w/workspace/zephyr-sanity/kernel/poll.c:177:
zero events
-------------------------sanity-out/qemu_x86/tests/net/utils/test/qemu.log--------------------------
qemu_x86 tests/net/lib/dns_packet/test FAILED: timeout
---------------------sanity-out/qemu_x86/tests/net/lib/dns_packet/test/qemu.log---------------------
***** BOOTING ZEPHYR OS v1.7.99 - BUILD: Mar 23 2017 05:32:22 *****
ASSERTION FAIL [num_events > 0] @ /w/workspace/zephyr-sanity/kernel/poll.c:177:
zero events
---------------------sanity-out/qemu_x86/tests/net/lib/dns_packet/test/qemu.log---------------------
1 of 120 tests passed with 0 warnings in 10874 seconds
Extra environment setting:
CONFIG_ASSERT=y
Build step 'Execute shell' marked build as failure


job zephyr-sanity build number 621 failed
see: https://jenkins.zephyrproject.org/job/zephyr-sanity/621/

zero=00000000 at=00000000 r2=00000001 r3=00201000
r4=00000000 r5=0000000a r6=00423630 r7=004017bc
r8=004016c4 r9=00000001 r10=00000001 r11=00000000
r12=00000040 r13=00000011 r14=0040162c r15=00000000
r16=00000000 r17=00000000 r18=00000000 r19=00000000
r20=00000000 r21=00000000 r22=00000000 r23=00000000
et=00000001 bt=00000000 gp=00408680 sp=004018d4
fp=00000000 ea=00421764 ba=00000000 ra=00000000
status=00000001 estatus=00000001 bstatus=00000000 ienable=00000004
ipending=00000000 cpuid=00000000 reserved=00000000 exception=00000008
pteaddr=00000000 tlbacc=00000000 tlbmisc=00000000 reserved=00000000
badaddr=00000000 config=00000000 mpubase=00000000 mpuacc=00000000
reserved=00000000 reserved=00000000 reserved=00000000 reserved=00000000
reserved=00000000 reserved=00000000 reserved=00000000 reserved=00000000
reserved=00000000 reserved=00000000 reserved=00000000 reserved=00000000
reserved=00000000 reserved=00000000 reserved=00000000 reserved=00000000
rpc=00000000 mmu write: VPN=00000 PID 00 TLBACC 00000000


make[3]: *** [run] Aborted (core dumped)
make[3]: Leaving directory `/w/workspace/zephyr-sanity/sanity-out/qemu_nios2/tests/crypto/test_ecc_dh/test'
make[2]: *** [sub-make] Error 2
make[2]: Target `run' not remade because of errors.
make[2]: Leaving directory `/w/workspace/zephyr-sanity'
make[1]: *** [run] Error 2
make[1]: Leaving directory `/w/workspace/zephyr-sanity/tests/crypto/test_ecc_dh'
--------------------sanity-out/qemu_nios2/tests/crypto/test_ecc_dh/test/run.log---------------------
0 of 1 tests passed with 0 warnings in 7 seconds
Build step 'Execute shell' marked build as failure


zephyr/refs/tags/v1.2.0: tag build zephyr-kernel-1.2.0 Still Failing

donotreply@...
 

zephyr/refs/tags/v1.2.0: tag build zephyr-kernel-1.2.0 Still Failing

Check console output at https://jenkins.zephyrproject.org/sandbox/job/zephyr-tag/18/ to view the results.


zephyr/refs/tags/v1.2.0: tag build zephyr-kernel-1.2.0 Still Failing

donotreply@...
 

zephyr/refs/tags/v1.2.0: tag build zephyr-kernel-1.2.0 Still Failing

Check console output at https://jenkins.zephyrproject.org/sandbox/job/zephyr-tag/19/ to view the results.


zephyr/refs/tags/v1.2.0: tag build zephyr-kernel-1.2.0 Still Failing

donotreply@...
 

zephyr/refs/tags/v1.2.0: tag build zephyr-kernel-1.2.0 Still Failing

Check console output at https://jenkins.zephyrproject.org/sandbox/job/zephyr-tag/20/ to view the results.


zephyr/refs/tags/v1.2.0: tag build zephyr-kernel-1.2.0 Still Failing

donotreply@...
 

zephyr/refs/tags/v1.2.0: tag build zephyr-kernel-1.2.0 Still Failing

Check console output at https://jenkins.zephyrproject.org/sandbox/job/zephyr-tag/21/ to view the results.


zephyr/refs/tags/v1.2.0: tag build zephyr-kernel-1.2.0 Still Failing

donotreply@...
 

zephyr/refs/tags/v1.2.0: tag build zephyr-kernel-1.2.0 Still Failing

Check console output at https://jenkins.zephyrproject.org/sandbox/job/zephyr-tag/22/ to view the results.


zephyr/refs/tags/v1.3.0: tag build zephyr-kernel-1.3.0 Still Failing

donotreply@...
 

zephyr/refs/tags/v1.3.0: tag build zephyr-kernel-1.3.0 Still Failing

Check console output at https://jenkins.zephyrproject.org/sandbox/job/zephyr-tag/23/ to view the results.


zephyr/refs/tags/v1.5.0: tag build zephyr-kernel-1.5.0 Still Failing

donotreply@...
 

zephyr/refs/tags/v1.5.0: tag build zephyr-kernel-1.5.0 Still Failing

Check console output at https://jenkins.zephyrproject.org/sandbox/job/zephyr-tag/24/ to view the results.


zephyr/refs/tags/v1.7.0: tag build zephyr-kernel-1.7.0 Still Failing

donotreply@...
 

zephyr/refs/tags/v1.7.0: tag build zephyr-kernel-1.7.0 Still Failing

Check console output at https://jenkins.zephyrproject.org/sandbox/job/zephyr-tag/25/ to view the results.


zephyr/refs/tags/v1.5.0: tag build zephyr-kernel-1.5.0 Still Failing

donotreply@...
 

zephyr/refs/tags/v1.5.0: tag build zephyr-kernel-1.5.0 Still Failing

Check console output at https://jenkins.zephyrproject.org/sandbox/job/zephyr-tag/26/ to view the results.


zephyr/refs/tags/v1.7.0: tag build zephyr-kernel-1.7.0 Still Failing

donotreply@...
 

zephyr/refs/tags/v1.7.0: tag build zephyr-kernel-1.7.0 Still Failing

Check console output at https://jenkins.zephyrproject.org/sandbox/job/zephyr-tag/27/ to view the results.


zephyr/refs/tags/v1.5.0: tag build zephyr-kernel-1.5.0 Aborted

donotreply@...
 

zephyr/refs/tags/v1.5.0: tag build zephyr-kernel-1.5.0 Aborted

Check console output at https://jenkins.zephyrproject.org/sandbox/job/zephyr-tag/28/ to view the results.


zephyr/refs/tags/v1.3.0: tag build zephyr-kernel-1.3.0 Aborted

donotreply@...
 

zephyr/refs/tags/v1.3.0: tag build zephyr-kernel-1.3.0 Aborted

Check console output at https://jenkins.zephyrproject.org/sandbox/job/zephyr-tag/29/ to view the results.


zephyr/refs/tags/v1.2.0: tag build zephyr-kernel-1.2.0 Failure

donotreply@...
 

zephyr/refs/tags/v1.2.0: tag build zephyr-kernel-1.2.0 Failure

Check console output at https://jenkins.zephyrproject.org/sandbox/job/zephyr-tag/30/ to view the results.


zephyr/master: daily build zephyr-kernel-1.7.99-170323-1530178 Failure

donotreply@...
 

zephyr/master: daily build zephyr-kernel-1.7.99-170323-1530178 Failure



job zephyr-sanity build number 628 failed
see: https://jenkins.zephyrproject.org/job/zephyr-sanity/628/

***** BOOTING ZEPHYR OS v1.7.99 - BUILD: Mar 24 2017 07:00:10 *****
ASSERTION FAIL [num_events > 0] @ /w/workspace/zephyr-sanity/kernel/poll.c:177:
zero events
--------------------------sanity-out/qemu_x86/tests/net/nbuf/test/qemu.log--------------------------
qemu_x86 tests/net/lib/http_header_fields/test FAILED: timeout
Generating LALR tables
Platform 'arduino_101_mcuboot' not specified in any arch .ini file and will not be tested
-----------------sanity-out/qemu_x86/tests/net/lib/http_header_fields/test/qemu.log-----------------
***** BOOTING ZEPHYR OS v1.7.99 - BUILD: Mar 24 2017 07:00:47 *****
ASSERTION FAIL [num_events > 0] @ /w/workspace/zephyr-sanity/kernel/poll.c:177:
zero events
-----------------sanity-out/qemu_x86/tests/net/lib/http_header_fields/test/qemu.log-----------------
qemu_x86 tests/net/lib/mqtt_packet/test FAILED: timeout
--------------------sanity-out/qemu_x86/tests/net/lib/mqtt_packet/test/qemu.log---------------------
***** BOOTING ZEPHYR OS v1.7.99 - BUILD: Mar 24 2017 07:01:00 *****
ASSERTION FAIL [num_events > 0] @ /w/workspace/zephyr-sanity/kernel/poll.c:177:
zero events
--------------------sanity-out/qemu_x86/tests/net/lib/mqtt_packet/test/qemu.log---------------------
qemu_x86 tests/net/lib/dns_packet/test FAILED: timeout
---------------------sanity-out/qemu_x86/tests/net/lib/dns_packet/test/qemu.log---------------------
***** BOOTING ZEPHYR OS v1.7.99 - BUILD: Mar 24 2017 07:00:35 *****
ASSERTION FAIL [num_events > 0] @ /w/workspace/zephyr-sanity/kernel/poll.c:177:
zero events
---------------------sanity-out/qemu_x86/tests/net/lib/dns_packet/test/qemu.log---------------------
1 of 145 tests passed with 0 warnings in 10947 seconds
Extra environment setting:
CONFIG_ASSERT=y
CONFIG_DEBUG=y
Build step 'Execute shell' marked build as failure


job zephyr-sanity build number 627 failed
see: https://jenkins.zephyrproject.org/job/zephyr-sanity/627/

[PASS] Test #1: ECDH - NIST-p256
[PASS] Test #2: ECC KeyGen - NIST-p256
[PASS] Test #3: PubKeyVerify - NIST-p256-SHA2-256
Shared secrets are not identical!
Shared secret 1 = 1b6754c9 211627f2 3a94609e a10c2428 9a7a75db 4c9c7302 8745766c 4db45243
Shared secret 2 = 58b32a59 dab409a7 d517f9bd 81ef1b84 580c1410 a4172a10 9dc0b41c 0c975179
Private key 1 = 00000000 00000000 00000000 00000000 00000000 00000000 00000000 00000000
Private key 2 = 5ea33494 0656b13e bf6dd2e1 b6c69a82 9a167e4a 54ffde2d dd0ee94e b2e5c684
[FAIL] Test #4: Monte Carlo (Randomized EC-DH key-exchange) - NIST-p256
===================================================================
FAIL - main.
===================================================================
PROJECT EXECUTION FAILED
------------------sanity-out/qemu_cortex_m3/tests/crypto/test_ecc_dh/test/qemu.log------------------
qemu_x86 tests/net/udp/test FAILED: timeout
--------------------------sanity-out/qemu_x86/tests/net/udp/test/qemu.log---------------------------
***** BOOTING ZEPHYR OS v1.7.99 - BUILD: Mar 24 2017 01:59:29 *****
***** CPU exception 7
Current thread ID = 0x00111180
Faulting segment:address = 0x8:0x10f3e9
eax: 0x80, ebx: 0x0, ecx: 0x111180, edx: 0x10f024
esi: 0x0, edi: 0x1, ebp: 00, esp: 0x11156c
eflags: 0x282
Fatal fault in essential thread! Spinning...
--------------------------sanity-out/qemu_x86/tests/net/udp/test/qemu.log---------------------------
0 of 33 tests passed with 0 warnings in 90 seconds
Extra environment setting:
CONFIG_DEBUG=y
Build step 'Execute shell' marked build as failure


job zephyr-sanity build number 626 failed
see: https://jenkins.zephyrproject.org/job/zephyr-sanity/626/

-------------------------sanity-out/qemu_x86/tests/net/utils/test/qemu.log--------------------------
qemu_x86 tests/net/neighbor/test FAILED: timeout
------------------------sanity-out/qemu_x86/tests/net/neighbor/test/qemu.log------------------------
***** BOOTING ZEPHYR OS v1.7.99 - BUILD: Mar 24 2017 07:11:29 *****
ASSERTION FAIL [num_events > 0] @ /w/workspace/zephyr-sanity/kernel/poll.c:177:
zero events
------------------------sanity-out/qemu_x86/tests/net/neighbor/test/qemu.log------------------------
qemu_x86 tests/net/lib/http_header_fields/test FAILED: timeout
-----------------sanity-out/qemu_x86/tests/net/lib/http_header_fields/test/qemu.log-----------------
***** BOOTING ZEPHYR OS v1.7.99 - BUILD: Mar 24 2017 07:11:57 *****
ASSERTION FAIL [num_events > 0] @ /w/workspace/zephyr-sanity/kernel/poll.c:177:
zero events
-----------------sanity-out/qemu_x86/tests/net/lib/http_header_fields/test/qemu.log-----------------
qemu_x86 tests/net/trickle/test FAILED: timeout
------------------------sanity-out/qemu_x86/tests/net/trickle/test/qemu.log-------------------------
***** BOOTING ZEPHYR OS v1.7.99 - BUILD: Mar 24 2017 07:12:09 *****
ASSERTION FAIL [num_events > 0] @ /w/workspace/zephyr-sanity/kernel/poll.c:177:
zero events
------------------------sanity-out/qemu_x86/tests/net/trickle/test/qemu.log-------------------------
qemu_x86 tests/net/lib/dns_packet/test FAILED: timeout
---------------------sanity-out/qemu_x86/tests/net/lib/dns_packet/test/qemu.log---------------------
***** BOOTING ZEPHYR OS v1.7.99 - BUILD: Mar 24 2017 07:11:58 *****
ASSERTION FAIL [num_events > 0] @ /w/workspace/zephyr-sanity/kernel/poll.c:177:
zero events
---------------------sanity-out/qemu_x86/tests/net/lib/dns_packet/test/qemu.log---------------------
0 of 120 tests passed with 0 warnings in 10917 seconds
Extra environment setting:
CONFIG_ASSERT=y
Build step 'Execute shell' marked build as failure


job zephyr-sanity build number 625 failed
see: https://jenkins.zephyrproject.org/job/zephyr-sanity/625/

zero=00000000 at=00000000 r2=00000001 r3=00201000
r4=00000000 r5=0000000a r6=00423630 r7=004017bc
r8=004016c4 r9=00000001 r10=00000001 r11=00000000
r12=00000040 r13=00000011 r14=0040162c r15=00000000
r16=00000000 r17=00000000 r18=00000000 r19=00000000
r20=00000000 r21=00000000 r22=00000000 r23=00000000
et=00000001 bt=00000000 gp=00408680 sp=004018d4
fp=00000000 ea=004216bc ba=00000000 ra=00000000
status=00000001 estatus=00000001 bstatus=00000000 ienable=00000004
ipending=00000000 cpuid=00000000 reserved=00000000 exception=00000008
pteaddr=00000000 tlbacc=00000000 tlbmisc=00000000 reserved=00000000
badaddr=00000000 config=00000000 mpubase=00000000 mpuacc=00000000
reserved=00000000 reserved=00000000 reserved=00000000 reserved=00000000
reserved=00000000 reserved=00000000 reserved=00000000 reserved=00000000
reserved=00000000 reserved=00000000 reserved=00000000 reserved=00000000
reserved=00000000 reserved=00000000 reserved=00000000 reserved=00000000
rpc=00000000 mmu write: VPN=00000 PID 00 TLBACC 00000000


make[3]: *** [run] Aborted (core dumped)
make[3]: Leaving directory `/w/workspace/zephyr-sanity/sanity-out/qemu_nios2/tests/crypto/test_ecc_dh/test'
make[2]: *** [sub-make] Error 2
make[2]: Target `run' not remade because of errors.
make[2]: Leaving directory `/w/workspace/zephyr-sanity'
make[1]: *** [run] Error 2
make[1]: Leaving directory `/w/workspace/zephyr-sanity/tests/crypto/test_ecc_dh'
--------------------sanity-out/qemu_nios2/tests/crypto/test_ecc_dh/test/run.log---------------------
0 of 1 tests passed with 0 warnings in 4 seconds
Build step 'Execute shell' marked build as failure


zephyr/refs/tags/v1.6.0: tag build zephyr-kernel-1.6.0 Still Unstable

donotreply@...
 

zephyr/refs/tags/v1.6.0: tag build zephyr-kernel-1.6.0 Still Unstable

Check console output at https://jenkins.zephyrproject.org/job/zephyr-tag/25/ to view the results.


zephyr/refs/tags/v1.5.0: tag build zephyr-kernel-1.5.0 Still Unstable

donotreply@...
 

zephyr/refs/tags/v1.5.0: tag build zephyr-kernel-1.5.0 Still Unstable

Check console output at https://jenkins.zephyrproject.org/job/zephyr-tag/26/ to view the results.


zephyr/refs/tags/v1.4.0: tag build zephyr-kernel-1.4.0 Still Unstable

donotreply@...
 

zephyr/refs/tags/v1.4.0: tag build zephyr-kernel-1.4.0 Still Unstable

Check console output at https://jenkins.zephyrproject.org/job/zephyr-tag/27/ to view the results.


zephyr/refs/tags/v1.3.0: tag build zephyr-kernel-1.3.0 Still Unstable

donotreply@...
 

zephyr/refs/tags/v1.3.0: tag build zephyr-kernel-1.3.0 Still Unstable

Check console output at https://jenkins.zephyrproject.org/job/zephyr-tag/28/ to view the results.

141 - 160 of 2863