Date   

zephyr/refs/tags/v1.2.0: tag build zephyr-kernel-1.2.0 Still Unstable

donotreply@...
 

zephyr/refs/tags/v1.2.0: tag build zephyr-kernel-1.2.0 Still Unstable

Check console output at https://jenkins.zephyrproject.org/job/zephyr-tag/29/ to view the results.


zephyr/refs/tags/v1.1.0: tag build zephyr-kernel-1.1.0 Still Unstable

donotreply@...
 

zephyr/refs/tags/v1.1.0: tag build zephyr-kernel-1.1.0 Still Unstable

Check console output at https://jenkins.zephyrproject.org/job/zephyr-tag/30/ to view the results.


zephyr/master: daily build zephyr-kernel-1.7.99-170324-7942eae Failure

donotreply@...
 

zephyr/master: daily build zephyr-kernel-1.7.99-170324-7942eae Failure



job zephyr-sanity build number 632 failed
see: https://jenkins.zephyrproject.org/job/zephyr-sanity/632/

--------------------------sanity-out/qemu_x86/tests/net/nbuf/test/qemu.log--------------------------
qemu_x86 tests/net/icmpv6/test FAILED: timeout
-------------------------sanity-out/qemu_x86/tests/net/icmpv6/test/qemu.log-------------------------
***** BOOTING ZEPHYR OS v1.7.99 - BUILD: Mar 25 2017 05:25:20 *****
ASSERTION FAIL [num_events > 0] @ /w/workspace/zephyr-sanity/kernel/poll.c:177:
zero events
-------------------------sanity-out/qemu_x86/tests/net/icmpv6/test/qemu.log-------------------------
qemu_x86 tests/net/udp/test FAILED: timeout
--------------------------sanity-out/qemu_x86/tests/net/udp/test/qemu.log---------------------------
***** BOOTING ZEPHYR OS v1.7.99 - BUILD: Mar 25 2017 05:25:34 *****
***** CPU exception 6
Current thread ID = 0x00112240
Faulting segment:address = 0x8:0x1104cc
eax: 0xd5, ebx: 0x0, ecx: 0x112240, edx: 0x1101e0
esi: 0x0, edi: 0x0, ebp: 00, esp: 0x11262c
eflags: 0x213
Fatal fault in essential thread! Spinning...
--------------------------sanity-out/qemu_x86/tests/net/udp/test/qemu.log---------------------------
qemu_x86 tests/net/lib/dns_packet/test FAILED: timeout
---------------------sanity-out/qemu_x86/tests/net/lib/dns_packet/test/qemu.log---------------------
***** BOOTING ZEPHYR OS v1.7.99 - BUILD: Mar 25 2017 05:24:28 *****
ASSERTION FAIL [num_events > 0] @ /w/workspace/zephyr-sanity/kernel/poll.c:177:
zero events
---------------------sanity-out/qemu_x86/tests/net/lib/dns_packet/test/qemu.log---------------------
1 of 145 tests passed with 0 warnings in 10897 seconds
Extra environment setting:
CONFIG_ASSERT=y
CONFIG_DEBUG=y
Build step 'Execute shell' marked build as failure


job zephyr-sanity build number 631 failed
see: https://jenkins.zephyrproject.org/job/zephyr-sanity/631/

[PASS] Test #1: ECDH - NIST-p256
[PASS] Test #2: ECC KeyGen - NIST-p256
[PASS] Test #3: PubKeyVerify - NIST-p256-SHA2-256
Shared secrets are not identical!
Shared secret 1 = 977bd76f 52111b06 a2826eca c3399722 b0ff82c4 117e9fac 6531a1f2 1475b215
Shared secret 2 = 70332d1e 8b3930e3 0164cbbd 7eeac796 05440b03 6a6c9126 68052a1b 0f3c2fbf
Private key 1 = 00000000 00000000 00000000 00000000 00000000 00000000 00000000 00000000
Private key 2 = 5ea52b7e 066085e3 bf75afed b6ce778e 9a1c646c 54ffde2e dd0cf20d b2e3cee9
[FAIL] Test #4: Monte Carlo (Randomized EC-DH key-exchange) - NIST-p256
===================================================================
FAIL - main.
===================================================================
PROJECT EXECUTION FAILED
------------------sanity-out/qemu_cortex_m3/tests/crypto/test_ecc_dh/test/qemu.log------------------
qemu_x86 tests/net/udp/test FAILED: timeout
--------------------------sanity-out/qemu_x86/tests/net/udp/test/qemu.log---------------------------
***** BOOTING ZEPHYR OS v1.7.99 - BUILD: Mar 25 2017 01:01:19 *****
***** CPU exception 7
Current thread ID = 0x00111180
Faulting segment:address = 0x8:0x10f3e9
eax: 0x80, ebx: 0x0, ecx: 0x111180, edx: 0x10f024
esi: 0x0, edi: 0x1, ebp: 00, esp: 0x11156c
eflags: 0x282
Fatal fault in essential thread! Spinning...
--------------------------sanity-out/qemu_x86/tests/net/udp/test/qemu.log---------------------------
0 of 33 tests passed with 0 warnings in 90 seconds
Extra environment setting:
CONFIG_DEBUG=y
Build step 'Execute shell' marked build as failure


job zephyr-sanity build number 630 failed
see: https://jenkins.zephyrproject.org/job/zephyr-sanity/630/

------------------------sanity-out/qemu_x86/tests/net/trickle/test/qemu.log-------------------------
qemu_x86 tests/net/lib/http_header_fields/test FAILED: timeout
-----------------sanity-out/qemu_x86/tests/net/lib/http_header_fields/test/qemu.log-----------------
***** BOOTING ZEPHYR OS v1.7.99 - BUILD: Mar 25 2017 05:23:46 *****
ASSERTION FAIL [num_events > 0] @ /w/workspace/zephyr-sanity/kernel/poll.c:177:
zero events
-----------------sanity-out/qemu_x86/tests/net/lib/http_header_fields/test/qemu.log-----------------
qemu_x86 tests/net/utils/test FAILED: timeout
-------------------------sanity-out/qemu_x86/tests/net/utils/test/qemu.log--------------------------
***** BOOTING ZEPHYR OS v1.7.99 - BUILD: Mar 25 2017 05:23:59 *****
ASSERTION FAIL [num_events > 0] @ /w/workspace/zephyr-sanity/kernel/poll.c:177:
zero events
-------------------------sanity-out/qemu_x86/tests/net/utils/test/qemu.log--------------------------
qemu_x86 tests/net/lib/mqtt_packet/test FAILED: timeout
--------------------sanity-out/qemu_x86/tests/net/lib/mqtt_packet/test/qemu.log---------------------
***** BOOTING ZEPHYR OS v1.7.99 - BUILD: Mar 25 2017 05:24:10 *****
ASSERTION FAIL [num_events > 0] @ /w/workspace/zephyr-sanity/kernel/poll.c:177:
zero events
--------------------sanity-out/qemu_x86/tests/net/lib/mqtt_packet/test/qemu.log---------------------
qemu_x86 tests/net/lib/dns_packet/test FAILED: timeout
---------------------sanity-out/qemu_x86/tests/net/lib/dns_packet/test/qemu.log---------------------
***** BOOTING ZEPHYR OS v1.7.99 - BUILD: Mar 25 2017 05:22:39 *****
ASSERTION FAIL [num_events > 0] @ /w/workspace/zephyr-sanity/kernel/poll.c:177:
zero events
---------------------sanity-out/qemu_x86/tests/net/lib/dns_packet/test/qemu.log---------------------
0 of 119 tests passed with 0 warnings in 10825 seconds
Extra environment setting:
CONFIG_ASSERT=y
Build step 'Execute shell' marked build as failure


job zephyr-sanity build number 629 failed
see: https://jenkins.zephyrproject.org/job/zephyr-sanity/629/

zero=00000000 at=00000000 r2=00000001 r3=00201000
r4=00000000 r5=0000000a r6=00423630 r7=004017bc
r8=004016c4 r9=00000001 r10=00000001 r11=00000000
r12=00000040 r13=00000011 r14=0040162c r15=00000000
r16=00000000 r17=00000000 r18=00000000 r19=00000000
r20=00000000 r21=00000000 r22=00000000 r23=00000000
et=00000001 bt=00000000 gp=00408680 sp=004018d4
fp=00000000 ea=00420c6c ba=00000000 ra=00000000
status=00000001 estatus=00000001 bstatus=00000000 ienable=00000004
ipending=00000000 cpuid=00000000 reserved=00000000 exception=00000008
pteaddr=00000000 tlbacc=00000000 tlbmisc=00000000 reserved=00000000
badaddr=00000000 config=00000000 mpubase=00000000 mpuacc=00000000
reserved=00000000 reserved=00000000 reserved=00000000 reserved=00000000
reserved=00000000 reserved=00000000 reserved=00000000 reserved=00000000
reserved=00000000 reserved=00000000 reserved=00000000 reserved=00000000
reserved=00000000 reserved=00000000 reserved=00000000 reserved=00000000
rpc=00000000 mmu write: VPN=00000 PID 00 TLBACC 00000000


make[3]: *** [run] Aborted (core dumped)
make[3]: Leaving directory `/w/workspace/zephyr-sanity/sanity-out/qemu_nios2/tests/crypto/test_ecc_dh/test'
make[2]: *** [sub-make] Error 2
make[2]: Target `run' not remade because of errors.
make[2]: Leaving directory `/w/workspace/zephyr-sanity'
make[1]: *** [run] Error 2
make[1]: Leaving directory `/w/workspace/zephyr-sanity/tests/crypto/test_ecc_dh'
--------------------sanity-out/qemu_nios2/tests/crypto/test_ecc_dh/test/run.log---------------------
0 of 1 tests passed with 0 warnings in 4 seconds
Build step 'Execute shell' marked build as failure


zephyr/master: daily build zephyr-kernel-1.7.99-170325-c3f79e1 Failure

donotreply@...
 

zephyr/master: daily build zephyr-kernel-1.7.99-170325-c3f79e1 Failure



job zephyr-sanity build number 636 failed
see: https://jenkins.zephyrproject.org/job/zephyr-sanity/636/

|-----------------------------------------------------------------------------|
| non-matching sizes (1_TO_N) to higher priority |
|-----------------------------------------------------------------------------|
| size(B) | time/packet (nsec) | KB/sec |
|-----------------------------------------------------------------------------|
| put | get | no buf | small buf| big buf | no buf | small buf| big buf |
|-----------------------------------------------------------------------------|
| 8| 4096| 1197| 950| 1006| 6683| 8421| 7952|
| 16| 2048| 1775| 1051| 1023| 9014| 15223| 15640|
| 32| 1024| 1217| 1199| 1268| 26294| 26688| 25236|
| 64| 512| 1665| 2026| 1856| 38438| 31589| 34482|
| 128| 256| 5143| 4831| 3051| 24888| 26495| 41953|
| 256| 128| 33762| 7553| 6450| 7582| 33893| 39689|
| 512| 64| 26160| 19187| 16902| 19571| 26684| 30292|
| 1024| 32| 99050| 45037| 39652| 10338| 22736| 25824|
----------------sanity-out/qemu_x86/tests/legacy/benchmark/app_kernel/test/qemu.log-----------------
qemu_x86 tests/net/lib/dns_packet/test FAILED: timeout
---------------------sanity-out/qemu_x86/tests/net/lib/dns_packet/test/qemu.log---------------------
***** BOOTING ZEPHYR OS v1.7.99 - BUILD: Mar 26 2017 06:30:25 *****
ASSERTION FAIL [num_events > 0] @ /w/workspace/zephyr-sanity/kernel/poll.c:177:
zero events
---------------------sanity-out/qemu_x86/tests/net/lib/dns_packet/test/qemu.log---------------------
Generating LALR tables
Platform 'arduino_101_mcuboot' not specified in any arch .ini file and will not be tested
0 of 143 tests passed with 0 warnings in 10836 seconds
Extra environment setting:
CONFIG_ASSERT=y
CONFIG_DEBUG=y
Build step 'Execute shell' marked build as failure


job zephyr-sanity build number 635 failed
see: https://jenkins.zephyrproject.org/job/zephyr-sanity/635/

| 16| 16| 6533| 6584| 6627| 2449| 2430| 2414|
| 32| 32| 6736| 10586| 6718| 4750| 3022| 4763|
| 64| 64| 6995| 6922| 7289| 9149| 9245| 8780|
| 128| 128| 5396| 7927| 7835| 23721| 16147| 16336|
| 256| 256| 9087| 9310| 7325| 28172| 27497| 34948|
| 512| 512| 11957| 11920| 11921| 42820| 42953| 42949|
| 1024| 1024| 25380| 17669| 17470| 40346| 57954| 58614|
| 2048| 2048| 29683| 31242| 28608| 68995| 65552| 71588|
| 4096| 4096| 54255| 50026| 51908| 75495| 81877| 78908|
|-----------------------------------------------------------------------------|
| non-matching sizes (1_TO_N) to higher priority |
|-----------------------------------------------------------------------------|
| size(B) | time/packet (nsec) | KB/sec |
|-----------------------------------------------------------------------------|
| put | get | no buf | small buf| big buf | no buf | small buf| big buf |
|-----------------------------------------------------------------------------|
| 8| 4096| 2096| 1754| 1819| 3816| 4561| 4398|
| 16| 2048| 2039| 1967| 2144| 7846| 8134| 7462|
| 32| 1024| 2501| 2634| 2507| 12794| 12148| 12764|
| 64| 512| 3938| 3074| 3782| 16251| 20819| 16922|
| 128| 256| 6512| 7827| 6797| 19656| 16353| 18831|
| 256| 128| 43971| 14945| 15872| 5822| 17129| 16129|
| 512| 64| 49987| 37930| 30947| 10242| 13498| 16544|
| 1024| 32| 110652| 98937| 88070| 9254| 10350| 11627|
----------------sanity-out/qemu_x86/tests/legacy/benchmark/app_kernel/test/qemu.log-----------------
1 of 33 tests passed with 0 warnings in 209 seconds
Extra environment setting:
CONFIG_DEBUG=y
Build step 'Execute shell' marked build as failure


job zephyr-sanity build number 634 failed
see: https://jenkins.zephyrproject.org/job/zephyr-sanity/634/

| 4096| 4096| 64738| 32765| 64561| 63270| 125011| 63443|
|-----------------------------------------------------------------------------|
| non-matching sizes (1_TO_N) to higher priority |
|-----------------------------------------------------------------------------|
| size(B) | time/packet (nsec) | KB/sec |
|-----------------------------------------------------------------------------|
| put | get | no buf | small buf| big buf | no buf | small buf| big buf |
|-----------------------------------------------------------------------------|
| 8| 4096| 1272| 1167| 1234| 6289| 6855| 6482|
| 16| 2048| 1305| 1336| 1247| 12260| 11976| 12830|
| 32| 1024| 1536| 1691| 2533| 20833| 18923| 12633|
| 64| 512| 3523| 2322| 1902| 18166| 27562| 33648|
| 128| 256| 3583| 6383| 6808| 35724| 20053| 18801|
| 256| 128| 27016| 11801| 13649| 9475| 21693| 18755|
| 512| 64| 31557| 22252| 29596| 16224| 23009| 17299|
| 1024| 32| 79010| 60097| 48702| 12960| 17039| 21025|
-------------sanity-out/qemu_x86_iamcu/tests/legacy/benchmark/app_kernel/test/qemu.log--------------
qemu_x86 tests/net/lib/dns_packet/test FAILED: timeout
---------------------sanity-out/qemu_x86/tests/net/lib/dns_packet/test/qemu.log---------------------
***** BOOTING ZEPHYR OS v1.7.99 - BUILD: Mar 26 2017 05:12:37 *****
ASSERTION FAIL [num_events > 0] @ /w/workspace/zephyr-sanity/kernel/poll.c:177:
zero events
---------------------sanity-out/qemu_x86/tests/net/lib/dns_packet/test/qemu.log---------------------
Generating LALR tables
Platform 'arduino_101_mcuboot' not specified in any arch .ini file and will not be tested
1 of 121 tests passed with 0 warnings in 10919 seconds
Extra environment setting:
CONFIG_ASSERT=y
Build step 'Execute shell' marked build as failure


job zephyr-sanity build number 633 failed
see: https://jenkins.zephyrproject.org/job/zephyr-sanity/633/

| 16| 16| 6966| 11034| 8801| 2296| 1450| 1817|
| 32| 32| 7271| 7072| 7090| 4401| 4524| 4513|
| 64| 64| 7534| 7573| 7659| 8494| 8451| 8356|
| 128| 128| 12270| 12115| 15158| 10431| 10565| 8444|
| 256| 256| 10478| 10445| 10564| 24432| 24509| 24233|
| 512| 512| 14362| 14256| 14315| 35649| 35914| 35766|
| 1024| 1024| 22520| 22660| 22535| 45470| 45189| 45440|
| 2048| 2048| 38034| 68174| 40664| 53846| 30040| 50363|
| 4096| 4096| 69043| 69249| 71718| 59325| 59148| 57112|
|-----------------------------------------------------------------------------|
| non-matching sizes (1_TO_N) to higher priority |
|-----------------------------------------------------------------------------|
| size(B) | time/packet (nsec) | KB/sec |
|-----------------------------------------------------------------------------|
| put | get | no buf | small buf| big buf | no buf | small buf| big buf |
|-----------------------------------------------------------------------------|
| 8| 4096| 2514| 2157| 2299| 3182| 3708| 3479|
| 16| 2048| 2407| 2511| 2285| 6647| 6371| 7002|
| 32| 1024| 2788| 2831| 2720| 11477| 11303| 11764|
| 64| 512| 3826| 3838| 4928| 16727| 16675| 12987|
| 128| 256| 7611| 7456| 6944| 16817| 17167| 18433|
| 256| 128| 44035| 17775| 15150| 5813| 14402| 16897|
| 512| 64| 50660| 39997| 37463| 10106| 12800| 13666|
| 1024| 32| 110925| 120740| 103307| 9231| 8481| 9912|
Generating LALR tables
Platform 'arduino_101_mcuboot' not specified in any arch .ini file and will not be tested
-------------sanity-out/qemu_x86_iamcu/tests/legacy/benchmark/app_kernel/test/qemu.log--------------
0 of 2 tests passed with 0 warnings in 186 seconds
Build step 'Execute shell' marked build as failure


zephyr/master: daily build zephyr-kernel-1.7.99-170326-f475d2c Failure

donotreply@...
 

zephyr/master: daily build zephyr-kernel-1.7.99-170326-f475d2c Failure



job zephyr-sanity build number 640 failed
see: https://jenkins.zephyrproject.org/job/zephyr-sanity/640/

make[2]: Leaving directory `/w/workspace/zephyr-sanity'
make[1]: *** [all] Error 2
make[1]: Leaving directory `/w/workspace/zephyr-sanity/tests/bluetooth/init'
------------------sanity-out/qemu_cortex_m3/tests/bluetooth/init/test_9/build.log-------------------
qemu_x86 tests/net/lib/http_header_fields/test FAILED: timeout
Generating LALR tables
Platform 'arduino_101_mcuboot' not specified in any arch .ini file and will not be tested
-----------------sanity-out/qemu_x86/tests/net/lib/http_header_fields/test/qemu.log-----------------
***** BOOTING ZEPHYR OS v1.7.99 - BUILD: Mar 27 2017 09:38:23 *****
ASSERTION FAIL [num_events > 0] @ /w/workspace/zephyr-sanity/kernel/poll.c:177:
zero events
-----------------sanity-out/qemu_x86/tests/net/lib/http_header_fields/test/qemu.log-----------------
qemu_x86 tests/net/icmpv6/test FAILED: timeout
-------------------------sanity-out/qemu_x86/tests/net/icmpv6/test/qemu.log-------------------------
***** BOOTING ZEPHYR OS v1.7.99 - BUILD: Mar 27 2017 09:38:48 *****
ASSERTION FAIL [num_events > 0] @ /w/workspace/zephyr-sanity/kernel/poll.c:177:
zero events
-------------------------sanity-out/qemu_x86/tests/net/icmpv6/test/qemu.log-------------------------
qemu_x86 tests/net/lib/dns_packet/test FAILED: timeout
---------------------sanity-out/qemu_x86/tests/net/lib/dns_packet/test/qemu.log---------------------
***** BOOTING ZEPHYR OS v1.7.99 - BUILD: Mar 27 2017 09:36:47 *****
ASSERTION FAIL [num_events > 0] @ /w/workspace/zephyr-sanity/kernel/poll.c:177:
zero events
---------------------sanity-out/qemu_x86/tests/net/lib/dns_packet/test/qemu.log---------------------
0 of 143 tests passed with 0 warnings in 10952 seconds
Extra environment setting:
CONFIG_ASSERT=y
CONFIG_DEBUG=y
Build step 'Execute shell' marked build as failure


job zephyr-sanity build number 637 failed
see: https://jenkins.zephyrproject.org/job/zephyr-sanity/637/

| 16| 16| 3417| 6847| 3380| 4682| 2336| 4733|
| 32| 32| 3554| 3501| 3572| 9003| 9140| 8958|
| 64| 64| 3826| 3737| 3750| 16727| 17126| 17066|
| 128| 128| 4280| 4338| 7618| 29906| 29506| 16802|
| 256| 256| 5281| 5261| 5096| 48475| 48659| 50235|
| 512| 512| 8612| 6962| 7025| 59451| 73542| 72882|
| 1024| 1024| 11320| 11251| 10963| 90459| 91014| 93405|
| 2048| 2048| 18490| 18452| 18933| 110762| 110990| 108170|
| 4096| 4096| 33684| 34351| 34157| 121600| 119239| 119916|
|-----------------------------------------------------------------------------|
| non-matching sizes (1_TO_N) to higher priority |
|-----------------------------------------------------------------------------|
| size(B) | time/packet (nsec) | KB/sec |
|-----------------------------------------------------------------------------|
| put | get | no buf | small buf| big buf | no buf | small buf| big buf |
|-----------------------------------------------------------------------------|
| 8| 4096| 2149| 1106| 1148| 3722| 7233| 6968|
| 16| 2048| 1181| 1250| 1268| 13547| 12800| 12618|
| 32| 1024| 1439| 1451| 1460| 22237| 22053| 21917|
| 64| 512| 2004| 1943| 3655| 31936| 32938| 17510|
| 128| 256| 6530| 6559| 7465| 19601| 19515| 17146|
| 256| 128| 42756| 19341| 20120| 5987| 13236| 12723|
| 512| 64| 57281| 22762| 17652| 8938| 22493| 29005|
| 1024| 32| 55015| 57167| 46517| 18613| 17912| 22013|
Generating LALR tables
Platform 'arduino_101_mcuboot' not specified in any arch .ini file and will not be tested
-------------sanity-out/qemu_x86_iamcu/tests/legacy/benchmark/app_kernel/test/qemu.log--------------
0 of 2 tests passed with 0 warnings in 184 seconds
Build step 'Execute shell' marked build as failure


zephyr/master: daily build zephyr-kernel-1.7.99-170327-5c642e8 Failure

donotreply@...
 

zephyr/master: daily build zephyr-kernel-1.7.99-170327-5c642e8 Failure



job zephyr-sanity build number 644 failed
see: https://jenkins.zephyrproject.org/job/zephyr-sanity/644/

| 256| 256| 4378| 4469| 4378| 58474| 57283| 58474|
| 512| 512| 5770| 5603| 5765| 88734| 91379| 88811|
| 1024| 1024| 8376| 8434| 8462| 122254| 121413| 121011|
| 2048| 2048| 20645| 13676| 13723| 99200| 149751| 149238|
| 4096| 4096| 24227| 24295| 25130| 169067| 168594| 162992|
|-----------------------------------------------------------------------------|
| non-matching sizes (1_TO_N) to higher priority |
|-----------------------------------------------------------------------------|
| size(B) | time/packet (nsec) | KB/sec |
|-----------------------------------------------------------------------------|
| put | get | no buf | small buf| big buf | no buf | small buf| big buf |
|-----------------------------------------------------------------------------|
| 8| 4096| 1022| 873| 931| 7827| 9163| 8592|
| 16| 2048| 1164| 923| 924| 13745| 17334| 17316|
| 32| 1024| 1113| 1099| 1173| 28751| 29117| 27280|
Generating LALR tables
Platform 'arduino_101_mcuboot' not specified in any arch .ini file and will not be tested
-------------sanity-out/qemu_x86_iamcu/tests/legacy/benchmark/app_kernel/test/qemu.log--------------
qemu_x86 tests/net/lib/dns_packet/test FAILED: timeout
---------------------sanity-out/qemu_x86/tests/net/lib/dns_packet/test/qemu.log---------------------
***** BOOTING ZEPHYR OS v1.7.99 - BUILD: Mar 28 2017 08:41:14 *****
ASSERTION FAIL [num_events > 0] @ /w/workspace/zephyr-sanity/kernel/poll.c:177:
zero events
---------------------sanity-out/qemu_x86/tests/net/lib/dns_packet/test/qemu.log---------------------
1 of 144 tests passed with 0 warnings in 10945 seconds
Extra environment setting:
CONFIG_ASSERT=y
CONFIG_DEBUG=y
Build step 'Execute shell' marked build as failure


job zephyr-sanity build number 643 failed
see: https://jenkins.zephyrproject.org/job/zephyr-sanity/643/

| 16| 16| 2956| 2986| 3040| 5412| 5358| 5263|
| 32| 32| 3074| 3730| 3101| 10409| 8579| 10319|
| 64| 64| 3237| 3242| 3219| 19771| 19740| 19881|
| 128| 128| 3616| 3576| 3693| 35398| 35794| 34660|
| 256| 256| 4229| 4580| 4208| 60534| 55895| 60836|
| 512| 512| 5488| 5501| 5661| 93294| 93073| 90443|
| 1024| 1024| 8491| 8324| 8386| 120598| 123017| 122108|
| 2048| 2048| 13372| 13536| 13559| 153155| 151300| 151043|
| 4096| 4096| 24301| 24636| 23696| 168552| 166260| 172856|
|-----------------------------------------------------------------------------|
| non-matching sizes (1_TO_N) to higher priority |
|-----------------------------------------------------------------------------|
| size(B) | time/packet (nsec) | KB/sec |
|-----------------------------------------------------------------------------|
| put | get | no buf | small buf| big buf | no buf | small buf| big buf |
|-----------------------------------------------------------------------------|
| 8| 4096| 1038| 863| 881| 7707| 9269| 9080|
| 16| 2048| 930| 953| 885| 17204| 16789| 18079|
| 32| 1024| 1053| 1068| 1070| 30389| 29962| 29906|
| 64| 512| 1529| 1517| 1675| 41857| 42188| 38208|
| 128| 256| 3179| 2936| 3350| 40264| 43596| 38208|
| 256| 128| 25128| 13541| 10030| 10187| 18905| 25523|
| 512| 64| 28120| 15730| 14066| 18207| 32549| 36399|
| 1024| 32| 48705| 49167| 36990| 21024| 20826| 27683|
----------------sanity-out/qemu_x86/tests/legacy/benchmark/app_kernel/test/qemu.log-----------------
1 of 33 tests passed with 0 warnings in 241 seconds
Extra environment setting:
CONFIG_DEBUG=y
Build step 'Execute shell' marked build as failure


job zephyr-sanity build number 642 failed
see: https://jenkins.zephyrproject.org/job/zephyr-sanity/642/

| 4096| 4096| 33157| 34371| 33893| 123533| 119170| 120850|
|-----------------------------------------------------------------------------|
| non-matching sizes (1_TO_N) to higher priority |
|-----------------------------------------------------------------------------|
| size(B) | time/packet (nsec) | KB/sec |
|-----------------------------------------------------------------------------|
| put | get | no buf | small buf| big buf | no buf | small buf| big buf |
|-----------------------------------------------------------------------------|
| 8| 4096| 1393| 1213| 2555| 5743| 6595| 3131|
| 16| 2048| 1260| 1197| 1291| 12698| 13366| 12393|
| 32| 1024| 1427| 1402| 1594| 22424| 22824| 20075|
| 64| 512| 2256| 2025| 2086| 28368| 31604| 30680|
| 128| 256| 3601| 3408| 14427| 35545| 37558| 8872|
| 256| 128| 23492| 9423| 8806| 10897| 27167| 29071|
| 512| 64| 28631| 39898| 46061| 17882| 12832| 11115|
| 1024| 32| 50420| 52602| 46465| 20309| 19466| 22038|
----------------sanity-out/qemu_x86/tests/legacy/benchmark/app_kernel/test/qemu.log-----------------
qemu_x86 tests/net/lib/dns_packet/test FAILED: timeout
---------------------sanity-out/qemu_x86/tests/net/lib/dns_packet/test/qemu.log---------------------
***** BOOTING ZEPHYR OS v1.7.99 - BUILD: Mar 28 2017 09:14:43 *****
ASSERTION FAIL [num_events > 0] @ /w/workspace/zephyr-sanity/kernel/poll.c:177:
zero events
---------------------sanity-out/qemu_x86/tests/net/lib/dns_packet/test/qemu.log---------------------
Generating LALR tables
Platform 'arduino_101_mcuboot' not specified in any arch .ini file and will not be tested
1 of 121 tests passed with 0 warnings in 10955 seconds
Extra environment setting:
CONFIG_ASSERT=y
Build step 'Execute shell' marked build as failure


job zephyr-sanity build number 641 failed
see: https://jenkins.zephyrproject.org/job/zephyr-sanity/641/

| 16| 16| 7308| 7045| 7371| 2189| 2271| 2170|
| 32| 32| 7479| 7102| 7216| 4278| 4505| 4434|
| 64| 64| 7878| 7778| 7830| 8123| 8228| 8173|
| 128| 128| 7514| 4691| 8835| 17034| 27286| 14487|
| 256| 256| 10835| 10634| 5673| 23627| 24073| 45126|
| 512| 512| 14550| 14503| 14443| 35189| 35303| 35449|
| 1024| 1024| 22704| 16603| 16664| 45102| 61675| 61449|
| 2048| 2048| 38398| 19786| 35599| 53336| 103507| 57529|
| 4096| 4096| 65284| 74140| 86757| 62741| 55246| 47212|
|-----------------------------------------------------------------------------|
| non-matching sizes (1_TO_N) to higher priority |
|-----------------------------------------------------------------------------|
| size(B) | time/packet (nsec) | KB/sec |
|-----------------------------------------------------------------------------|
| put | get | no buf | small buf| big buf | no buf | small buf| big buf |
|-----------------------------------------------------------------------------|
| 8| 4096| 1452| 2326| 2442| 5509| 3439| 3276|
| 16| 2048| 2605| 2399| 1498| 6142| 6669| 10680|
| 32| 1024| 1825| 3387| 3267| 17534| 9447| 9794|
| 64| 512| 4925| 4619| 5085| 12994| 13855| 12586|
| 128| 256| 8205| 7976| 5558| 15600| 16048| 23029|
| 256| 128| 51923| 23034| 16253| 4930| 11114| 15750|
| 512| 64| 56637| 48722| 42243| 9040| 10508| 12120|
| 1024| 32| 109307| 127677| 115140| 9368| 8020| 8893|
Generating LALR tables
Platform 'arduino_101_mcuboot' not specified in any arch .ini file and will not be tested
-------------sanity-out/qemu_x86_iamcu/tests/legacy/benchmark/app_kernel/test/qemu.log--------------
0 of 2 tests passed with 0 warnings in 184 seconds
Build step 'Execute shell' marked build as failure


zephyr/master: daily build zephyr-kernel-1.7.99-170328-9d0c020 Failure

donotreply@...
 

zephyr/master: daily build zephyr-kernel-1.7.99-170328-9d0c020 Failure



job zephyr-sanity build number 648 failed
see: https://jenkins.zephyrproject.org/job/zephyr-sanity/648/

|-----------------------------------------------------------------------------|
| non-matching sizes (1_TO_N) to higher priority |
|-----------------------------------------------------------------------------|
| size(B) | time/packet (nsec) | KB/sec |
|-----------------------------------------------------------------------------|
| put | get | no buf | small buf| big buf | no buf | small buf| big buf |
|-----------------------------------------------------------------------------|
| 8| 4096| 1203| 1142| 1076| 6650| 7005| 7434|
| 16| 2048| 1238| 1444| 1147| 12924| 11080| 13949|
| 32| 1024| 1675| 1529| 1241| 19104| 20928| 25785|
| 64| 512| 1986| 2582| 1851| 32225| 24786| 34575|
| 128| 256| 4008| 3960| 3036| 31936| 32323| 42160|
| 256| 128| 65572| 17428| 7513| 3904| 14689| 34074|
| 512| 64| 28865| 35606| 18346| 17737| 14379| 27907|
| 1024| 32| 77827| 58775| 49357| 13157| 17422| 20746|
----------------sanity-out/qemu_x86/tests/legacy/benchmark/app_kernel/test/qemu.log-----------------
qemu_x86 tests/net/lib/dns_packet/test FAILED: timeout
---------------------sanity-out/qemu_x86/tests/net/lib/dns_packet/test/qemu.log---------------------
***** BOOTING ZEPHYR OS v1.7.99 - BUILD: Mar 29 2017 07:23:38 *****
ASSERTION FAIL [num_events > 0] @ /w/workspace/zephyr-sanity/kernel/poll.c:177:
zero events
---------------------sanity-out/qemu_x86/tests/net/lib/dns_packet/test/qemu.log---------------------
Generating LALR tables
Platform 'arduino_101_mcuboot' not specified in any arch .ini file and will not be tested
0 of 143 tests passed with 0 warnings in 10861 seconds
Extra environment setting:
CONFIG_ASSERT=y
CONFIG_DEBUG=y
Build step 'Execute shell' marked build as failure


job zephyr-sanity build number 647 failed
see: https://jenkins.zephyrproject.org/job/zephyr-sanity/647/

| 16| 16| 5161| 4299| 5618| 3100| 3721| 2847|
| 32| 32| 5330| 4367| 6999| 6003| 7327| 4572|
| 64| 64| 3292| 4747| 4889| 19441| 13482| 13090|
| 128| 128| 5627| 8505| 5478| 22747| 15049| 23366|
| 256| 256| 6484| 8203| 11058| 39481| 31208| 23150|
| 512| 512| 8090| 7683| 10325| 63288| 66640| 49588|
| 1024| 1024| 17225| 13728| 16049| 59448| 74592| 63804|
| 2048| 2048| 23804| 22747| 21821| 86035| 90033| 93854|
| 4096| 4096| 50124| 41178| 49975| 81717| 99470| 81960|
|-----------------------------------------------------------------------------|
| non-matching sizes (1_TO_N) to higher priority |
|-----------------------------------------------------------------------------|
| size(B) | time/packet (nsec) | KB/sec |
|-----------------------------------------------------------------------------|
| put | get | no buf | small buf| big buf | no buf | small buf| big buf |
|-----------------------------------------------------------------------------|
| 8| 4096| 1879| 1314| 1792| 4257| 6088| 4464|
| 16| 2048| 1512| 1688| 1434| 10582| 9478| 11157|
| 32| 1024| 2146| 1512| 1699| 14911| 21164| 18834|
| 64| 512| 2407| 3160| 2351| 26589| 20253| 27222|
| 128| 256| 5419| 4828| 11296| 23620| 26512| 11331|
| 256| 128| 36007| 16818| 9986| 7109| 15221| 25635|
| 512| 64| 34982| 17018| 13487| 14636| 30085| 37962|
| 1024| 32| 69792| 47282| 39682| 14672| 21657| 25805|
-------------sanity-out/qemu_x86_iamcu/tests/legacy/benchmark/app_kernel/test/qemu.log--------------
0 of 32 tests passed with 0 warnings in 209 seconds
Extra environment setting:
CONFIG_DEBUG=y
Build step 'Execute shell' marked build as failure


job zephyr-sanity build number 646 failed
see: https://jenkins.zephyrproject.org/job/zephyr-sanity/646/

| 1024| 1024| 11884| 10825| 15102| 86166| 94595| 67805|
| 2048| 2048| 20096| 18463| 18491| 101910| 110924| 110756|
| 4096| 4096| 33752| 33378| 32860| 121355| 122715| 124650|
|-----------------------------------------------------------------------------|
| non-matching sizes (1_TO_N) to higher priority |
|-----------------------------------------------------------------------------|
| size(B) | time/packet (nsec) | KB/sec |
|-----------------------------------------------------------------------------|
| put | get | no buf | small buf| big buf | no buf | small buf| big buf |
|-----------------------------------------------------------------------------|
| 8| 4096| 1465| 1050| 1315| 5460| 7619| 6083|
| 16| 2048| 1233| 1175| 1194| 12976| 13617| 13400|
| 32| 1024| 1593| 1412| 1410| 20087| 22662| 22695|
| 64| 512| 1992| 3913| 2117| 32128| 16355| 30231|
| 128| 256| 3728| 3429| 3354| 34334| 37328| 38163|
| 256| 128| 26401| 10753| 8441| 9696| 23807| 30328|
| 512| 64| 29413| 20840| 18006| 17407| 24568| 28434|
| 1024| 32| 55085| 63272| 48940| 18589| 16184| 20923|
----------------sanity-out/qemu_x86/tests/legacy/benchmark/app_kernel/test/qemu.log-----------------
qemu_x86 tests/net/lib/dns_packet/test FAILED: timeout
---------------------sanity-out/qemu_x86/tests/net/lib/dns_packet/test/qemu.log---------------------
***** BOOTING ZEPHYR OS v1.7.99 - BUILD: Mar 29 2017 05:45:21 *****
ASSERTION FAIL [num_events > 0] @ /w/workspace/zephyr-sanity/kernel/poll.c:177:
zero events
---------------------sanity-out/qemu_x86/tests/net/lib/dns_packet/test/qemu.log---------------------
0 of 121 tests passed with 0 warnings in 10847 seconds
Extra environment setting:
CONFIG_ASSERT=y
Build step 'Execute shell' marked build as failure


job zephyr-sanity build number 645 failed
see: https://jenkins.zephyrproject.org/job/zephyr-sanity/645/

| 16| 16| 6764| 6823| 7335| 2365| 2345| 2181|
| 32| 32| 7098| 7119| 7014| 4508| 4495| 4562|
| 64| 64| 7619| 7624| 7532| 8400| 8394| 8497|
| 128| 128| 8464| 14853| 8957| 15122| 8617| 14290|
| 256| 256| 18907| 12322| 11283| 13539| 20775| 22689|
| 512| 512| 14588| 17631| 19185| 35097| 29039| 26687|
| 1024| 1024| 22640| 39580| 25205| 45229| 25871| 40626|
| 2048| 2048| 72335| 37968| 38128| 28312| 53940| 53713|
| 4096| 4096| 69617| 70892| 70077| 58836| 57778| 58449|
|-----------------------------------------------------------------------------|
| non-matching sizes (1_TO_N) to higher priority |
|-----------------------------------------------------------------------------|
| size(B) | time/packet (nsec) | KB/sec |
|-----------------------------------------------------------------------------|
| put | get | no buf | small buf| big buf | no buf | small buf| big buf |
|-----------------------------------------------------------------------------|
| 8| 4096| 2486| 2230| 2273| 3218| 3587| 3519|
| 16| 2048| 2416| 2381| 2271| 6622| 6719| 7045|
| 32| 1024| 2721| 2693| 3218| 11760| 11882| 9944|
| 64| 512| 3802| 4253| 3710| 16833| 15048| 17250|
| 128| 256| 8232| 7751| 6715| 15549| 16513| 19061|
| 256| 128| 47112| 17512| 16133| 5433| 14618| 15868|
| 512| 64| 61840| 50183| 34325| 8279| 10202| 14916|
| 1024| 32| 112377| 117337| 97700| 9112| 8727| 10481|
Generating LALR tables
Platform 'arduino_101_mcuboot' not specified in any arch .ini file and will not be tested
-------------sanity-out/qemu_x86_iamcu/tests/legacy/benchmark/app_kernel/test/qemu.log--------------
0 of 2 tests passed with 0 warnings in 185 seconds
Build step 'Execute shell' marked build as failure


zephyr/master: daily build zephyr-kernel-1.7.99-170329-131cfa2 Failure

donotreply@...
 

zephyr/master: daily build zephyr-kernel-1.7.99-170329-131cfa2 Failure



job zephyr-sanity build number 652 failed
see: https://jenkins.zephyrproject.org/job/zephyr-sanity/652/

|-----------------------------------------------------------------------------|
| non-matching sizes (1_TO_N) to higher priority |
|-----------------------------------------------------------------------------|
| size(B) | time/packet (nsec) | KB/sec |
|-----------------------------------------------------------------------------|
| put | get | no buf | small buf| big buf | no buf | small buf| big buf |
|-----------------------------------------------------------------------------|
| 8| 4096| 1203| 925| 1052| 6650| 8648| 7604|
| 16| 2048| 1028| 1027| 999| 15564| 15579| 16016|
| 32| 1024| 1170| 1174| 1242| 27350| 27257| 25764|
| 64| 512| 1626| 1631| 1750| 39360| 39239| 36571|
| 128| 256| 3045| 2866| 3188| 42036| 44661| 40150|
| 256| 128| 26765| 7518| 6543| 9564| 34051| 39125|
| 512| 64| 29928| 16765| 17392| 17107| 30539| 29438|
| 1024| 32| 45995| 45797| 38235| 22263| 22359| 26781|
Generating LALR tables
Platform 'arduino_101_mcuboot' not specified in any arch .ini file and will not be tested
----------------sanity-out/qemu_x86/tests/legacy/benchmark/app_kernel/test/qemu.log-----------------
qemu_x86 tests/net/lib/dns_packet/test FAILED: timeout
---------------------sanity-out/qemu_x86/tests/net/lib/dns_packet/test/qemu.log---------------------
***** BOOTING ZEPHYR OS v1.7.99 - BUILD: Mar 30 2017 05:19:41 *****
ASSERTION FAIL [num_events > 0] @ /w/workspace/zephyr-sanity/kernel/poll.c:177:
zero events
---------------------sanity-out/qemu_x86/tests/net/lib/dns_packet/test/qemu.log---------------------
0 of 144 tests passed with 0 warnings in 10842 seconds
Extra environment setting:
CONFIG_ASSERT=y
CONFIG_DEBUG=y
Build step 'Execute shell' marked build as failure


job zephyr-sanity build number 651 failed
see: https://jenkins.zephyrproject.org/job/zephyr-sanity/651/

| 16| 16| 6927| 5705| 5619| 2309| 2804| 2847|
| 32| 32| 5869| 5892| 5816| 5452| 5431| 5502|
| 64| 64| 6241| 6141| 6409| 10254| 10421| 9985|
| 128| 128| 6832| 6908| 6884| 18735| 18529| 18593|
| 256| 256| 12964| 8226| 8193| 19746| 31120| 31246|
| 512| 512| 11065| 10937| 10957| 46272| 46813| 46728|
| 1024| 1024| 16471| 16406| 16325| 62169| 62416| 62725|
| 2048| 2048| 27551| 27317| 27416| 74334| 74971| 74700|
| 4096| 4096| 49946| 49655| 49559| 82008| 82489| 82648|
|-----------------------------------------------------------------------------|
| non-matching sizes (1_TO_N) to higher priority |
|-----------------------------------------------------------------------------|
| size(B) | time/packet (nsec) | KB/sec |
|-----------------------------------------------------------------------------|
| put | get | no buf | small buf| big buf | no buf | small buf| big buf |
|-----------------------------------------------------------------------------|
| 8| 4096| 1995| 1606| 1665| 4010| 4981| 4804|
| 16| 2048| 1762| 1748| 1719| 9080| 9153| 9307|
| 32| 1024| 2103| 3529| 2035| 15216| 9067| 15724|
| 64| 512| 2877| 2876| 2886| 22245| 22253| 22176|
| 128| 256| 5391| 5330| 5791| 23743| 24015| 22103|
| 256| 128| 42006| 13696| 11986| 6094| 18691| 21358|
| 512| 64| 44978| 31040| 27540| 11383| 16494| 18591|
| 1024| 32| 84295| 86642| 74102| 12147| 11818| 13818|
-------------sanity-out/qemu_x86_iamcu/tests/legacy/benchmark/app_kernel/test/qemu.log--------------
0 of 33 tests passed with 0 warnings in 217 seconds
Extra environment setting:
CONFIG_DEBUG=y
Build step 'Execute shell' marked build as failure


job zephyr-sanity build number 650 failed
see: https://jenkins.zephyrproject.org/job/zephyr-sanity/650/

| 4096| 4096| 69600| 69841| 33386| 58850| 58647| 122686|
|-----------------------------------------------------------------------------|
| non-matching sizes (1_TO_N) to higher priority |
|-----------------------------------------------------------------------------|
| size(B) | time/packet (nsec) | KB/sec |
|-----------------------------------------------------------------------------|
| put | get | no buf | small buf| big buf | no buf | small buf| big buf |
|-----------------------------------------------------------------------------|
| 8| 4096| 1252| 1097| 1209| 6389| 7292| 6617|
| 16| 2048| 1175| 1253| 1211| 13617| 12769| 13212|
| 32| 1024| 1464| 1461| 1456| 21857| 21902| 21978|
| 64| 512| 3585| 2006| 1974| 17852| 31904| 32421|
| 128| 256| 3764| 3553| 3561| 34006| 36025| 35944|
| 256| 128| 25218| 11073| 8656| 10151| 23119| 29574|
| 512| 64| 27166| 20016| 17957| 18847| 25579| 28512|
| 1024| 32| 52992| 53337| 57497| 19323| 19198| 17809|
----------------sanity-out/qemu_x86/tests/legacy/benchmark/app_kernel/test/qemu.log-----------------
qemu_x86 tests/net/lib/dns_packet/test FAILED: timeout
---------------------sanity-out/qemu_x86/tests/net/lib/dns_packet/test/qemu.log---------------------
***** BOOTING ZEPHYR OS v1.7.99 - BUILD: Mar 30 2017 05:35:29 *****
ASSERTION FAIL [num_events > 0] @ /w/workspace/zephyr-sanity/kernel/poll.c:177:
zero events
---------------------sanity-out/qemu_x86/tests/net/lib/dns_packet/test/qemu.log---------------------
Generating LALR tables
Platform 'arduino_101_mcuboot' not specified in any arch .ini file and will not be tested
1 of 121 tests passed with 0 warnings in 10868 seconds
Extra environment setting:
CONFIG_ASSERT=y
Build step 'Execute shell' marked build as failure


job zephyr-sanity build number 649 failed
see: https://jenkins.zephyrproject.org/job/zephyr-sanity/649/

| 16| 16| 6996| 6976| 6972| 2287| 2293| 2294|
| 32| 32| 7214| 7227| 7237| 4435| 4427| 4421|
| 64| 64| 7711| 7987| 8147| 8299| 8013| 7855|
| 128| 128| 8631| 8818| 8565| 14830| 14515| 14944|
| 256| 256| 10625| 11150| 10564| 24094| 22959| 24233|
| 512| 512| 14422| 14478| 14446| 35501| 35364| 35442|
| 1024| 1024| 22627| 22482| 41770| 45255| 45547| 24515|
| 2048| 2048| 71432| 43049| 38095| 28670| 47573| 53760|
| 4096| 4096| 69950| 69515| 72222| 58556| 58922| 56714|
|-----------------------------------------------------------------------------|
| non-matching sizes (1_TO_N) to higher priority |
|-----------------------------------------------------------------------------|
| size(B) | time/packet (nsec) | KB/sec |
|-----------------------------------------------------------------------------|
| put | get | no buf | small buf| big buf | no buf | small buf| big buf |
|-----------------------------------------------------------------------------|
| 8| 4096| 2649| 2307| 2600| 3020| 3467| 3076|
| 16| 2048| 2640| 2365| 2316| 6060| 6765| 6908|
| 32| 1024| 2822| 2848| 2971| 11339| 11235| 10770|
| 64| 512| 3707| 3684| 3730| 17264| 17372| 17158|
| 128| 256| 7216| 6711| 6734| 17738| 19073| 19008|
| 256| 128| 45690| 17516| 57030| 5602| 14615| 4488|
| 512| 64| 49575| 40137| 36318| 10327| 12756| 14097|
| 1024| 32| 115757| 117010| 91335| 8846| 8751| 11211|
Generating LALR tables
Platform 'arduino_101_mcuboot' not specified in any arch .ini file and will not be tested
-------------sanity-out/qemu_x86_iamcu/tests/legacy/benchmark/app_kernel/test/qemu.log--------------
0 of 2 tests passed with 0 warnings in 186 seconds
Build step 'Execute shell' marked build as failure


zephyr/master: daily build zephyr-kernel-1.7.99-170330-de64c83 Failure

donotreply@...
 

zephyr/master: daily build zephyr-kernel-1.7.99-170330-de64c83 Failure



job zephyr-sanity build number 656 failed
see: https://jenkins.zephyrproject.org/job/zephyr-sanity/656/

Generating LALR tables
Platform 'arduino_101_mcuboot' not specified in any arch .ini file and will not be tested
------------------------sanity-out/qemu_x86/tests/net/neighbor/test/qemu.log------------------------
***** BOOTING ZEPHYR OS v1.7.99 - BUILD: Mar 31 2017 09:12:04 *****
ASSERTION FAIL [num_events > 0] @ /w/workspace/zephyr-sanity/kernel/poll.c:177:
zero events
------------------------sanity-out/qemu_x86/tests/net/neighbor/test/qemu.log------------------------
qemu_x86 tests/net/udp/test FAILED: timeout
--------------------------sanity-out/qemu_x86/tests/net/udp/test/qemu.log---------------------------
***** BOOTING ZEPHYR OS v1.7.99 - BUILD: Mar 31 2017 09:12:33 *****
***** CPU exception 6
Current thread ID = 0x001124c0
Faulting segment:address = 0x8:0x110875
eax: 0xfc0000d4, ebx: 0x0, ecx: 0x1124bf, edx: 0x110310
esi: 0x1, edi: 0x0, ebp: 00, esp: 0x10ff
eflags: 0x246
Fatal fault in essential thread! Spinning...
--------------------------sanity-out/qemu_x86/tests/net/udp/test/qemu.log---------------------------
qemu_x86 tests/net/lib/dns_packet/test FAILED: timeout
---------------------sanity-out/qemu_x86/tests/net/lib/dns_packet/test/qemu.log---------------------
***** BOOTING ZEPHYR OS v1.7.99 - BUILD: Mar 31 2017 09:06:17 *****
ASSERTION FAIL [num_events > 0] @ /w/workspace/zephyr-sanity/kernel/poll.c:177:
zero events
---------------------sanity-out/qemu_x86/tests/net/lib/dns_packet/test/qemu.log---------------------
1 of 146 tests passed with 0 warnings in 10960 seconds
Extra environment setting:
CONFIG_ASSERT=y
CONFIG_DEBUG=y
Build step 'Execute shell' marked build as failure


job zephyr-sanity build number 655 failed
see: https://jenkins.zephyrproject.org/job/zephyr-sanity/655/

| 16| 16| 3253| 6336| 5794| 4918| 2525| 2761|
| 32| 32| 4775| 4301| 5633| 6701| 7440| 5680|
| 64| 64| 6290| 6143| 5830| 10174| 10418| 10977|
| 128| 128| 4416| 7161| 7627| 28985| 17874| 16782|
| 256| 256| 12071| 8157| 5634| 21207| 31384| 45438|
| 512| 512| 8803| 11660| 11669| 58161| 43910| 43876|
| 1024| 1024| 12049| 19851| 23957| 84986| 51584| 42743|
| 2048| 2048| 37456| 27786| 30006| 54677| 73706| 68253|
| 4096| 4096| 53313| 54847| 58268| 76829| 74680| 70295|
|-----------------------------------------------------------------------------|
| non-matching sizes (1_TO_N) to higher priority |
|-----------------------------------------------------------------------------|
| size(B) | time/packet (nsec) | KB/sec |
|-----------------------------------------------------------------------------|
| put | get | no buf | small buf| big buf | no buf | small buf| big buf |
|-----------------------------------------------------------------------------|
| 8| 4096| 2108| 1012| 1048| 3795| 7905| 7633|
| 16| 2048| 1143| 1039| 1555| 13998| 15399| 10289|
| 32| 1024| 2533| 2456| 1968| 12633| 13029| 16260|
| 64| 512| 2705| 1743| 1716| 23659| 36718| 37296|
| 128| 256| 5425| 7230| 3485| 23594| 17704| 36728|
| 256| 128| 46423| 16986| 14776| 5514| 15071| 17325|
| 512| 64| 44325| 42298| 31632| 11551| 12104| 16186|
| 1024| 32| 56207| 124770| 41032| 18218| 8207| 24956|
----------------sanity-out/qemu_x86/tests/legacy/benchmark/app_kernel/test/qemu.log-----------------
2 of 36 tests passed with 0 warnings in 274 seconds
Extra environment setting:
CONFIG_DEBUG=y
Build step 'Execute shell' marked build as failure


job zephyr-sanity build number 654 failed
see: https://jenkins.zephyrproject.org/job/zephyr-sanity/654/

| 4096| 4096| 60136| 37672| 37523| 68112| 108727| 109159|
|-----------------------------------------------------------------------------|
| non-matching sizes (1_TO_N) to higher priority |
|-----------------------------------------------------------------------------|
| size(B) | time/packet (nsec) | KB/sec |
|-----------------------------------------------------------------------------|
| put | get | no buf | small buf| big buf | no buf | small buf| big buf |
|-----------------------------------------------------------------------------|
| 8| 4096| 2152| 1888| 1290| 3717| 4237| 6201|
| 16| 2048| 1236| 1261| 1204| 12944| 12688| 13289|
| 32| 1024| 1492| 1583| 1998| 21447| 20214| 16016|
| 64| 512| 1999| 1909| 1866| 32016| 33525| 34297|
| 128| 256| 3503| 3648| 3309| 36540| 35087| 38682|
| 256| 128| 24190| 9661| 7816| 10582| 26498| 32753|
| 512| 64| 27415| 32202| 17850| 18675| 15899| 28683|
| 1024| 32| 50507| 55940| 47217| 20274| 18305| 21687|
-------------sanity-out/qemu_x86_iamcu/tests/legacy/benchmark/app_kernel/test/qemu.log--------------
qemu_x86 tests/net/lib/dns_packet/test FAILED: timeout
---------------------sanity-out/qemu_x86/tests/net/lib/dns_packet/test/qemu.log---------------------
***** BOOTING ZEPHYR OS v1.7.99 - BUILD: Mar 31 2017 05:40:23 *****
ASSERTION FAIL [num_events > 0] @ /w/workspace/zephyr-sanity/kernel/poll.c:177:
zero events
---------------------sanity-out/qemu_x86/tests/net/lib/dns_packet/test/qemu.log---------------------
Generating LALR tables
Platform 'arduino_101_mcuboot' not specified in any arch .ini file and will not be tested
0 of 120 tests passed with 0 warnings in 10900 seconds
Extra environment setting:
CONFIG_ASSERT=y
Build step 'Execute shell' marked build as failure


job zephyr-sanity build number 653 failed
see: https://jenkins.zephyrproject.org/job/zephyr-sanity/653/

| 16| 16| 6898| 6825| 7193| 2319| 2344| 2224|
| 32| 32| 7022| 6992| 7104| 4557| 4576| 4504|
| 64| 64| 7533| 7575| 7543| 8495| 8448| 8484|
| 128| 128| 8653| 8577| 8754| 14792| 14923| 14621|
| 256| 256| 10632| 10386| 10877| 24078| 24648| 23535|
| 512| 512| 12659| 15795| 14798| 40445| 32415| 34599|
| 1024| 1024| 22658| 22917| 22577| 45193| 44682| 45355|
| 2048| 2048| 38420| 38796| 37920| 53305| 52788| 54008|
| 4096| 4096| 70511| 68725| 66735| 58090| 59599| 61377|
|-----------------------------------------------------------------------------|
| non-matching sizes (1_TO_N) to higher priority |
|-----------------------------------------------------------------------------|
| size(B) | time/packet (nsec) | KB/sec |
|-----------------------------------------------------------------------------|
| put | get | no buf | small buf| big buf | no buf | small buf| big buf |
|-----------------------------------------------------------------------------|
| 8| 4096| 2535| 2149| 2288| 3155| 3722| 3496|
| 16| 2048| 2434| 2266| 2345| 6573| 7060| 6823|
| 32| 1024| 2827| 2697| 1739| 11319| 11865| 18401|
| 64| 512| 3804| 3759| 3771| 16824| 17025| 16971|
| 128| 256| 6812| 6766| 6864| 18790| 18918| 18648|
| 256| 128| 44221| 17542| 22105| 5789| 14593| 11581|
| 512| 64| 50966| 39605| 35431| 10045| 12927| 14450|
| 1024| 32| 90300| 114110| 94735| 11339| 8973| 10809|
Generating LALR tables
Platform 'arduino_101_mcuboot' not specified in any arch .ini file and will not be tested
-------------sanity-out/qemu_x86_iamcu/tests/legacy/benchmark/app_kernel/test/qemu.log--------------
0 of 2 tests passed with 0 warnings in 185 seconds
Build step 'Execute shell' marked build as failure


zephyr/master: daily build zephyr-kernel-1.7.99-170331-845ebe8 Failure

donotreply@...
 

zephyr/master: daily build zephyr-kernel-1.7.99-170331-845ebe8 Failure



job zephyr-sanity build number 660 failed
see: https://jenkins.zephyrproject.org/job/zephyr-sanity/660/

|-----------------------------------------------------------------------------|
| non-matching sizes (1_TO_N) to higher priority |
|-----------------------------------------------------------------------------|
| size(B) | time/packet (nsec) | KB/sec |
|-----------------------------------------------------------------------------|
| put | get | no buf | small buf| big buf | no buf | small buf| big buf |
|-----------------------------------------------------------------------------|
| 8| 4096| 1576| 888| 987| 5076| 9009| 8105|
| 16| 2048| 1204| 1064| 969| 13289| 15037| 16511|
| 32| 1024| 1124| 1853| 1351| 28469| 17269| 23686|
| 64| 512| 1996| 1751| 1572| 32064| 36550| 40712|
| 128| 256| 4205| 3224| 3004| 30439| 39702| 42609|
| 256| 128| 34976| 8170| 6492| 7319| 31334| 39433|
| 512| 64| 38973| 16876| 14458| 13137| 30338| 35412|
| 1024| 32| 47585| 48590| 48187| 21519| 21074| 21250|
Generating LALR tables
Platform 'arduino_101_mcuboot' not specified in any arch .ini file and will not be tested
-------------sanity-out/qemu_x86_iamcu/tests/legacy/benchmark/app_kernel/test/qemu.log--------------
qemu_x86 tests/net/lib/dns_packet/test FAILED: timeout
---------------------sanity-out/qemu_x86/tests/net/lib/dns_packet/test/qemu.log---------------------
***** BOOTING ZEPHYR OS v1.7.99 - BUILD: Apr 1 2017 07:03:26 *****
ASSERTION FAIL [num_events > 0] @ /w/workspace/zephyr-sanity/kernel/poll.c:177:
zero events
---------------------sanity-out/qemu_x86/tests/net/lib/dns_packet/test/qemu.log---------------------
1 of 143 tests passed with 0 warnings in 10953 seconds
Extra environment setting:
CONFIG_ASSERT=y
CONFIG_DEBUG=y
Build step 'Execute shell' marked build as failure


job zephyr-sanity build number 659 failed
see: https://jenkins.zephyrproject.org/job/zephyr-sanity/659/

| 16| 16| 6574| 6585| 7075| 2433| 2429| 2261|
| 32| 32| 6940| 6354| 6784| 4610| 5036| 4716|
| 64| 64| 7312| 7513| 7612| 8752| 8518| 8407|
| 128| 128| 7932| 7832| 7880| 16137| 16343| 16243|
| 256| 256| 9809| 9821| 22564| 26098| 26066| 11345|
| 512| 512| 12629| 12534| 16906| 40541| 40848| 30285|
| 1024| 1024| 18026| 18155| 18234| 56806| 56403| 56158|
| 2048| 2048| 30459| 30840| 29523| 67237| 66407| 69369|
| 4096| 4096| 52981| 53066| 53346| 77310| 77186| 76781|
|-----------------------------------------------------------------------------|
| non-matching sizes (1_TO_N) to higher priority |
|-----------------------------------------------------------------------------|
| size(B) | time/packet (nsec) | KB/sec |
|-----------------------------------------------------------------------------|
| put | get | no buf | small buf| big buf | no buf | small buf| big buf |
|-----------------------------------------------------------------------------|
| 8| 4096| 2256| 3037| 3187| 3546| 2634| 2510|
| 16| 2048| 1981| 1953| 2493| 8076| 8192| 6417|
| 32| 1024| 2682| 2323| 2358| 11931| 13775| 13570|
| 64| 512| 3642| 3305| 3689| 17572| 19364| 17348|
| 128| 256| 7204| 7015| 5908| 17767| 18246| 21665|
| 256| 128| 45998| 17877| 15511| 5565| 14320| 16504|
| 512| 64| 54760| 34418| 46937| 9349| 14875| 10908|
| 1024| 32| 134885| 105142| 104292| 7591| 9739| 9818|
----------------sanity-out/qemu_x86/tests/legacy/benchmark/app_kernel/test/qemu.log-----------------
0 of 32 tests passed with 0 warnings in 214 seconds
Extra environment setting:
CONFIG_DEBUG=y
Build step 'Execute shell' marked build as failure


job zephyr-sanity build number 658 failed
see: https://jenkins.zephyrproject.org/job/zephyr-sanity/658/

| 4096| 4096| 40099| 47001| 53942| 102147| 87147| 75933|
|-----------------------------------------------------------------------------|
| non-matching sizes (1_TO_N) to higher priority |
|-----------------------------------------------------------------------------|
| size(B) | time/packet (nsec) | KB/sec |
|-----------------------------------------------------------------------------|
| put | get | no buf | small buf| big buf | no buf | small buf| big buf |
|-----------------------------------------------------------------------------|
| 8| 4096| 2290| 2859| 1500| 3493| 2798| 5333|
| 16| 2048| 1568| 2024| 1404| 10204| 7905| 11396|
| 32| 1024| 1649| 2137| 2205| 19405| 14974| 14512|
| 64| 512| 2964| 2210| 2972| 21592| 28959| 21534|
| 128| 256| 7267| 5148| 5596| 17613| 24864| 22873|
| 256| 128| 35773| 12698| 10764| 7156| 20160| 23782|
| 512| 64| 34010| 22711| 32357| 15054| 22544| 15823|
| 1024| 32| 81790| 81222| 59937| 12519| 12607| 17084|
-------------sanity-out/qemu_x86_iamcu/tests/legacy/benchmark/app_kernel/test/qemu.log--------------
Generating LALR tables
Platform 'arduino_101_mcuboot' not specified in any arch .ini file and will not be tested
qemu_x86 tests/net/lib/dns_packet/test FAILED: timeout
---------------------sanity-out/qemu_x86/tests/net/lib/dns_packet/test/qemu.log---------------------
***** BOOTING ZEPHYR OS v1.7.99 - BUILD: Apr 1 2017 06:53:46 *****
ASSERTION FAIL [num_events > 0] @ /w/workspace/zephyr-sanity/kernel/poll.c:177:
zero events
---------------------sanity-out/qemu_x86/tests/net/lib/dns_packet/test/qemu.log---------------------
0 of 120 tests passed with 0 warnings in 10865 seconds
Extra environment setting:
CONFIG_ASSERT=y
Build step 'Execute shell' marked build as failure


job zephyr-sanity build number 657 failed
see: https://jenkins.zephyrproject.org/job/zephyr-sanity/657/

| 16| 16| 6993| 7306| 7569| 2288| 2189| 2113|
| 32| 32| 3999| 6304| 6955| 8002| 5076| 4601|
| 64| 64| 4382| 5709| 8267| 14605| 11210| 7741|
| 128| 128| 10346| 7854| 7728| 12371| 16297| 16563|
| 256| 256| 6326| 7586| 6034| 40467| 33746| 42426|
| 512| 512| 21182| 8250| 14546| 24171| 62060| 35198|
| 1024| 1024| 23417| 22874| 12571| 43728| 44766| 81457|
| 2048| 2048| 38528| 35416| 44168| 53156| 57826| 46368|
| 4096| 4096| 57311| 49183| 47817| 71469| 83280| 85659|
|-----------------------------------------------------------------------------|
| non-matching sizes (1_TO_N) to higher priority |
|-----------------------------------------------------------------------------|
| size(B) | time/packet (nsec) | KB/sec |
|-----------------------------------------------------------------------------|
| put | get | no buf | small buf| big buf | no buf | small buf| big buf |
|-----------------------------------------------------------------------------|
| 8| 4096| 1491| 1381| 1370| 5365| 5792| 5839|
| 16| 2048| 2367| 2913| 1939| 6759| 5492| 8251|
| 32| 1024| 1829| 3922| 2872| 17495| 8159| 11142|
| 64| 512| 2510| 3900| 2451| 25498| 16410| 26111|
| 128| 256| 7053| 7279| 5165| 18148| 17584| 24782|
| 256| 128| 48665| 20222| 22240| 5260| 12659| 11510|
| 512| 64| 55463| 27250| 23252| 9231| 18788| 22019|
| 1024| 32| 102845| 157395| 69620| 9956| 6505| 14708|
Generating LALR tables
Platform 'arduino_101_mcuboot' not specified in any arch .ini file and will not be tested
-------------sanity-out/qemu_x86_iamcu/tests/legacy/benchmark/app_kernel/test/qemu.log--------------
0 of 2 tests passed with 0 warnings in 185 seconds
Build step 'Execute shell' marked build as failure


zephyr/master: daily build zephyr-kernel-1.7.99-170401-7d5be2a Failure

donotreply@...
 

zephyr/master: daily build zephyr-kernel-1.7.99-170401-7d5be2a Failure



job zephyr-sanity build number 664 failed
see: https://jenkins.zephyrproject.org/job/zephyr-sanity/664/

| 2048| 2048| 16712| 15799| 17658| 122546| 129628| 115981|
| 4096| 4096| 27474| 27193| 25521| 149086| 150626| 160495|
|-----------------------------------------------------------------------------|
| non-matching sizes (1_TO_N) to higher priority |
|-----------------------------------------------------------------------------|
| size(B) | time/packet (nsec) | KB/sec |
|-----------------------------------------------------------------------------|
| put | get | no buf | small buf| big buf | no buf | small buf| big buf |
|-----------------------------------------------------------------------------|
| 8| 4096| 1321| 1051| 1330| 6056| 7611| 6015|
| 16| 2048| 1359| 1131| 2362| 11773| 14146| 6773|
| 32| 1024| 1844| 1344| 1337| 17353| 23809| 23934|
| 64| 512| 1914| 1802| 1816| 33437| 35516| 35242|
| 128| 256| 4124| 3180| 3605| 31037| 40251| 35506|
| 256| 128| 40573| 9521| 9898| 6309| 26887| 25863|
| 512| 64| 36151| 19706| 16866| 14162| 25981| 30356|
| 1024| 32| 58242| 54300| 48415| 17581| 18858| 21150|
----------------sanity-out/qemu_x86/tests/legacy/benchmark/app_kernel/test/qemu.log-----------------
qemu_x86 tests/net/lib/dns_packet/test FAILED: timeout
---------------------sanity-out/qemu_x86/tests/net/lib/dns_packet/test/qemu.log---------------------
***** BOOTING ZEPHYR OS v1.7.99 - BUILD: Apr 2 2017 06:19:50 *****
ASSERTION FAIL [num_events > 0] @ /w/workspace/zephyr-sanity/kernel/poll.c:177:
zero events
---------------------sanity-out/qemu_x86/tests/net/lib/dns_packet/test/qemu.log---------------------
1 of 149 tests passed with 0 warnings in 10845 seconds
Extra environment setting:
CONFIG_ASSERT=y
CONFIG_DEBUG=y
Build step 'Execute shell' marked build as failure


job zephyr-sanity build number 663 failed
see: https://jenkins.zephyrproject.org/job/zephyr-sanity/663/

| 16| 16| 4659| 2805| 5160| 3434| 5704| 3100|
| 32| 32| 3229| 4702| 2952| 9910| 6805| 10840|
| 64| 64| 4194| 5573| 3683| 15259| 11483| 17377|
| 128| 128| 6006| 6405| 6657| 21312| 19984| 19227|
| 256| 256| 4901| 7715| 5467| 52234| 33182| 46826|
| 512| 512| 9344| 5618| 9368| 54794| 91135| 54654|
| 1024| 1024| 9312| 15273| 14309| 109965| 67046| 71563|
| 2048| 2048| 26560| 23732| 24531| 77108| 86296| 83486|
| 4096| 4096| 25871| 24499| 50087| 158323| 167190| 81777|
|-----------------------------------------------------------------------------|
| non-matching sizes (1_TO_N) to higher priority |
|-----------------------------------------------------------------------------|
| size(B) | time/packet (nsec) | KB/sec |
|-----------------------------------------------------------------------------|
| put | get | no buf | small buf| big buf | no buf | small buf| big buf |
|-----------------------------------------------------------------------------|
| 8| 4096| 1857| 1479| 1620| 4308| 5409| 4938|
| 16| 2048| 1480| 1463| 1842| 10810| 10936| 8686|
| 32| 1024| 1714| 1748| 1720| 18669| 18306| 18604|
| 64| 512| 3818| 2529| 3511| 16762| 25306| 18228|
| 128| 256| 5199| 4170| 6611| 24620| 30695| 19361|
| 256| 128| 49678| 10683| 13686| 5153| 23963| 18705|
| 512| 64| 34482| 24785| 29123| 14848| 20657| 17580|
| 1024| 32| 89797| 74170| 80690| 11403| 13806| 12690|
-------------sanity-out/qemu_x86_iamcu/tests/legacy/benchmark/app_kernel/test/qemu.log--------------
1 of 41 tests passed with 0 warnings in 259 seconds
Extra environment setting:
CONFIG_DEBUG=y
Build step 'Execute shell' marked build as failure


job zephyr-sanity build number 662 failed
see: https://jenkins.zephyrproject.org/job/zephyr-sanity/662/

| 4096| 4096| 76774| 77636| 77431| 53351| 52759| 52898|
|-----------------------------------------------------------------------------|
| non-matching sizes (1_TO_N) to higher priority |
|-----------------------------------------------------------------------------|
| size(B) | time/packet (nsec) | KB/sec |
|-----------------------------------------------------------------------------|
| put | get | no buf | small buf| big buf | no buf | small buf| big buf |
|-----------------------------------------------------------------------------|
| 8| 4096| 1828| 589| 1545| 4376| 13582| 5177|
| 16| 2048| 126| 84| 460| 126984| 190476| 34782|
| 32| 1024| 344| 509| 453| 93023| 62868| 70640|
| 64| 512| 671088241| 671087604| 671087644| 0| 0| 0|
| 128| 256|1342174356|1342174565|1342174113| 0| 0| 0|
| 256| 128| 24769| 731|2684351279| 10335| 350205| 0|
| 512| 64| 14340| 3771|1073738812| 35704| 135773| 0|
| 1024| 32| 23385| 86655| 17700| 43788| 11816| 57853|
Generating LALR tables
Platform 'arduino_101_mcuboot' not specified in any arch .ini file and will not be tested
----------------sanity-out/qemu_x86/tests/legacy/benchmark/app_kernel/test/qemu.log-----------------
qemu_x86 tests/net/lib/dns_packet/test FAILED: timeout
---------------------sanity-out/qemu_x86/tests/net/lib/dns_packet/test/qemu.log---------------------
***** BOOTING ZEPHYR OS v1.7.99 - BUILD: Apr 2 2017 06:56:00 *****
ASSERTION FAIL [num_events > 0] @ /w/workspace/zephyr-sanity/kernel/poll.c:177:
zero events
---------------------sanity-out/qemu_x86/tests/net/lib/dns_packet/test/qemu.log---------------------
1 of 128 tests passed with 0 warnings in 10928 seconds
Extra environment setting:
CONFIG_ASSERT=y
Build step 'Execute shell' marked build as failure


job zephyr-sanity build number 661 failed
see: https://jenkins.zephyrproject.org/job/zephyr-sanity/661/

| 16| 16| 7112| 7205| 6254| 2249| 2220| 2558|
| 32| 32| 7375| 7790| 6483| 4338| 4107| 4935|
| 64| 64| 8038| 7711| 7610| 7962| 8299| 8409|
| 128| 128| 8620| 7413| 8770| 14849| 17266| 14595|
| 256| 256| 8556| 12432| 6695| 29920| 20592| 38237|
| 512| 512| 14870| 8748| 9307| 34431| 58527| 55012|
| 1024| 1024| 25541| 23938| 13192| 40092| 42777| 77622|
| 2048| 2048| 21366| 39545| 40883| 95853| 51789| 50094|
| 4096| 4096| 69970| 48649| 64840| 58539| 84194| 63170|
|-----------------------------------------------------------------------------|
| non-matching sizes (1_TO_N) to higher priority |
|-----------------------------------------------------------------------------|
| size(B) | time/packet (nsec) | KB/sec |
|-----------------------------------------------------------------------------|
| put | get | no buf | small buf| big buf | no buf | small buf| big buf |
|-----------------------------------------------------------------------------|
| 8| 4096| 2841| 2281| 2413| 2815| 3507| 3315|
| 16| 2048| 1289| 1297| 2382| 12412| 12336| 6717|
| 32| 1024| 2751| 2738| 2500| 11632| 11687| 12800|
| 64| 512| 2748| 3804| 4046| 23289| 16824| 15818|
| 128| 256| 5239| 6920| 6855| 24432| 18497| 18672|
| 256| 128| 48672| 19516| 8755| 5259| 13117| 29240|
| 512| 64| 52275| 30446| 37323| 9794| 16816| 13718|
| 1024| 32| 119525| 120635| 110665| 8567| 8488| 9253|
Generating LALR tables
Platform 'arduino_101_mcuboot' not specified in any arch .ini file and will not be tested
-------------sanity-out/qemu_x86_iamcu/tests/legacy/benchmark/app_kernel/test/qemu.log--------------
0 of 8 tests passed with 0 warnings in 187 seconds
Build step 'Execute shell' marked build as failure


zephyr/master: daily build zephyr-kernel-1.7.99-170402-bb164f2 Failure

donotreply@...
 

zephyr/master: daily build zephyr-kernel-1.7.99-170402-bb164f2 Failure



job zephyr-sanity build number 668 failed
see: https://jenkins.zephyrproject.org/job/zephyr-sanity/668/

|-----------------------------------------------------------------------------|
| non-matching sizes (1_TO_N) to higher priority |
|-----------------------------------------------------------------------------|
| size(B) | time/packet (nsec) | KB/sec |
|-----------------------------------------------------------------------------|
| put | get | no buf | small buf| big buf | no buf | small buf| big buf |
|-----------------------------------------------------------------------------|
| 8| 4096| 1478| 1092| 1814| 5412| 7326| 4410|
| 16| 2048| 1058| 1145| 2155| 15122| 13973| 7424|
| 32| 1024| 1373| 1366| 1584| 23306| 23426| 20202|
| 64| 512| 3358| 1832| 1761| 19058| 34934| 36342|
| 128| 256| 4233| 3358| 4341| 30238| 38117| 29486|
| 256| 128| 36998| 10156| 7763| 6919| 25206| 32976|
| 512| 64| 46653| 18241| 18063| 10974| 28068| 28345|
| 1024| 32| 50200| 100772| 45775| 20398| 10161| 22370|
Generating LALR tables
Platform 'arduino_101_mcuboot' not specified in any arch .ini file and will not be tested
----------------sanity-out/qemu_x86/tests/legacy/benchmark/app_kernel/test/qemu.log-----------------
qemu_x86 tests/net/lib/dns_packet/test FAILED: timeout
---------------------sanity-out/qemu_x86/tests/net/lib/dns_packet/test/qemu.log---------------------
***** BOOTING ZEPHYR OS v1.7.99 - BUILD: Apr 3 2017 06:24:52 *****
ASSERTION FAIL [num_events > 0] @ /w/workspace/zephyr-sanity/kernel/poll.c:177:
zero events
---------------------sanity-out/qemu_x86/tests/net/lib/dns_packet/test/qemu.log---------------------
1 of 149 tests passed with 0 warnings in 10849 seconds
Extra environment setting:
CONFIG_ASSERT=y
CONFIG_DEBUG=y
Build step 'Execute shell' marked build as failure


job zephyr-sanity build number 667 failed
see: https://jenkins.zephyrproject.org/job/zephyr-sanity/667/

| 16| 16| 5669| 5764| 7502| 2822| 2775| 2132|
| 32| 32| 5783| 9937| 3703| 5533| 3220| 8641|
| 64| 64| 6439| 6510| 6678| 9939| 9831| 9583|
| 128| 128| 5041| 3801| 7436| 25391| 33675| 17213|
| 256| 256| 8579| 8690| 8137| 29840| 29459| 31461|
| 512| 512| 11681| 10803| 11968| 43831| 47394| 42780|
| 1024| 1024| 16760| 17146| 17133| 61097| 59722| 59767|
| 2048| 2048| 27198| 40640| 28831| 75299| 50393| 71034|
| 4096| 4096| 27563| 48482| 48220| 148605| 84484| 84944|
|-----------------------------------------------------------------------------|
| non-matching sizes (1_TO_N) to higher priority |
|-----------------------------------------------------------------------------|
| size(B) | time/packet (nsec) | KB/sec |
|-----------------------------------------------------------------------------|
| put | get | no buf | small buf| big buf | no buf | small buf| big buf |
|-----------------------------------------------------------------------------|
| 8| 4096| 1117| 1736| 1535| 7162| 4608| 5211|
| 16| 2048| 1492| 1939| 1864| 10723| 8251| 8583|
| 32| 1024| 2492| 2714| 1488| 12841| 11790| 21505|
| 64| 512| 2345| 2569| 2764| 27292| 24912| 23154|
| 128| 256| 5110| 5167| 4716| 25048| 24772| 27141|
| 256| 128| 43278| 13194| 11426| 5915| 19402| 22405|
| 512| 64| 80723| 30680| 33771| 6342| 16688| 15160|
| 1024| 32| 50385| 56487| 90460| 20323| 18128| 11319|
-------------sanity-out/qemu_x86_iamcu/tests/legacy/benchmark/app_kernel/test/qemu.log--------------
0 of 38 tests passed with 0 warnings in 203 seconds
Extra environment setting:
CONFIG_DEBUG=y
Build step 'Execute shell' marked build as failure


job zephyr-sanity build number 666 failed
see: https://jenkins.zephyrproject.org/job/zephyr-sanity/666/

| 4096| 4096| 61591| 35897| 79402| 66503| 114104| 51585|
|-----------------------------------------------------------------------------|
| non-matching sizes (1_TO_N) to higher priority |
|-----------------------------------------------------------------------------|
| size(B) | time/packet (nsec) | KB/sec |
|-----------------------------------------------------------------------------|
| put | get | no buf | small buf| big buf | no buf | small buf| big buf |
|-----------------------------------------------------------------------------|
| 8| 4096| 1392| 1252| 1530| 5747| 6389| 5228|
| 16| 2048| 1388| 1331| 2794| 11527| 12021| 5726|
| 32| 1024| 1594| 2041| 1741| 20075| 15678| 18380|
| 64| 512| 3547| 2077| 3870| 18043| 30813| 16537|
| 128| 256| 4348| 3629| 3684| 29438| 35271| 34744|
| 256| 128| 35336| 10945| 8090| 7244| 23389| 31644|
| 512| 64| 33621| 28520| 22278| 15228| 17952| 22982|
| 1024| 32| 80967| 75597| 50992| 12647| 13545| 20081|
Generating LALR tables
Platform 'arduino_101_mcuboot' not specified in any arch .ini file and will not be tested
-------------sanity-out/qemu_x86_iamcu/tests/legacy/benchmark/app_kernel/test/qemu.log--------------
qemu_x86 tests/net/lib/dns_packet/test FAILED: timeout
---------------------sanity-out/qemu_x86/tests/net/lib/dns_packet/test/qemu.log---------------------
***** BOOTING ZEPHYR OS v1.7.99 - BUILD: Apr 3 2017 05:04:03 *****
ASSERTION FAIL [num_events > 0] @ /w/workspace/zephyr-sanity/kernel/poll.c:177:
zero events
---------------------sanity-out/qemu_x86/tests/net/lib/dns_packet/test/qemu.log---------------------
1 of 128 tests passed with 0 warnings in 11023 seconds
Extra environment setting:
CONFIG_ASSERT=y
Build step 'Execute shell' marked build as failure


job zephyr-sanity build number 665 failed
see: https://jenkins.zephyrproject.org/job/zephyr-sanity/665/

| 16| 16| 3822| 3853| 7086| 4186| 4152| 2257|
| 32| 32| 6673| 5100| 3903| 4795| 6274| 8198|
| 64| 64| 4198| 7295| 7088| 15245| 8773| 9029|
| 128| 128| 4736| 12504| 4812| 27027| 10236| 26600|
| 256| 256| 6153| 9207| 5815| 41605| 27804| 44024|
| 512| 512| 14614| 15320| 9380| 35034| 33420| 54584|
| 1024| 1024| 14797| 12261| 22685| 69203| 83516| 45139|
| 2048| 2048| 22316| 36026| 23617| 91772| 56847| 86717|
| 4096| 4096| 47756| 46259| 53010| 85769| 88544| 77268|
|-----------------------------------------------------------------------------|
| non-matching sizes (1_TO_N) to higher priority |
|-----------------------------------------------------------------------------|
| size(B) | time/packet (nsec) | KB/sec |
|-----------------------------------------------------------------------------|
| put | get | no buf | small buf| big buf | no buf | small buf| big buf |
|-----------------------------------------------------------------------------|
| 8| 4096| 1402| 1258| 1475| 5706| 6359| 5423|
| 16| 2048| 1694| 1340| 2506| 9445| 11940| 6384|
| 32| 1024| 3710| 1732| 1584| 8625| 18475| 20202|
| 64| 512| 2324| 2386| 4080| 27538| 26823| 15686|
| 128| 256| 7098| 3965| 9515| 18033| 32282| 13452|
| 256| 128| 38899| 17222| 10512| 6581| 14864| 24353|
| 512| 64| 42946| 28870| 20057| 11921| 17734| 25527|
| 1024| 32| 60230| 74152| 54197| 17001| 13809| 18894|
Generating LALR tables
Platform 'arduino_101_mcuboot' not specified in any arch .ini file and will not be tested
-------------sanity-out/qemu_x86_iamcu/tests/legacy/benchmark/app_kernel/test/qemu.log--------------
0 of 8 tests passed with 0 warnings in 187 seconds
Build step 'Execute shell' marked build as failure


zephyr/master: daily build zephyr-kernel-1.7.99-170403-97fa0d9 Failure

donotreply@...
 

zephyr/master: daily build zephyr-kernel-1.7.99-170403-97fa0d9 Failure



job zephyr-sanity build number 672 failed
see: https://jenkins.zephyrproject.org/job/zephyr-sanity/672/

| 16| 16| 3291| 3436| 3447| 4861| 4656| 4641|
| 32| 32| 3618| 3287| 3585| 8844| 9735| 8926|
| 64| 64| 3990| 3730| 3411| 16040| 17158| 18762|
| 128| 128| 7149| 5127| 6202| 17904| 24965| 20638|
| 256| 256| 5699| 4845| 4433| 44920| 52837| 57748|
| 512| 512| 10210| 6026| 6369| 50146| 84965| 80389|
| 1024| 1024| 9079| 8648| 9240| 112787| 118408| 110822|
| 2048| 2048| 14767| 16364| 14335| 138687| 125152| 142867|
| 4096| 4096| 27366| 27574| 32140| 149674| 148545| 127442|
|-----------------------------------------------------------------------------|
| non-matching sizes (1_TO_N) to higher priority |
|-----------------------------------------------------------------------------|
| size(B) | time/packet (nsec) | KB/sec |
|-----------------------------------------------------------------------------|
| put | get | no buf | small buf| big buf | no buf | small buf| big buf |
|-----------------------------------------------------------------------------|
| 8| 4096| 1902| 1045| 1131| 4206| 7655| 7073|
----------------sanity-out/qemu_x86/tests/legacy/benchmark/app_kernel/test/qemu.log-----------------
qemu_x86 tests/net/lib/dns_packet/test FAILED: timeout
---------------------sanity-out/qemu_x86/tests/net/lib/dns_packet/test/qemu.log---------------------
***** BOOTING ZEPHYR OS v1.7.99 - BUILD: Apr 4 2017 09:00:56 *****
ASSERTION FAIL [num_events > 0] @ /w/workspace/zephyr-sanity/kernel/poll.c:177:
zero events
---------------------sanity-out/qemu_x86/tests/net/lib/dns_packet/test/qemu.log---------------------
0 of 150 tests passed with 0 warnings in 11227 seconds
Extra environment setting:
CONFIG_ASSERT=y
CONFIG_DEBUG=y
Build step 'Execute shell' marked build as failure


job zephyr-sanity build number 671 failed
see: https://jenkins.zephyrproject.org/job/zephyr-sanity/671/

| 16| 16| 5898| 5568| 5741| 2712| 2873| 2786|
| 32| 32| 5754| 5522| 5664| 5561| 5795| 5649|
| 64| 64| 6683| 5616| 6367| 9576| 11396| 10051|
| 128| 128| 10688| 6925| 7010| 11976| 18483| 18259|
| 256| 256| 8663| 8259| 8056| 29550| 30996| 31777|
| 512| 512| 10764| 9362| 10970| 47565| 54689| 46672|
| 1024| 1024| 16838| 13241| 16624| 60814| 77335| 61597|
| 2048| 2048| 27091| 28272| 22351| 75597| 72439| 91629|
| 4096| 4096| 51040| 50655| 51144| 80250| 80860| 80087|
|-----------------------------------------------------------------------------|
| non-matching sizes (1_TO_N) to higher priority |
|-----------------------------------------------------------------------------|
| size(B) | time/packet (nsec) | KB/sec |
|-----------------------------------------------------------------------------|
| put | get | no buf | small buf| big buf | no buf | small buf| big buf |
|-----------------------------------------------------------------------------|
| 8| 4096| 2723| 1628| 1335| 2937| 4914| 5992|
| 16| 2048| 1118| 1941| 1332| 14311| 8243| 12012|
| 32| 1024| 1941| 2069| 2256| 16486| 15466| 14184|
| 64| 512| 2200| 2328| 2777| 29090| 27491| 23046|
| 128| 256| 4889| 5113| 5306| 26181| 25034| 24123|
| 256| 128| 45131| 13236| 8318| 5672| 19341| 30776|
| 512| 64| 28897| 47635| 21981| 17718| 10748| 23292|
| 1024| 32| 91205| 85720| 79037| 11227| 11945| 12955|
-------------sanity-out/qemu_x86_iamcu/tests/legacy/benchmark/app_kernel/test/qemu.log--------------
0 of 38 tests passed with 0 warnings in 219 seconds
Extra environment setting:
CONFIG_DEBUG=y
Build step 'Execute shell' marked build as failure


job zephyr-sanity build number 670 failed
see: https://jenkins.zephyrproject.org/job/zephyr-sanity/670/

| 4096| 4096| 32645| 32692| 35577| 125470| 125290| 115130|
|-----------------------------------------------------------------------------|
| non-matching sizes (1_TO_N) to higher priority |
|-----------------------------------------------------------------------------|
| size(B) | time/packet (nsec) | KB/sec |
|-----------------------------------------------------------------------------|
| put | get | no buf | small buf| big buf | no buf | small buf| big buf |
|-----------------------------------------------------------------------------|
| 8| 4096| 2803| 2436| 1400| 2854| 3284| 5714|
| 16| 2048| 1242| 1153| 2719| 12882| 13876| 5884|
| 32| 1024| 1485| 1445| 2878| 21548| 22145| 11118|
| 64| 512| 1944| 1984| 4202| 32921| 32258| 15230|
| 128| 256| 3787| 3933| 3586| 33799| 32545| 35694|
| 256| 128| 61689| 9828| 7911| 4149| 26048| 32360|
| 512| 64| 27657| 19930| 17671| 18512| 25689| 28974|
| 1024| 32| 51047| 52172| 45917| 20059| 19627| 22301|
----------------sanity-out/qemu_x86/tests/legacy/benchmark/app_kernel/test/qemu.log-----------------
qemu_x86 tests/net/lib/dns_packet/test FAILED: timeout
---------------------sanity-out/qemu_x86/tests/net/lib/dns_packet/test/qemu.log---------------------
***** BOOTING ZEPHYR OS v1.7.99 - BUILD: Apr 4 2017 05:11:41 *****
ASSERTION FAIL [num_events > 0] @ /w/workspace/zephyr-sanity/kernel/poll.c:177:
zero events
---------------------sanity-out/qemu_x86/tests/net/lib/dns_packet/test/qemu.log---------------------
Generating LALR tables
Platform 'arduino_101_mcuboot' not specified in any arch .ini file and will not be tested
0 of 126 tests passed with 0 warnings in 10919 seconds
Extra environment setting:
CONFIG_ASSERT=y
Build step 'Execute shell' marked build as failure


job zephyr-sanity build number 669 failed
see: https://jenkins.zephyrproject.org/job/zephyr-sanity/669/

| 16| 16| 5278| 3910| 3315| 3031| 4092| 4826|
| 32| 32| 5082| 3716| 3583| 6296| 8611| 8931|
| 64| 64| 6008| 6296| 6474| 10652| 10165| 9885|
| 128| 128| 6876| 4317| 4295| 18615| 29650| 29802|
| 256| 256| 5484| 5600| 8546| 46681| 45714| 29955|
| 512| 512| 7662| 14735| 14594| 66823| 34747| 35082|
| 1024| 1024| 23410| 22940| 12528| 43741| 44638| 81736|
| 2048| 2048| 31270| 42256| 26061| 65494| 48466| 78584|
| 4096| 4096| 80262| 80895| 80307| 51032| 50633| 51004|
|-----------------------------------------------------------------------------|
| non-matching sizes (1_TO_N) to higher priority |
|-----------------------------------------------------------------------------|
| size(B) | time/packet (nsec) | KB/sec |
|-----------------------------------------------------------------------------|
| put | get | no buf | small buf| big buf | no buf | small buf| big buf |
|-----------------------------------------------------------------------------|
| 8| 4096| 1277| 1949| 1588| 6264| 4104| 5037|
| 16| 2048| 1270| 2172| 2576| 12598| 7366| 6211|
| 32| 1024| 2683| 2399| 2616| 11926| 13338| 12232|
| 64| 512| 2487| 2600| 2141| 25733| 24615| 29892|
| 128| 256| 5755| 5895| 6338| 22241| 21713| 20195|
| 256| 128| 33958| 17367| 7581| 7538| 14740| 33768|
| 512| 64| 28943| 39197| 26501| 17689| 13062| 19320|
| 1024| 32| 93957| 53005| 46132| 10898| 19318| 22197|
Generating LALR tables
Platform 'arduino_101_mcuboot' not specified in any arch .ini file and will not be tested
----------------sanity-out/qemu_x86/tests/legacy/benchmark/app_kernel/test/qemu.log-----------------
0 of 8 tests passed with 0 warnings in 187 seconds
Build step 'Execute shell' marked build as failure


zephyr/master: daily build zephyr-kernel-1.7.99-170404-1a9600b Failure

donotreply@...
 

zephyr/master: daily build zephyr-kernel-1.7.99-170404-1a9600b Failure



job zephyr-sanity build number 676 failed
see: https://jenkins.zephyrproject.org/job/zephyr-sanity/676/

|-----------------------------------------------------------------------------|
| size(B) | time/packet (nsec) | KB/sec |
|-----------------------------------------------------------------------------|
| put | get | no buf | small buf| big buf | no buf | small buf| big buf |
|-----------------------------------------------------------------------------|
| 8| 4096| 1404| 1033| 1540| 5698| 7744| 5194|
| 16| 2048| 1358| 1932| 1591| 11782| 8281| 10056|
| 32| 1024| 1257| 3657| 1220| 25457| 8750| 26229|
| 64| 512| 1821| 2177| 1713| 35145| 29398| 37361|
| 128| 256| 3871| 3485| 5375| 33066| 36728| 23813|
| 256| 128| 29848| 8373| 6605| 8576| 30574| 38758|
| 512| 64| 27227| 37063| 37000| 18804| 13814| 13837|
| 1024| 32| 52397| 47537| 61317| 19543| 21541| 16700|
Generating LALR tables
Platform 'arduino_101_mcuboot' not specified in any arch .ini file and will not be tested
----------------sanity-out/qemu_x86/tests/legacy/benchmark/app_kernel/test/qemu.log-----------------
qemu_x86 tests/net/lib/dns_packet/test FAILED: timeout
---------------------sanity-out/qemu_x86/tests/net/lib/dns_packet/test/qemu.log---------------------
***** BOOTING ZEPHYR OS v1.7.99 - BUILD: Apr 5 2017 07:06:35 *****
ASSERTION FAIL [num_events > 0] @ /w/workspace/zephyr-sanity/kernel/poll.c:177:
zero events
---------------------sanity-out/qemu_x86/tests/net/lib/dns_packet/test/qemu.log---------------------
qemu_nios2 tests/legacy/kernel/test_sleep/test WARNING: rom_size +1208, is now 18804 +6.87%
Deltas based on metrics from last release
1 of 143 tests passed with 1 warnings in 10896 seconds
Extra environment setting:
CONFIG_ASSERT=y
CONFIG_DEBUG=y
Build step 'Execute shell' marked build as failure


job zephyr-sanity build number 675 failed
see: https://jenkins.zephyrproject.org/job/zephyr-sanity/675/

| 16| 16| 6477| 6422| 5197| 2470| 2491| 3078|
| 32| 32| 6583| 6800| 4713| 4861| 4705| 6789|
| 64| 64| 5880| 6074| 5850| 10884| 10536| 10940|
| 128| 128| 5243| 6483| 7030| 24413| 19743| 18207|
| 256| 256| 7648| 7439| 7672| 33472| 34413| 33368|
| 512| 512| 6490| 11905| 12236| 78890| 43007| 41843|
| 1024| 1024| 9653| 17641| 17601| 106081| 58046| 58178|
| 2048| 2048| 28317| 27909| 27551| 72324| 73381| 74334|
| 4096| 4096| 45300| 53963| 40841| 90419| 75903| 100291|
|-----------------------------------------------------------------------------|
| non-matching sizes (1_TO_N) to higher priority |
|-----------------------------------------------------------------------------|
| size(B) | time/packet (nsec) | KB/sec |
|-----------------------------------------------------------------------------|
| put | get | no buf | small buf| big buf | no buf | small buf| big buf |
|-----------------------------------------------------------------------------|
| 8| 4096| 2280| 989| 1791| 3508| 8088| 4466|
| 16| 2048| 1410| 1526| 3018| 11347| 10484| 5301|
| 32| 1024| 2383| 1361| 2426| 13428| 23512| 13190|
| 64| 512| 1857| 3268| 2810| 34464| 19583| 22775|
| 128| 256| 5912| 5832| 5205| 21650| 21947| 24591|
| 256| 128| 67703| 22056| 9751| 3781| 11606| 26253|
| 512| 64| 52790| 32503| 27842| 9698| 15752| 18389|
| 1024| 32| 98045| 102920| 45070| 10444| 9949| 22720|
----------------sanity-out/qemu_x86/tests/legacy/benchmark/app_kernel/test/qemu.log-----------------
0 of 32 tests passed with 0 warnings in 203 seconds
Extra environment setting:
CONFIG_DEBUG=y
Build step 'Execute shell' marked build as failure


job zephyr-sanity build number 674 failed
see: https://jenkins.zephyrproject.org/job/zephyr-sanity/674/

| 4096| 4096| 37495| 39022| 77834| 109241| 104966| 52624|
|-----------------------------------------------------------------------------|
| non-matching sizes (1_TO_N) to higher priority |
|-----------------------------------------------------------------------------|
| size(B) | time/packet (nsec) | KB/sec |
|-----------------------------------------------------------------------------|
| put | get | no buf | small buf| big buf | no buf | small buf| big buf |
|-----------------------------------------------------------------------------|
| 8| 4096| 3826| 2287| 2671| 2090| 3498| 2995|
| 16| 2048| 2517| 1472| 2449| 6356| 10869| 6533|
| 32| 1024| 1876| 2351| 1545| 17057| 13611| 20711|
| 64| 512| 4057| 2546| 4019| 15775| 25137| 15924|
| 128| 256| 5698| 3980| 10100| 22464| 32160| 12673|
| 256| 128| 84085| 15153| 11893| 3044| 16894| 21525|
| 512| 64| 57913| 61365| 43337| 8840| 8343| 11814|
| 1024| 32| 87562| 157620| 63652| 11694| 6496| 16087|
-------------sanity-out/qemu_x86_iamcu/tests/legacy/benchmark/app_kernel/test/qemu.log--------------
qemu_x86 tests/net/lib/dns_packet/test FAILED: timeout
---------------------sanity-out/qemu_x86/tests/net/lib/dns_packet/test/qemu.log---------------------
Generating LALR tables
Platform 'arduino_101_mcuboot' not specified in any arch .ini file and will not be tested
***** BOOTING ZEPHYR OS v1.7.99 - BUILD: Apr 5 2017 07:00:31 *****
ASSERTION FAIL [num_events > 0] @ /w/workspace/zephyr-sanity/kernel/poll.c:177:
zero events
---------------------sanity-out/qemu_x86/tests/net/lib/dns_packet/test/qemu.log---------------------
0 of 120 tests passed with 0 warnings in 10877 seconds
Extra environment setting:
CONFIG_ASSERT=y
Build step 'Execute shell' marked build as failure


job zephyr-sanity build number 673 failed
see: https://jenkins.zephyrproject.org/job/zephyr-sanity/673/

| 16| 16| 5524| 3606| 3493| 2896| 4437| 4580|
| 32| 32| 5189| 5346| 3731| 6166| 5985| 8576|
| 64| 64| 6755| 6810| 3852| 9474| 9397| 16614|
| 128| 128| 6934| 4351| 5708| 18459| 29418| 22424|
| 256| 256| 9419| 5579| 5249| 27179| 45886| 48771|
| 512| 512| 7429| 10988| 13227| 68919| 46596| 38708|
| 1024| 1024| 11181| 16710| 11159| 91583| 61280| 91764|
| 2048| 2048| 20734| 20414| 34505| 98774| 100323| 59353|
| 4096| 4096| 35777| 35281| 40875| 114486| 116096| 100207|
|-----------------------------------------------------------------------------|
| non-matching sizes (1_TO_N) to higher priority |
|-----------------------------------------------------------------------------|
| size(B) | time/packet (nsec) | KB/sec |
|-----------------------------------------------------------------------------|
| put | get | no buf | small buf| big buf | no buf | small buf| big buf |
|-----------------------------------------------------------------------------|
| 8| 4096| 1478| 1272| 1281| 5412| 6289| 6245|
| 16| 2048| 2091| 2116| 1287| 7651| 7561| 12432|
| 32| 1024| 1537| 2584| 1548| 20819| 12383| 20671|
| 64| 512| 2282| 2068| 2398| 28045| 30947| 26688|
| 128| 256| 3725| 6766| 3748| 34362| 18918| 34151|
| 256| 128| 51103| 16728| 15485| 5009| 15303| 16532|
| 512| 64| 45450| 22017| 20257| 11265| 23254| 25275|
| 1024| 32| 59290| 101532| 94260| 17271| 10085| 10863|
Generating LALR tables
Platform 'arduino_101_mcuboot' not specified in any arch .ini file and will not be tested
-------------sanity-out/qemu_x86_iamcu/tests/legacy/benchmark/app_kernel/test/qemu.log--------------
0 of 2 tests passed with 0 warnings in 185 seconds
Build step 'Execute shell' marked build as failure


zephyr/master: daily build zephyr-kernel-1.7.99-170405-bb4a2ee Failure

donotreply@...
 

zephyr/master: daily build zephyr-kernel-1.7.99-170405-bb4a2ee Failure



job zephyr-sanity build number 680 failed
see: https://jenkins.zephyrproject.org/job/zephyr-sanity/680/

| non-matching sizes (1_TO_N) to higher priority |
|-----------------------------------------------------------------------------|
| size(B) | time/packet (nsec) | KB/sec |
|-----------------------------------------------------------------------------|
| put | get | no buf | small buf| big buf | no buf | small buf| big buf |
|-----------------------------------------------------------------------------|
| 8| 4096| 1250| 964| 1027| 6400| 8298| 7789|
| 16| 2048| 1116| 1129| 1506| 14336| 14171| 10624|
| 32| 1024| 1182| 1775| 1269| 27072| 18028| 25216|
| 64| 512| 1563| 3763| 2449| 40946| 17007| 26133|
| 128| 256| 5099| 5296| 4497| 25102| 24169| 28463|
| 256| 128| 68556| 9146| 6876| 3734| 27990| 37230|
| 512| 64| 29301| 16800| 14696| 17473| 30476| 34839|
| 1024| 32| 82150| 45052| 46070| 12465| 22729| 22227|
Generating LALR tables
Platform 'arduino_101_mcuboot' not specified in any arch .ini file and will not be tested
Platform 'nrf52_blenano2' not specified in any arch .ini file and will not be tested
----------------sanity-out/qemu_x86/tests/legacy/benchmark/app_kernel/test/qemu.log-----------------
qemu_x86 tests/net/lib/dns_packet/test FAILED: timeout
---------------------sanity-out/qemu_x86/tests/net/lib/dns_packet/test/qemu.log---------------------
***** BOOTING ZEPHYR OS v1.7.99 - BUILD: Apr 6 2017 05:22:29 *****
ASSERTION FAIL [num_events > 0] @ /w/workspace/zephyr-sanity/kernel/poll.c:177:
zero events
---------------------sanity-out/qemu_x86/tests/net/lib/dns_packet/test/qemu.log---------------------
1 of 143 tests passed with 0 warnings in 10838 seconds
Extra environment setting:
CONFIG_ASSERT=y
CONFIG_DEBUG=y
Build step 'Execute shell' marked build as failure


job zephyr-sanity build number 679 failed
see: https://jenkins.zephyrproject.org/job/zephyr-sanity/679/

| 16| 16| 3144| 5038| 3120| 5089| 3175| 5128|
| 32| 32| 3296| 5486| 3335| 9708| 5833| 9595|
| 64| 64| 6120| 6010| 3391| 10457| 10648| 18873|
| 128| 128| 7082| 4001| 3925| 18073| 31992| 32611|
| 256| 256| 8166| 7333| 4403| 31349| 34910| 58142|
| 512| 512| 6222| 5774| 9381| 82288| 88673| 54578|
| 1024| 1024| 12987| 13263| 10402| 78848| 77207| 98442|
| 2048| 2048| 14708| 13747| 24593| 139243| 148977| 83275|
| 4096| 4096| 45365| 25493| 44523| 90289| 160671| 91997|
|-----------------------------------------------------------------------------|
| non-matching sizes (1_TO_N) to higher priority |
|-----------------------------------------------------------------------------|
| size(B) | time/packet (nsec) | KB/sec |
|-----------------------------------------------------------------------------|
| put | get | no buf | small buf| big buf | no buf | small buf| big buf |
|-----------------------------------------------------------------------------|
| 8| 4096| 1868| 843| 1110| 4282| 9489| 7207|
| 16| 2048| 1008| 1056| 1665| 15873| 15151| 9609|
| 32| 1024| 2090| 2406| 2152| 15311| 13300| 14869|
| 64| 512| 2513| 2841| 1575| 25467| 22527| 40634|
| 128| 256| 6241| 4890| 2934| 20509| 26175| 43626|
| 256| 128| 40953| 15470| 11694| 6251| 16548| 21891|
| 512| 64| 28368| 28000| 26153| 18048| 18285| 19577|
| 1024| 32| 49250| 46430| 40012| 20791| 22054| 25592|
----------------sanity-out/qemu_x86/tests/legacy/benchmark/app_kernel/test/qemu.log-----------------
3 of 35 tests passed with 0 warnings in 274 seconds
Extra environment setting:
CONFIG_DEBUG=y
Build step 'Execute shell' marked build as failure


job zephyr-sanity build number 678 failed
see: https://jenkins.zephyrproject.org/job/zephyr-sanity/678/

| 1024| 1024| 22203| 22172| 22104| 46119| 46184| 46326|
| 2048| 2048| 34137| 32982| 34247| 59993| 62094| 59800|
| 4096| 4096| 63057| 45464| 51036| 64957| 90093| 80257|
|-----------------------------------------------------------------------------|
| non-matching sizes (1_TO_N) to higher priority |
|-----------------------------------------------------------------------------|
| size(B) | time/packet (nsec) | KB/sec |
|-----------------------------------------------------------------------------|
| put | get | no buf | small buf| big buf | no buf | small buf| big buf |
|-----------------------------------------------------------------------------|
| 8| 4096| 1418| 1244| 1357| 5641| 6430| 5895|
| 16| 2048| 2215| 2602| 2194| 7223| 6149| 7292|
| 32| 1024| 2733| 2717| 2598| 11708| 11777| 12317|
| 64| 512| 3602| 4022| 3435| 17767| 15912| 18631|
| 128| 256| 7550| 6533| 6944| 16953| 19592| 18433|
| 256| 128| 38823| 18117| 14565| 6594| 14130| 17576|
| 512| 64| 48290| 39078| 35737| 10602| 13102| 14326|
| 1024| 32| 87422| 93760| 50115| 11713| 10921| 20433|
----------------sanity-out/qemu_x86/tests/legacy/benchmark/app_kernel/test/qemu.log-----------------
qemu_x86 tests/net/lib/dns_packet/test FAILED: timeout
---------------------sanity-out/qemu_x86/tests/net/lib/dns_packet/test/qemu.log---------------------
***** BOOTING ZEPHYR OS v1.7.99 - BUILD: Apr 6 2017 07:59:13 *****
ASSERTION FAIL [num_events > 0] @ /w/workspace/zephyr-sanity/kernel/poll.c:177:
zero events
---------------------sanity-out/qemu_x86/tests/net/lib/dns_packet/test/qemu.log---------------------
0 of 121 tests passed with 0 warnings in 10852 seconds
Extra environment setting:
CONFIG_ASSERT=y
Build step 'Execute shell' marked build as failure


job zephyr-sanity build number 677 failed
see: https://jenkins.zephyrproject.org/job/zephyr-sanity/677/

| 32| 32| 6152| 3758| 3745| 5201| 8515| 8544|
| 64| 64| 4601| 4215| 4288| 13910| 15183| 14925|
| 128| 128| 7316| 4618| 6361| 17495| 27717| 20122|
| 256| 256| 5690| 8730| 5595| 44991| 29324| 45755|
| 512| 512| 7853| 7853| 13282| 65198| 65198| 38548|
| 1024| 1024| 11627| 20924| 13627| 88070| 48939| 75144|
| 2048| 2048| 21929| 35501| 38157| 93392| 57688| 53672|
| 4096| 4096| 43286| 34564| 39075| 94626| 118504| 104824|
|-----------------------------------------------------------------------------|
| non-matching sizes (1_TO_N) to higher priority |
|-----------------------------------------------------------------------------|
| size(B) | time/packet (nsec) | KB/sec |
|-----------------------------------------------------------------------------|
| put | get | no buf | small buf| big buf | no buf | small buf| big buf |
|-----------------------------------------------------------------------------|
| 8| 4096| 1837| 1272| 1299| 4354| 6289| 6158|
| 16| 2048| 1209| 1202| 1394| 13234| 13311| 11477|
| 32| 1024| 3029| 1449| 2650| 10564| 22084| 12075|
| 64| 512| 2500| 3512| 4624| 25600| 18223| 13840|
| 128| 256| 3940| 11267| 5718| 32487| 11360| 22385|
| 256| 128| 62673| 14640| 8078| 4084| 17486| 31691|
| 512| 64| 29585| 23981| 24660| 17306| 21350| 20762|
| 1024| 32| 55197| 62285| 51410| 18551| 16440| 19918|
Generating LALR tables
Platform 'arduino_101_mcuboot' not specified in any arch .ini file and will not be tested
Platform 'nrf52_blenano2' not specified in any arch .ini file and will not be tested
-------------sanity-out/qemu_x86_iamcu/tests/legacy/benchmark/app_kernel/test/qemu.log--------------
0 of 2 tests passed with 0 warnings in 185 seconds
Build step 'Execute shell' marked build as failure


zephyr/master: daily build zephyr-kernel-1.7.99-170406-bf902e6 Failure

donotreply@...
 

zephyr/master: daily build zephyr-kernel-1.7.99-170406-bf902e6 Failure



job zephyr-sanity build number 684 failed
see: https://jenkins.zephyrproject.org/job/zephyr-sanity/684/

--------------------------sanity-out/qemu_x86/tests/net/nbuf/test/qemu.log--------------------------
***** BOOTING ZEPHYR OS v1.7.99 - BUILD: Apr 7 2017 05:10:24 *****
ASSERTION FAIL [num_events > 0] @ /w/workspace/zephyr-sanity/kernel/poll.c:177:
zero events
--------------------------sanity-out/qemu_x86/tests/net/nbuf/test/qemu.log--------------------------
qemu_x86 tests/net/udp/test FAILED: timeout
--------------------------sanity-out/qemu_x86/tests/net/udp/test/qemu.log---------------------------
***** BOOTING ZEPHYR OS v1.7.99 - BUILD: Apr 7 2017 05:10:39 *****
***** CPU exception 5
Current thread ID = 0x001125c0
Faulting segment:address = 0x8:0x110885
eax: 0xa3, ebx: 0x0, ecx: 0x1125bf, edx: 0x110498
esi: 0x1, edi: 0x0, ebp: 00, esp: 0x1129ac
eflags: 0x202
Fatal fault in essential thread! Spinning...
--------------------------sanity-out/qemu_x86/tests/net/udp/test/qemu.log---------------------------
qemu_x86 tests/net/lib/dns_packet/test FAILED: timeout
---------------------sanity-out/qemu_x86/tests/net/lib/dns_packet/test/qemu.log---------------------
***** BOOTING ZEPHYR OS v1.7.99 - BUILD: Apr 7 2017 05:08:23 *****
ASSERTION FAIL [num_events > 0] @ /w/workspace/zephyr-sanity/kernel/poll.c:177:
zero events
---------------------sanity-out/qemu_x86/tests/net/lib/dns_packet/test/qemu.log---------------------
qemu_nios2 tests/legacy/kernel/test_sleep/test WARNING: rom_size +1208, is now 18804 +6.87%
Deltas based on metrics from last release
1 of 144 tests passed with 1 warnings in 10916 seconds
Extra environment setting:
CONFIG_ASSERT=y
CONFIG_DEBUG=y
Build step 'Execute shell' marked build as failure


job zephyr-sanity build number 683 failed
see: https://jenkins.zephyrproject.org/job/zephyr-sanity/683/

| 16| 16| 6777| 6691| 6159| 2360| 2391| 2597|
| 32| 32| 6786| 7872| 6657| 4715| 4065| 4806|
| 64| 64| 7460| 7376| 5792| 8579| 8676| 11049|
| 128| 128| 7812| 7855| 6648| 16385| 16295| 19253|
| 256| 256| 9200| 6067| 6261| 27826| 42195| 40888|
| 512| 512| 11957| 11958| 9765| 42820| 42816| 52432|
| 1024| 1024| 17755| 13015| 17645| 57673| 78678| 58033|
| 2048| 2048| 26438| 28773| 28269| 77464| 71177| 72446|
| 4096| 4096| 27326| 46921| 49927| 149893| 87295| 82039|
|-----------------------------------------------------------------------------|
| non-matching sizes (1_TO_N) to higher priority |
|-----------------------------------------------------------------------------|
| size(B) | time/packet (nsec) | KB/sec |
|-----------------------------------------------------------------------------|
| put | get | no buf | small buf| big buf | no buf | small buf| big buf |
|-----------------------------------------------------------------------------|
| 8| 4096| 2632| 2095| 1808| 3039| 3818| 4424|
| 16| 2048| 1498| 2394| 2223| 10680| 6683| 7197|
| 32| 1024| 2738| 2582| 2681| 11687| 12393| 11935|
| 64| 512| 3440| 3508| 2074| 18604| 18244| 30858|
| 128| 256| 6161| 6117| 4241| 20775| 20925| 30181|
| 256| 128| 32277| 11930| 13872| 7931| 21458| 18454|
| 512| 64| 38216| 24958| 32681| 13397| 20514| 15666|
| 1024| 32| 95590| 76870| 74972| 10712| 13321| 13658|
----------------sanity-out/qemu_x86/tests/legacy/benchmark/app_kernel/test/qemu.log-----------------
0 of 32 tests passed with 0 warnings in 200 seconds
Extra environment setting:
CONFIG_DEBUG=y
Build step 'Execute shell' marked build as failure


job zephyr-sanity build number 682 failed
see: https://jenkins.zephyrproject.org/job/zephyr-sanity/682/

|-----------------------------------------------------------------------------|
| non-matching sizes (1_TO_N) to higher priority |
|-----------------------------------------------------------------------------|
| size(B) | time/packet (nsec) | KB/sec |
|-----------------------------------------------------------------------------|
| put | get | no buf | small buf| big buf | no buf | small buf| big buf |
|-----------------------------------------------------------------------------|
| 8| 4096| 2377| 1233| 1250| 3365| 6488| 6400|
| 16| 2048| 1210| 1143| 1148| 13223| 13998| 13937|
| 32| 1024| 1375| 2571| 1880| 23272| 12446| 17021|
| 64| 512| 1961| 2438| 2102| 32636| 26251| 30447|
| 128| 256| 4690| 3913| 3676| 27292| 32711| 34820|
| 256| 128| 25803| 11430| 8090| 9921| 22397| 31644|
| 512| 64| 80558| 32858| 32290| 6355| 15582| 15856|
| 1024| 32| 119560| 99400| 60412| 8564| 10301| 16950|
Generating LALR tables
Platform 'arduino_101_mcuboot' not specified in any arch .ini file and will not be tested
Platform 'nrf52_blenano2' not specified in any arch .ini file and will not be tested
----------------sanity-out/qemu_x86/tests/legacy/benchmark/app_kernel/test/qemu.log-----------------
qemu_x86 tests/net/lib/dns_packet/test FAILED: timeout
---------------------sanity-out/qemu_x86/tests/net/lib/dns_packet/test/qemu.log---------------------
***** BOOTING ZEPHYR OS v1.7.99 - BUILD: Apr 7 2017 05:42:01 *****
ASSERTION FAIL [num_events > 0] @ /w/workspace/zephyr-sanity/kernel/poll.c:177:
zero events
---------------------sanity-out/qemu_x86/tests/net/lib/dns_packet/test/qemu.log---------------------
0 of 121 tests passed with 0 warnings in 10906 seconds
Extra environment setting:
CONFIG_ASSERT=y
Build step 'Execute shell' marked build as failure


job zephyr-sanity build number 681 failed
see: https://jenkins.zephyrproject.org/job/zephyr-sanity/681/

| 32| 32| 7028| 3597| 6966| 4553| 8896| 4593|
| 64| 64| 7223| 6937| 7461| 8860| 9225| 8577|
| 128| 128| 8170| 8620| 8366| 15667| 14849| 15300|
| 256| 256| 9819| 10736| 11162| 26071| 23845| 22934|
| 512| 512| 14315| 9302| 14301| 35766| 55041| 35801|
| 1024| 1024| 22721| 22911| 22766| 45068| 44694| 44979|
| 2048| 2048| 38640| 39399| 39509| 53002| 51981| 51836|
| 4096| 4096| 71024| 71357| 69615| 57670| 57401| 58837|
|-----------------------------------------------------------------------------|
| non-matching sizes (1_TO_N) to higher priority |
|-----------------------------------------------------------------------------|
| size(B) | time/packet (nsec) | KB/sec |
|-----------------------------------------------------------------------------|
| put | get | no buf | small buf| big buf | no buf | small buf| big buf |
|-----------------------------------------------------------------------------|
| 8| 4096| 2702| 1999| 2467| 2960| 4002| 3242|
| 16| 2048| 2571| 3153| 2498| 6223| 5074| 6405|
| 32| 1024| 2869| 2841| 2449| 11153| 11263| 13066|
| 64| 512| 3848| 3859| 4201| 16632| 16584| 15234|
| 128| 256| 7228| 7824| 7123| 17708| 16359| 17969|
| 256| 128| 75772| 18059| 15298| 3378| 14175| 16734|
| 512| 64| 51838| 39465| 34737| 9876| 12973| 14739|
| 1024| 32| 134615| 103990| 94592| 7606| 9847| 10825|
Generating LALR tables
Platform 'arduino_101_mcuboot' not specified in any arch .ini file and will not be tested
Platform 'nrf52_blenano2' not specified in any arch .ini file and will not be tested
-------------sanity-out/qemu_x86_iamcu/tests/legacy/benchmark/app_kernel/test/qemu.log--------------
0 of 4 tests passed with 0 warnings in 186 seconds
Build step 'Execute shell' marked build as failure


zephyr/master: daily build zephyr-kernel-1.7.99-170407-de38141 Failure

donotreply@...
 

zephyr/master: daily build zephyr-kernel-1.7.99-170407-de38141 Failure



job zephyr-sanity build number 688 failed
see: https://jenkins.zephyrproject.org/job/zephyr-sanity/688/

AR kernel/lib.a
make[3]: Target `all' not remade because of errors.
make[3]: Leaving directory `/w/workspace/zephyr-sanity/sanity-out/qemu_x86/samples/bluetooth/peripheral_dis/test'
make[2]: *** [sub-make] Error 2
make[2]: Target `all' not remade because of errors.
make[2]: Leaving directory `/w/workspace/zephyr-sanity'
make[1]: *** [all] Error 2
make[1]: Leaving directory `/w/workspace/zephyr-sanity/samples/bluetooth/peripheral_dis'
Generating LALR tables
Platform 'arduino_101_mcuboot' not specified in any arch .ini file and will not be tested
Platform 'nrf52_blenano2' not specified in any arch .ini file and will not be tested
----------------sanity-out/qemu_x86/samples/bluetooth/peripheral_dis/test/build.log-----------------
qemu_x86 tests/net/utils/test FAILED: timeout
-------------------------sanity-out/qemu_x86/tests/net/utils/test/qemu.log--------------------------
***** BOOTING ZEPHYR OS v1.7.99 - BUILD: Apr 8 2017 09:20:44 *****
ASSERTION FAIL [num_events > 0] @ /w/workspace/zephyr-sanity/kernel/poll.c:177:
zero events
-------------------------sanity-out/qemu_x86/tests/net/utils/test/qemu.log--------------------------
qemu_x86 tests/net/lib/dns_packet/test FAILED: timeout
---------------------sanity-out/qemu_x86/tests/net/lib/dns_packet/test/qemu.log---------------------
***** BOOTING ZEPHYR OS v1.7.99 - BUILD: Apr 8 2017 09:20:06 *****
ASSERTION FAIL [num_events > 0] @ /w/workspace/zephyr-sanity/kernel/poll.c:177:
zero events
---------------------sanity-out/qemu_x86/tests/net/lib/dns_packet/test/qemu.log---------------------
0 of 144 tests passed with 0 warnings in 11156 seconds
Extra environment setting:
CONFIG_ASSERT=y
CONFIG_DEBUG=y
Build step 'Execute shell' marked build as failure


job zephyr-sanity build number 687 failed
see: https://jenkins.zephyrproject.org/job/zephyr-sanity/687/

| 16| 16| 5692| 6065| 5934| 2810| 2638| 2696|
| 32| 32| 5962| 6859| 6000| 5367| 4665| 5333|
| 64| 64| 6469| 6440| 6231| 9893| 9937| 10271|
| 128| 128| 7399| 7089| 7225| 17299| 18056| 17716|
| 256| 256| 8541| 8712| 8490| 29973| 29384| 30153|
| 512| 512| 8224| 11168| 11341| 62256| 45845| 45145|
| 1024| 1024| 16583| 19378| 16560| 61749| 52843| 61835|
| 2048| 2048| 28154| 28664| 27626| 72742| 71448| 74133|
| 4096| 4096| 51000| 51288| 51822| 80313| 79862| 79039|
|-----------------------------------------------------------------------------|
| non-matching sizes (1_TO_N) to higher priority |
|-----------------------------------------------------------------------------|
| size(B) | time/packet (nsec) | KB/sec |
|-----------------------------------------------------------------------------|
| put | get | no buf | small buf| big buf | no buf | small buf| big buf |
|-----------------------------------------------------------------------------|
| 8| 4096| 2068| 1738| 1820| 3868| 4602| 4395|
| 16| 2048| 1794| 1749| 1749| 8918| 9148| 9148|
| 32| 1024| 1798| 2094| 2101| 17797| 15281| 15230|
| 64| 512| 2952| 3258| 3110| 21680| 19643| 20578|
| 128| 256| 5447| 5504| 5342| 23499| 23255| 23961|
| 256| 128| 41655| 14550| 12013| 6145| 17594| 21310|
| 512| 64| 52291| 34130| 31927| 9791| 15001| 16036|
| 1024| 32| 53355| 99882| 77847| 19192| 10252| 13154|
-------------sanity-out/qemu_x86_iamcu/tests/legacy/benchmark/app_kernel/test/qemu.log--------------
0 of 31 tests passed with 0 warnings in 198 seconds
Extra environment setting:
CONFIG_DEBUG=y
Build step 'Execute shell' marked build as failure


job zephyr-sanity build number 686 failed
see: https://jenkins.zephyrproject.org/job/zephyr-sanity/686/

|-----------------------------------------------------------------------------|
| non-matching sizes (1_TO_N) to higher priority |
|-----------------------------------------------------------------------------|
| size(B) | time/packet (nsec) | KB/sec |
|-----------------------------------------------------------------------------|
| put | get | no buf | small buf| big buf | no buf | small buf| big buf |
|-----------------------------------------------------------------------------|
| 8| 4096| 2120| 1769| 2577| 3773| 4522| 3104|
| 16| 2048| 1463| 1267| 1376| 10936| 12628| 11627|
| 32| 1024| 1643| 3382| 1866| 19476| 9461| 17148|
| 64| 512| 4502| 2263| 2136| 14215| 28281| 29962|
| 128| 256| 3920| 5771| 3942| 32653| 22179| 32470|
| 256| 128| 43818| 9926| 10706| 5842| 25790| 23911|
| 512| 64| 48340| 30182| 19881| 10591| 16963| 25753|
| 1024| 32| 68257| 68277| 58250| 15002| 14997| 17579|
----------------sanity-out/qemu_x86/tests/legacy/benchmark/app_kernel/test/qemu.log-----------------
qemu_x86 tests/net/lib/dns_packet/test FAILED: timeout
---------------------sanity-out/qemu_x86/tests/net/lib/dns_packet/test/qemu.log---------------------
***** BOOTING ZEPHYR OS v1.7.99 - BUILD: Apr 8 2017 05:07:10 *****
ASSERTION FAIL [num_events > 0] @ /w/workspace/zephyr-sanity/kernel/poll.c:177:
zero events
---------------------sanity-out/qemu_x86/tests/net/lib/dns_packet/test/qemu.log---------------------
Generating LALR tables
Platform 'arduino_101_mcuboot' not specified in any arch .ini file and will not be tested
Platform 'nrf52_blenano2' not specified in any arch .ini file and will not be tested
0 of 121 tests passed with 0 warnings in 10902 seconds
Extra environment setting:
CONFIG_ASSERT=y
Build step 'Execute shell' marked build as failure


job zephyr-sanity build number 685 failed
see: https://jenkins.zephyrproject.org/job/zephyr-sanity/685/

| 32| 32| 3679| 3588| 3561| 8698| 8918| 8986|
| 64| 64| 3915| 4275| 3783| 16347| 14970| 16917|
| 128| 128| 4503| 6482| 4418| 28425| 19746| 28972|
| 256| 256| 5734| 5981| 5845| 44645| 42802| 43798|
| 512| 512| 7521| 7740| 8473| 68076| 66149| 60427|
| 1024| 1024| 12055| 11888| 21959| 84944| 86137| 46632|
| 2048| 2048| 20155| 30389| 20075| 101612| 67392| 102017|
| 4096| 4096| 53623| 38588| 70299| 76385| 106146| 58265|
|-----------------------------------------------------------------------------|
| non-matching sizes (1_TO_N) to higher priority |
|-----------------------------------------------------------------------------|
| size(B) | time/packet (nsec) | KB/sec |
|-----------------------------------------------------------------------------|
| put | get | no buf | small buf| big buf | no buf | small buf| big buf |
|-----------------------------------------------------------------------------|
| 8| 4096| 1474| 1331| 1449| 5427| 6010| 5521|
| 16| 2048| 2526| 1316| 1722| 6334| 12158| 9291|
| 32| 1024| 1810| 2671| 1608| 17679| 11980| 19900|
| 64| 512| 2249| 4246| 2556| 28457| 15073| 25039|
| 128| 256| 3769| 4275| 3971| 33961| 29941| 32233|
| 256| 128| 35499| 11403| 10830| 7211| 22450| 23638|
| 512| 64| 31842| 48571| 19553| 16079| 10541| 26185|
| 1024| 32| 106675| 110620| 51107| 9599| 9256| 20036|
Generating LALR tables
Platform 'arduino_101_mcuboot' not specified in any arch .ini file and will not be tested
Platform 'nrf52_blenano2' not specified in any arch .ini file and will not be tested
----------------sanity-out/qemu_x86/tests/legacy/benchmark/app_kernel/test/qemu.log-----------------
0 of 3 tests passed with 0 warnings in 185 seconds
Build step 'Execute shell' marked build as failure


zephyr/master: daily build zephyr-kernel-1.7.99-170408-5d7a7c2 Failure

donotreply@...
 

zephyr/master: daily build zephyr-kernel-1.7.99-170408-5d7a7c2 Failure



job zephyr-sanity build number 692 failed
see: https://jenkins.zephyrproject.org/job/zephyr-sanity/692/

| non-matching sizes (1_TO_N) to higher priority |
|-----------------------------------------------------------------------------|
| size(B) | time/packet (nsec) | KB/sec |
|-----------------------------------------------------------------------------|
| put | get | no buf | small buf| big buf | no buf | small buf| big buf |
|-----------------------------------------------------------------------------|
| 8| 4096| 2090| 954| 1033| 3827| 8385| 7744|
| 16| 2048| 1082| 1106| 1090| 14787| 14466| 14678|
| 32| 1024| 1429| 1261| 1175| 22393| 25376| 27234|
| 64| 512| 1808| 2440| 2338| 35398| 26229| 27373|
| 128| 256| 3162| 3312| 3094| 40480| 38647| 41370|
| 256| 128| 38458| 14143| 9530| 6656| 18100| 26862|
| 512| 64| 32647| 23131| 30175| 15682| 22134| 16967|
| 1024| 32| 94247| 78240| 67315| 10865| 13087| 15212|
----------------sanity-out/qemu_x86/tests/legacy/benchmark/app_kernel/test/qemu.log-----------------
qemu_x86 tests/net/lib/dns_packet/test FAILED: timeout
---------------------sanity-out/qemu_x86/tests/net/lib/dns_packet/test/qemu.log---------------------
***** BOOTING ZEPHYR OS v1.7.99 - BUILD: Apr 9 2017 05:32:43 *****
ASSERTION FAIL [num_events > 0] @ /w/workspace/zephyr-sanity/kernel/poll.c:177:
zero events
---------------------sanity-out/qemu_x86/tests/net/lib/dns_packet/test/qemu.log---------------------
Generating LALR tables
Platform 'arduino_101_mcuboot' not specified in any arch .ini file and will not be tested
Platform 'nrf52_blenano2' not specified in any arch .ini file and will not be tested
0 of 141 tests passed with 0 warnings in 10856 seconds
Extra environment setting:
CONFIG_ASSERT=y
CONFIG_DEBUG=y
Build step 'Execute shell' marked build as failure


job zephyr-sanity build number 691 failed
see: https://jenkins.zephyrproject.org/job/zephyr-sanity/691/

| 16| 16| 6173| 6117| 9816| 2591| 2615| 1629|
| 32| 32| 6464| 6176| 5936| 4950| 5181| 5390|
| 64| 64| 6539| 6843| 6882| 9787| 9352| 9299|
| 128| 128| 7344| 7313| 7214| 17429| 17503| 17743|
| 256| 256| 8931| 8997| 11282| 28664| 28453| 22691|
| 512| 512| 11680| 11565| 11725| 43835| 44271| 43667|
| 1024| 1024| 17646| 18617| 25371| 58030| 55003| 40361|
| 2048| 2048| 29741| 30344| 29683| 68861| 67492| 68995|
| 4096| 4096| 52193| 52076| 53994| 78477| 78654| 75860|
|-----------------------------------------------------------------------------|
| non-matching sizes (1_TO_N) to higher priority |
|-----------------------------------------------------------------------------|
| size(B) | time/packet (nsec) | KB/sec |
|-----------------------------------------------------------------------------|
| put | get | no buf | small buf| big buf | no buf | small buf| big buf |
|-----------------------------------------------------------------------------|
| 8| 4096| 2226| 2875| 2016| 3593| 2782| 3968|
| 16| 2048| 2243| 2055| 2371| 7133| 7785| 6748|
| 32| 1024| 3219| 3125| 4308| 9940| 10240| 7428|
| 64| 512| 3966| 4876| 4068| 16137| 13125| 15732|
| 128| 256| 6719| 7352| 5463| 19050| 17410| 23430|
| 256| 128| 49200| 13865| 17823| 5203| 18463| 14363|
| 512| 64| 127040| 45247| 31360| 4030| 11315| 16326|
| 1024| 32| 118040| 123432| 94997| 8675| 8296| 10779|
-------------sanity-out/qemu_x86_iamcu/tests/legacy/benchmark/app_kernel/test/qemu.log--------------
1 of 32 tests passed with 0 warnings in 218 seconds
Extra environment setting:
CONFIG_DEBUG=y
Build step 'Execute shell' marked build as failure


job zephyr-sanity build number 690 failed
see: https://jenkins.zephyrproject.org/job/zephyr-sanity/690/

|-----------------------------------------------------------------------------|
| non-matching sizes (1_TO_N) to higher priority |
|-----------------------------------------------------------------------------|
| size(B) | time/packet (nsec) | KB/sec |
|-----------------------------------------------------------------------------|
| put | get | no buf | small buf| big buf | no buf | small buf| big buf |
|-----------------------------------------------------------------------------|
| 8| 4096| 1343| 1286| 1405| 5956| 6220| 5693|
| 16| 2048| 1256| 1184| 1341| 12738| 13513| 11931|
| 32| 1024| 1415| 1421| 1557| 22614| 22519| 20552|
| 64| 512| 2157| 2540| 2426| 29670| 25196| 26380|
| 128| 256| 3797| 3500| 3515| 33710| 36571| 36415|
| 256| 128| 24190| 10145| 7762| 10582| 25234| 32981|
| 512| 64| 26607| 21101| 18962| 19243| 24264| 27001|
| 1024| 32| 52420| 105187| 47670| 19534| 9735| 21481|
-------------sanity-out/qemu_x86_iamcu/tests/legacy/benchmark/app_kernel/test/qemu.log--------------
qemu_x86 tests/net/lib/dns_packet/test FAILED: timeout
---------------------sanity-out/qemu_x86/tests/net/lib/dns_packet/test/qemu.log---------------------
***** BOOTING ZEPHYR OS v1.7.99 - BUILD: Apr 9 2017 06:05:08 *****
ASSERTION FAIL [num_events > 0] @ /w/workspace/zephyr-sanity/kernel/poll.c:177:
zero events
---------------------sanity-out/qemu_x86/tests/net/lib/dns_packet/test/qemu.log---------------------
Generating LALR tables
Platform 'arduino_101_mcuboot' not specified in any arch .ini file and will not be tested
Platform 'nrf52_blenano2' not specified in any arch .ini file and will not be tested
0 of 120 tests passed with 0 warnings in 10945 seconds
Extra environment setting:
CONFIG_ASSERT=y
Build step 'Execute shell' marked build as failure


job zephyr-sanity build number 689 failed
see: https://jenkins.zephyrproject.org/job/zephyr-sanity/689/

| 32| 32| 6183| 7158| 8614| 5175| 4470| 3714|
| 64| 64| 3922| 7973| 6564| 16318| 8027| 9750|
| 128| 128| 7534| 4565| 14104| 16989| 28039| 9075|
| 256| 256| 11122| 9416| 11120| 23017| 27187| 23021|
| 512| 512| 7309| 14868| 15456| 70050| 34436| 33126|
| 1024| 1024| 12882| 24549| 22165| 79490| 41712| 46198|
| 2048| 2048| 39505| 39458| 19632| 51841| 51903| 104319|
| 4096| 4096| 40723| 128080| 56779| 100581| 31980| 72139|
|-----------------------------------------------------------------------------|
| non-matching sizes (1_TO_N) to higher priority |
|-----------------------------------------------------------------------------|
| size(B) | time/packet (nsec) | KB/sec |
|-----------------------------------------------------------------------------|
| put | get | no buf | small buf| big buf | no buf | small buf| big buf |
|-----------------------------------------------------------------------------|
| 8| 4096| 1586| 1174| 2750| 5044| 6814| 2909|
| 16| 2048| 2813| 3338| 3250| 5687| 4793| 4923|
| 32| 1024| 5245| 1478| 1475| 6101| 21650| 21694|
| 64| 512| 4379| 1990| 4165| 14615| 32160| 15366|
| 128| 256| 6963| 6808| 6909| 18382| 18801| 18526|
| 256| 128| 27200| 10854| 15692| 9411| 23585| 16314|
| 512| 64| 59056| 20992| 32130| 8669| 24390| 15935|
| 1024| 32| 150925| 112295| 48055| 6784| 9118| 21308|
Generating LALR tables
Platform 'arduino_101_mcuboot' not specified in any arch .ini file and will not be tested
Platform 'nrf52_blenano2' not specified in any arch .ini file and will not be tested
-------------sanity-out/qemu_x86_iamcu/tests/legacy/benchmark/app_kernel/test/qemu.log--------------
0 of 3 tests passed with 0 warnings in 187 seconds
Build step 'Execute shell' marked build as failure


zephyr/master: daily build zephyr-kernel-1.7.99-170409-cdb12c5 Failure

donotreply@...
 

zephyr/master: daily build zephyr-kernel-1.7.99-170409-cdb12c5 Failure



job zephyr-sanity build number 696 failed
see: https://jenkins.zephyrproject.org/job/zephyr-sanity/696/

| non-matching sizes (1_TO_N) to higher priority |
|-----------------------------------------------------------------------------|
| size(B) | time/packet (nsec) | KB/sec |
|-----------------------------------------------------------------------------|
| put | get | no buf | small buf| big buf | no buf | small buf| big buf |
|-----------------------------------------------------------------------------|
| 8| 4096| 1410| 924| 1322| 5673| 8658| 6051|
| 16| 2048| 965| 1474| 1084| 16580| 10854| 14760|
| 32| 1024| 1235| 1523| 1864| 25910| 21011| 17167|
| 64| 512| 2164| 1542| 1661| 29574| 41504| 38531|
| 128| 256| 2828| 2919| 2813| 45261| 43850| 45503|
| 256| 128| 42204| 12353| 7910| 6065| 20723| 32364|
| 512| 64| 27576| 22551| 13685| 18566| 22704| 37413|
| 1024| 32| 43442| 45027| 42282| 23571| 22741| 24218|
Generating LALR tables
Platform 'arduino_101_mcuboot' not specified in any arch .ini file and will not be tested
Platform 'nrf52_blenano2' not specified in any arch .ini file and will not be tested
-------------sanity-out/qemu_x86_iamcu/tests/legacy/benchmark/app_kernel/test/qemu.log--------------
qemu_x86 tests/net/lib/dns_packet/test FAILED: timeout
---------------------sanity-out/qemu_x86/tests/net/lib/dns_packet/test/qemu.log---------------------
***** BOOTING ZEPHYR OS v1.7.99 - BUILD: Apr 10 2017 06:51:50 *****
ASSERTION FAIL [num_events > 0] @ /w/workspace/zephyr-sanity/kernel/poll.c:177:
zero events
---------------------sanity-out/qemu_x86/tests/net/lib/dns_packet/test/qemu.log---------------------
2 of 143 tests passed with 0 warnings in 10992 seconds
Extra environment setting:
CONFIG_ASSERT=y
CONFIG_DEBUG=y
Build step 'Execute shell' marked build as failure


job zephyr-sanity build number 695 failed
see: https://jenkins.zephyrproject.org/job/zephyr-sanity/695/

| 16| 16| 6560| 6513| 5222| 2439| 2456| 3063|
| 32| 32| 6800| 6728| 7052| 4705| 4756| 4537|
| 64| 64| 7149| 7083| 7069| 8952| 9035| 9053|
| 128| 128| 7653| 6660| 7643| 16725| 19219| 16747|
| 256| 256| 9384| 9104| 9114| 27280| 28119| 28088|
| 512| 512| 12021| 12261| 11832| 42592| 41758| 43272|
| 1024| 1024| 15968| 17830| 17351| 64128| 57431| 59016|
| 2048| 2048| 28556| 29843| 21697| 71718| 68625| 94390|
| 4096| 4096| 37463| 28054| 51627| 109334| 146004| 79338|
|-----------------------------------------------------------------------------|
| non-matching sizes (1_TO_N) to higher priority |
|-----------------------------------------------------------------------------|
| size(B) | time/packet (nsec) | KB/sec |
|-----------------------------------------------------------------------------|
| put | get | no buf | small buf| big buf | no buf | small buf| big buf |
|-----------------------------------------------------------------------------|
| 8| 4096| 2294| 1712| 1956| 3487| 4672| 4089|
| 16| 2048| 2327| 2035| 2312| 6875| 7862| 6920|
| 32| 1024| 2454| 2382| 4565| 13039| 13434| 7009|
| 64| 512| 3370| 3223| 4050| 18991| 19857| 15802|
| 128| 256| 5861| 5855| 6303| 21839| 21861| 20307|
| 256| 128| 45117| 14509| 15550| 5674| 17644| 16463|
| 512| 64| 61345| 30888| 28873| 8346| 16576| 17732|
| 1024| 32| 103462| 70057| 79327| 9897| 14616| 12908|
----------------sanity-out/qemu_x86/tests/legacy/benchmark/app_kernel/test/qemu.log-----------------
2 of 33 tests passed with 0 warnings in 211 seconds
Extra environment setting:
CONFIG_DEBUG=y
Build step 'Execute shell' marked build as failure


job zephyr-sanity build number 694 failed
see: https://jenkins.zephyrproject.org/job/zephyr-sanity/694/

|-----------------------------------------------------------------------------|
| non-matching sizes (1_TO_N) to higher priority |
|-----------------------------------------------------------------------------|
| size(B) | time/packet (nsec) | KB/sec |
|-----------------------------------------------------------------------------|
| put | get | no buf | small buf| big buf | no buf | small buf| big buf |
|-----------------------------------------------------------------------------|
| 8| 4096| 3081| 1560| 1534| 2596| 5128| 5215|
| 16| 2048| 1872| 1883| 3046| 8547| 8497| 5252|
| 32| 1024| 1711| 1942| 2081| 18702| 16477| 15377|
| 64| 512| 3927| 5072| 2170| 16297| 12618| 29493|
| 128| 256| 7554| 7341| 7283| 16944| 17436| 17575|
| 256| 128| 29590| 10687| 16705| 8651| 23954| 15324|
| 512| 64| 32462| 24683| 26083| 15772| 20743| 19629|
| 1024| 32| 54312| 127617| 44955| 18854| 8024| 22778|
-------------sanity-out/qemu_x86_iamcu/tests/legacy/benchmark/app_kernel/test/qemu.log--------------
qemu_x86 tests/net/lib/dns_packet/test FAILED: timeout
---------------------sanity-out/qemu_x86/tests/net/lib/dns_packet/test/qemu.log---------------------
***** BOOTING ZEPHYR OS v1.7.99 - BUILD: Apr 10 2017 05:09:50 *****
ASSERTION FAIL [num_events > 0] @ /w/workspace/zephyr-sanity/kernel/poll.c:177:
zero events
---------------------sanity-out/qemu_x86/tests/net/lib/dns_packet/test/qemu.log---------------------
Generating LALR tables
Platform 'arduino_101_mcuboot' not specified in any arch .ini file and will not be tested
Platform 'nrf52_blenano2' not specified in any arch .ini file and will not be tested
0 of 121 tests passed with 0 warnings in 10937 seconds
Extra environment setting:
CONFIG_ASSERT=y
Build step 'Execute shell' marked build as failure


job zephyr-sanity build number 693 failed
see: https://jenkins.zephyrproject.org/job/zephyr-sanity/693/

| 32| 32| 7089| 7224| 7061| 4514| 4429| 4531|
| 64| 64| 4121| 7810| 4113| 15530| 8194| 15560|
| 128| 128| 4673| 10066| 4602| 27391| 12716| 27813|
| 256| 256| 5701| 10512| 5726| 44904| 24353| 44708|
| 512| 512| 8068| 14256| 14510| 63460| 35914| 35286|
| 1024| 1024| 23476| 23309| 22961| 43619| 43931| 44597|
| 2048| 2048| 37977| 39868| 38095| 53927| 51369| 53760|
| 4096| 4096| 70270| 70200| 69567| 58289| 58347| 58878|
|-----------------------------------------------------------------------------|
| non-matching sizes (1_TO_N) to higher priority |
|-----------------------------------------------------------------------------|
| size(B) | time/packet (nsec) | KB/sec |
|-----------------------------------------------------------------------------|
| put | get | no buf | small buf| big buf | no buf | small buf| big buf |
|-----------------------------------------------------------------------------|
| 8| 4096| 2662| 2346| 2484| 3005| 3410| 3220|
| 16| 2048| 2560| 2569| 2548| 6250| 6228| 6279|
| 32| 1024| 2790| 2790| 2801| 11469| 11469| 11424|
| 64| 512| 4050| 4135| 4160| 15802| 15477| 15384|
| 128| 256| 7180| 6718| 6943| 17827| 19053| 18435|
| 256| 128| 48599| 18209| 14848| 5267| 14058| 17241|
| 512| 64| 53011| 37740| 33680| 9658| 13566| 15201|
| 1024| 32| 104635| 107007| 89720| 9786| 9569| 11413|
Generating LALR tables
Platform 'arduino_101_mcuboot' not specified in any arch .ini file and will not be tested
Platform 'nrf52_blenano2' not specified in any arch .ini file and will not be tested
-------------sanity-out/qemu_x86_iamcu/tests/legacy/benchmark/app_kernel/test/qemu.log--------------
0 of 3 tests passed with 0 warnings in 184 seconds
Build step 'Execute shell' marked build as failure


zephyr/master: daily build zephyr-kernel-1.7.99-170410-bf382a5 Failure

donotreply@...
 

zephyr/master: daily build zephyr-kernel-1.7.99-170410-bf382a5 Failure



job zephyr-sanity build number 700 failed
see: https://jenkins.zephyrproject.org/job/zephyr-sanity/700/

| non-matching sizes (1_TO_N) to higher priority |
|-----------------------------------------------------------------------------|
| size(B) | time/packet (nsec) | KB/sec |
|-----------------------------------------------------------------------------|
| put | get | no buf | small buf| big buf | no buf | small buf| big buf |
|-----------------------------------------------------------------------------|
| 8| 4096| 1380| 1068| 1088| 5797| 7490| 7352|
| 16| 2048| 1760| 1083| 1043| 9090| 14773| 15340|
| 32| 1024| 1160| 1146| 1213| 27586| 27923| 26380|
| 64| 512| 2859| 2258| 2723| 22385| 28343| 23503|
| 128| 256| 3327| 2889| 3188| 38473| 44305| 40150|
| 256| 128| 32048| 8706| 6339| 7988| 29405| 40384|
| 512| 64| 34062| 23660| 14405| 15031| 21639| 35543|
| 1024| 32| 54280| 85375| 49477| 18865| 11994| 20696|
Generating LALR tables
Platform 'arduino_101_mcuboot' not specified in any arch .ini file and will not be tested
Platform 'nrf52_blenano2' not specified in any arch .ini file and will not be tested
----------------sanity-out/qemu_x86/tests/legacy/benchmark/app_kernel/test/qemu.log-----------------
qemu_x86 tests/net/lib/dns_packet/test FAILED: timeout
---------------------sanity-out/qemu_x86/tests/net/lib/dns_packet/test/qemu.log---------------------
***** BOOTING ZEPHYR OS v1.7.99 - BUILD: Apr 11 2017 07:16:48 *****
ASSERTION FAIL [num_events > 0] @ /w/workspace/zephyr-sanity/kernel/poll.c:177:
zero events
---------------------sanity-out/qemu_x86/tests/net/lib/dns_packet/test/qemu.log---------------------
1 of 169 tests passed with 0 warnings in 10984 seconds
Extra environment setting:
CONFIG_ASSERT=y
CONFIG_DEBUG=y
Build step 'Execute shell' marked build as failure


job zephyr-sanity build number 699 failed
see: https://jenkins.zephyrproject.org/job/zephyr-sanity/699/

| 128| 128| 5452| 4619| 9221| 23477| 27711| 13881|
| 256| 256| 4862| 8184| 6056| 52653| 31280| 42272|
| 512| 512| 10840| 6846| 20099| 47232| 74788| 25473|
| 1024| 1024| 16565| 24244| 14312| 61817| 42237| 71548|
| 2048| 2048| 24387| 27452| 28035| 83979| 74602| 73051|
| 4096| 4096| 52497| 48908| 37978| 78023| 83749| 107851|
|-----------------------------------------------------------------------------|
| non-matching sizes (1_TO_N) to higher priority |
|-----------------------------------------------------------------------------|
| size(B) | time/packet (nsec) | KB/sec |
|-----------------------------------------------------------------------------|
| put | get | no buf | small buf| big buf | no buf | small buf| big buf |
|-----------------------------------------------------------------------------|
| 8| 4096| 1739| 1495| 1454| 4600| 5351| 5502|
| 16| 2048| 1312| 2289| 1805| 12195| 6989| 8864|
| 32| 1024| 1902| 2325| 1885| 16824| 13763| 16976|
| 64| 512| 3714| 2087| 1592| 17232| 30666| 40201|
| 128| 256| 4920| 3657| 4277| 26016| 35001| 29927|
| 256| 128| 28411| 14371| 12466| 9010| 17813| 20535|
| 512| 64| 38005| 26717| 24948| 13471| 19163| 20522|
| 1024| 32| 86220| 87992| 75975| 11876| 11637| 13478|
Generating LALR tables
Platform 'arduino_101_mcuboot' not specified in any arch .ini file and will not be tested
Platform 'nrf52_blenano2' not specified in any arch .ini file and will not be tested
-------------sanity-out/qemu_x86_iamcu/tests/legacy/benchmark/app_kernel/test/qemu.log--------------
1 of 32 tests passed with 0 warnings in 201 seconds
Extra environment setting:
CONFIG_DEBUG=y
Build step 'Execute shell' marked build as failure


job zephyr-sanity build number 698 failed
see: https://jenkins.zephyrproject.org/job/zephyr-sanity/698/

|-----------------------------------------------------------------------------|
| non-matching sizes (1_TO_N) to higher priority |
|-----------------------------------------------------------------------------|
| size(B) | time/packet (nsec) | KB/sec |
|-----------------------------------------------------------------------------|
| put | get | no buf | small buf| big buf | no buf | small buf| big buf |
|-----------------------------------------------------------------------------|
| 8| 4096| 2578| 1273| 1817| 3103| 6284| 4402|
| 16| 2048| 1390| 1326| 1440| 11510| 12066| 11111|
| 32| 1024| 2583| 1521| 1739| 12388| 21038| 18401|
| 64| 512| 2375| 2161| 3329| 26947| 29615| 19224|
| 128| 256| 4305| 4527| 4780| 29732| 28274| 26778|
| 256| 128| 55393| 16056| 10093| 4621| 15944| 25364|
| 512| 64| 57648| 25370| 35776| 8881| 20181| 14311|
| 1024| 32| 56827| 105045| 90082| 18019| 9748| 11367|
-------------sanity-out/qemu_x86_iamcu/tests/legacy/benchmark/app_kernel/test/qemu.log--------------
Generating LALR tables
Platform 'arduino_101_mcuboot' not specified in any arch .ini file and will not be tested
Platform 'nrf52_blenano2' not specified in any arch .ini file and will not be tested
qemu_x86 tests/net/lib/dns_packet/test FAILED: timeout
---------------------sanity-out/qemu_x86/tests/net/lib/dns_packet/test/qemu.log---------------------
***** BOOTING ZEPHYR OS v1.7.99 - BUILD: Apr 11 2017 07:25:09 *****
ASSERTION FAIL [num_events > 0] @ /w/workspace/zephyr-sanity/kernel/poll.c:177:
zero events
---------------------sanity-out/qemu_x86/tests/net/lib/dns_packet/test/qemu.log---------------------
1 of 142 tests passed with 0 warnings in 10844 seconds
Extra environment setting:
CONFIG_ASSERT=y
Build step 'Execute shell' marked build as failure


job zephyr-sanity build number 697 failed
see: https://jenkins.zephyrproject.org/job/zephyr-sanity/697/

| 32| 32| 5445| 5350| 6285| 5876| 5981| 5091|
| 64| 64| 3864| 7140| 6881| 16563| 8963| 9300|
| 128| 128| 7035| 4697| 7338| 18194| 27251| 17443|
| 256| 256| 8899| 6550| 9177| 28767| 39083| 27895|
| 512| 512| 7238| 13364| 11342| 70737| 38311| 45141|
| 1024| 1024| 15840| 17174| 19627| 64646| 59625| 52173|
| 2048| 2048| 30371| 38405| 26116| 67432| 53326| 78419|
| 4096| 4096| 64861| 39758| 41648| 63150| 103023| 98348|
|-----------------------------------------------------------------------------|
| non-matching sizes (1_TO_N) to higher priority |
|-----------------------------------------------------------------------------|
| size(B) | time/packet (nsec) | KB/sec |
|-----------------------------------------------------------------------------|
| put | get | no buf | small buf| big buf | no buf | small buf| big buf |
|-----------------------------------------------------------------------------|
| 8| 4096| 1353| 1646| 1365| 5912| 4860| 5860|
| 16| 2048| 1304| 1326| 1415| 12269| 12066| 11307|
| 32| 1024| 1710| 1652| 1652| 18713| 19370| 19370|
| 64| 512| 1999| 3414| 3430| 32016| 18746| 18658|
| 128| 256| 6316| 3521| 6246| 20265| 36353| 20493|
| 256| 128| 28040| 10099| 7899| 9129| 25349| 32409|
| 512| 64| 28531| 19691| 18078| 17945| 26001| 28321|
| 1024| 32| 104817| 94317| 45687| 9769| 10857| 22413|
Generating LALR tables
Platform 'arduino_101_mcuboot' not specified in any arch .ini file and will not be tested
Platform 'nrf52_blenano2' not specified in any arch .ini file and will not be tested
-------------sanity-out/qemu_x86_iamcu/tests/legacy/benchmark/app_kernel/test/qemu.log--------------
0 of 2 tests passed with 0 warnings in 184 seconds
Build step 'Execute shell' marked build as failure

161 - 180 of 2863