Date   

[Still Failing] Zephyr / zephyr-daily #412 (main) #builds

Buildkite <notifications@...>
 

Scheduled build Duration: 6 hours, 49 minutes, 42 seconds
Build #412 | main | 997bbcb
View Build →
ℹ︎

Read the JUnit test report

✖︎

8 failures:

samples/subsys/usb/dfu/sample.usb.dfu in teensy41:samples/subsys/usb/dfu/sample.usb
Including boilerplate (Zephyr base): /workdir/zephyr/cmake/app/boilerplate.cmake
-- Application: /workdir/zephyr/samples/subsys/usb/dfu
-- Zephyr version: 2.6.99 (/workdir/zephyr), build: zephyr-v2.6.0-1623-g997bbcb000c3
-- Found Python3: /usr/bin/python3.8 (found suitable exact version "3.8.10") found components: Interpreter
-- Found west (found suitable version "0.11.0", minimum required is "0.7.1")
-- Board: teensy41
-- Cache files will be written to: /root/.cache/zephyr
-- Using toolchain: zephyr 0.13.0 (/opt/toolchains/zephyr-sdk-0.13.0-rc4)
-- Found dtc: /opt/toolchains/zephyr-sdk-0.13.0-rc4/sysroots/x86_64-pokysdk-linux/usr/bin/dtc (found suitable version "1.6.0", minimum required is "1.4.6")
-- Found BOARD.dts: /workdir/zephyr/boards/arm/teensy4/teensy41.dts
-- Generated zephyr.dts: /workdir/zephyr/twister-out/teensy41/samples/subsys/usb/dfu/sample.usb.dfu/zephyr/zephyr.dts
-- Generated devicetree_unfixed.h: /workdir/zephyr/twister-out/teensy41/samples/subsys/usb/dfu/sample.usb.dfu/zephyr/include/generated/devicetree_unfixed.h
-- Generated device_extern.h: /workdir/zephyr/twister-out/teensy41/samples/subsys/usb/dfu/sample.usb.dfu/zephyr/include/generated/device_extern.h
Parsing /workdir/zephyr/samples/subsys/usb/dfu/Kconfig
Loaded configuration '/workdir/zephyr/boards/arm/teensy4/teensy41_defconfig'
Merged configuration '/workdir/zephyr/samples/subsys/usb/dfu/prj.conf'

warning: FLASH_PAGE_LAYOUT (defined at drivers/flash/Kconfig:54) has direct dependencies FLASH_HAS_PAGE_LAYOUT && FLASH with value n, but is currently being y-selected by the following symbols:
 - STREAM_FLASH (defined at subsys/storage/stream/Kconfig:7), with value y, direct dependencies y (value: y)

warning: FLASH_MAP (defined at subsys/storage/flash_map/Kconfig:10) has direct dependencies FLASH_HAS_DRIVER_ENABLED with value n, but is currently being y-selected by the following symbols:
 - MCUBOOT_IMG_MANAGER (defined at subsys/dfu/Kconfig:25), with value y, direct dependencies  (value: y), and select condition  (value: y)

error: Aborting due to Kconfig warnings

CMake Error at /workdir/zephyr/cmake/kconfig.cmake:268 (message):
  command failed with return code: 1
Call Stack (most recent call first):
  /workdir/zephyr/cmake/app/boilerplate.cmake:572 (include)
  /workdir/zephyr/share/zephyr-package/cmake/ZephyrConfig.cmake:24 (include)
  /workdir/zephyr/share/zephyr-package/cmake/ZephyrConfig.cmake:35 (include_boilerplate)
  CMakeLists.txt:4 (find_package)


-- Configuring incomplete, errors occurred!

in Job #578da160-4168-4bab-a9fa-d87b50fe0b84

samples/subsys/usb/dfu/sample.usb.dfu in teensy40:samples/subsys/usb/dfu/sample.usb
Including boilerplate (Zephyr base): /workdir/zephyr/cmake/app/boilerplate.cmake
-- Application: /workdir/zephyr/samples/subsys/usb/dfu
-- Zephyr version: 2.6.99 (/workdir/zephyr), build: zephyr-v2.6.0-1623-g997bbcb000c3
-- Found Python3: /usr/bin/python3.8 (found suitable exact version "3.8.10") found components: Interpreter
-- Found west (found suitable version "0.11.0", minimum required is "0.7.1")
-- Board: teensy40
-- Cache files will be written to: /root/.cache/zephyr
-- Using toolchain: zephyr 0.13.0 (/opt/toolchains/zephyr-sdk-0.13.0-rc4)
-- Found dtc: /opt/toolchains/zephyr-sdk-0.13.0-rc4/sysroots/x86_64-pokysdk-linux/usr/bin/dtc (found suitable version "1.6.0", minimum required is "1.4.6")
-- Found BOARD.dts: /workdir/zephyr/boards/arm/teensy4/teensy40.dts
-- Generated zephyr.dts: /workdir/zephyr/twister-out/teensy40/samples/subsys/usb/dfu/sample.usb.dfu/zephyr/zephyr.dts
-- Generated devicetree_unfixed.h: /workdir/zephyr/twister-out/teensy40/samples/subsys/usb/dfu/sample.usb.dfu/zephyr/include/generated/devicetree_unfixed.h
-- Generated device_extern.h: /workdir/zephyr/twister-out/teensy40/samples/subsys/usb/dfu/sample.usb.dfu/zephyr/include/generated/device_extern.h

warning: FLASH_PAGE_LAYOUT (defined at drivers/flash/Kconfig:54) has direct dependencies FLASH_HAS_PAGE_LAYOUT && FLASH with value n, but is currently being y-selected by the following symbols:
 - STREAM_FLASH (defined at subsys/storage/stream/Kconfig:7), with value y, direct dependencies y (value: y)

warning: FLASH_MAP (defined at subsys/storage/flash_map/Kconfig:10) has direct dependencies FLASH_HAS_DRIVER_ENABLED with value n, but is currently being y-selected by the following symbols:
 - MCUBOOT_IMG_MANAGER (defined at subsys/dfu/Kconfig:25), with value y, direct dependencies  (value: y), and select condition  (value: y)
Parsing /workdir/zephyr/samples/subsys/usb/dfu/Kconfig
Loaded configuration '/workdir/zephyr/boards/arm/teensy4/teensy40_defconfig'
Merged configuration '/workdir/zephyr/samples/subsys/usb/dfu/prj.conf'

error: Aborting due to Kconfig warnings

CMake Error at /workdir/zephyr/cmake/kconfig.cmake:268 (message):
  command failed with return code: 1
Call Stack (most recent call first):
  /workdir/zephyr/cmake/app/boilerplate.cmake:572 (include)
  /workdir/zephyr/share/zephyr-package/cmake/ZephyrConfig.cmake:24 (include)
  /workdir/zephyr/share/zephyr-package/cmake/ZephyrConfig.cmake:35 (include_boilerplate)
  CMakeLists.txt:4 (find_package)


-- Configuring incomplete, errors occurred!

in Job #63439134-457f-4b87-8817-68eadf38b4c1

tests/drivers/build_all/modem/drivers.modem.build in native_posix_64:tests/drivers/build_all/modem/drivers.modem
Including boilerplate (Zephyr base): /workdir/zephyr/cmake/app/boilerplate.cmake
-- Application: /workdir/zephyr/tests/drivers/build_all/modem
-- Zephyr version: 2.6.99 (/workdir/zephyr), build: zephyr-v2.6.0-1623-g997bbcb000c3
-- Found Python3: /usr/bin/python3.8 (found suitable exact version "3.8.10") found components: Interpreter
-- Found west (found suitable version "0.11.0", minimum required is "0.7.1")
-- Board: native_posix_64
-- Cache files will be written to: /root/.cache/zephyr
-- Using toolchain: zephyr 0.13.0 (/opt/toolchains/zephyr-sdk-0.13.0-rc4)
-- Found dtc: /opt/toolchains/zephyr-sdk-0.13.0-rc4/sysroots/x86_64-pokysdk-linux/usr/bin/dtc (found suitable version "1.6.0", minimum required is "1.4.6")
-- Found toolchain: host (gcc/ld)
-- Found BOARD.dts: /workdir/zephyr/boards/posix/native_posix/native_posix_64.dts
-- Found devicetree overlay: /workdir/zephyr/tests/drivers/build_all/modem/app.overlay
-- Generated zephyr.dts: /workdir/zephyr/twister-out/native_posix_64/tests/drivers/build_all/modem/drivers.modem.build/zephyr/zephyr.dts
-- Generated devicetree_unfixed.h: /workdir/zephyr/twister-out/native_posix_64/tests/drivers/build_all/modem/drivers.modem.build/zephyr/include/generated/devicetree_unfixed.h
-- Generated device_extern.h: /workdir/zephyr/twister-out/native_posix_64/tests/drivers/build_all/modem/drivers.modem.build/zephyr/include/generated/device_extern.h

warning: TEST_RANDOM_GENERATOR (defined at subsys/random/Kconfig:8) was assigned the value 'y' but
got the value 'n'. Check these unsatisfied dependencies: (!ENTROPY_HAS_DRIVER) (=n). See
http://docs.zephyrproject.org/latest/reference/kconfig/CONFIG_TEST_RANDOM_GENERATOR.html and/or look
up TEST_RANDOM_GENERATOR in the menuconfig/guiconfig interface. The Application Development Primer,
Setting Configuration Values, and Kconfig - Tips and Best Practices sections of the manual might be
helpful too.

Parsing /workdir/zephyr/tests/drivers/build_all/modem/Kconfig
Loaded configuration '/workdir/zephyr/boards/posix/native_posix/native_posix_64_defconfig'
Merged configuration 'modem.conf'
Configuration saved to '/workdir/zephyr/twister-out/native_posix_64/tests/drivers/build_all/modem/drivers.modem.build/zephyr/.config'
Kconfig header saved to '/workdir/zephyr/twister-out/native_posix_64/tests/drivers/build_all/modem/drivers.modem.build/zephyr/include/generated/autoconf.h'
-- The C compiler identification is GNU 9.3.0
-- The CXX compiler identification is GNU 9.3.0
-- The ASM compiler identification is GNU
-- Found assembler: /usr/bin/gcc
CMake Warning at ../../../../CMakeLists.txt:718 (message):
  No SOURCES given to Zephyr library: drivers__gpio

  Excluding target from build.


-- Configuring done
-- Generating done
-- Build files have been written to: /workdir/zephyr/twister-out/native_posix_64/tests/drivers/build_all/modem/drivers.modem.build
[1/153] Preparing syscall dependency handling

[2/153] Generating misc/generated/syscalls_subdirs.trigger
[3/153] Generating misc/generated/syscalls.json, misc/generated/struct_tags.json
[4/153] Generating include/generated/syscall_dispatch.c, include/generated/syscall_list.h
[5/153] Generating include/generated/driver-validation.h
[6/153] Generating include/generated/kobj-types-enum.h, include/generated/otype-to-str.h, include/generated/otype-to-size.h
[7/153] Building C object zephyr/CMakeFiles/offsets.dir/arch/posix/core/offsets/offsets.c.obj
[8/153] Generating include/generated/offsets.h
[9/153] Building C object zephyr/CMakeFiles/zephyr.dir/lib/os/cbprintf.c.obj
[10/153] Building C object CMakeFiles/app.dir/src/main.c.obj
[11/153] Linking C static library app/libapp.a
[12/153] Building C object zephyr/CMakeFiles/zephyr.dir/lib/os/crc32c_sw.c.obj
[13/153] Building C object zephyr/CMakeFiles/zephyr.dir/lib/os/crc32_sw.c.obj
[14/153] Building C object zephyr/CMakeFiles/zephyr.dir/lib/os/cbprintf_packaged.c.obj
[15/153] Building C object zephyr/CMakeFiles/zephyr.dir/lib/os/crc16_sw.c.obj
[16/153] Building C object zephyr/CMakeFiles/zephyr.dir/lib/os/crc7_sw.c.obj
[17/153] Building C object zephyr/CMakeFiles/zephyr.dir/lib/os/crc8_sw.c.obj
[18/153] Building C object zephyr/CMakeFiles/zephyr.dir/lib/os/dec.c.obj
[19/153] Building C object zephyr/CMakeFiles/zephyr.dir/lib/os/hex.c.obj
[20/153] Building C object zephyr/CMakeFiles/zephyr.dir/lib/os/fdtable.c.obj
[21/153] Building C object zephyr/CMakeFiles/zephyr.dir/lib/os/notify.c.obj
[22/153] Building C object zephyr/CMakeFiles/zephyr.dir/lib/os/printk.c.obj
[23/153] Building C object zephyr/CMakeFiles/zephyr.dir/lib/os/sem.c.obj
[24/153] Building C object zephyr/CMakeFiles/zephyr.dir/lib/os/rb.c.obj
[25/153] Building C object zephyr/CMakeFiles/zephyr.dir/lib/os/thread_entry.c.obj
[26/153] Building C object zephyr/CMakeFiles/zephyr.dir/lib/os/onoff.c.obj
[27/153] Building C object zephyr/CMakeFiles/zephyr.dir/lib/os/timeutil.c.obj
[28/153] Building C object zephyr/CMakeFiles/zephyr.dir/lib/os/heap-validate.c.obj
[29/153] Building C object zephyr/CMakeFiles/zephyr.dir/lib/os/heap.c.obj
[30/153] Building C object zephyr/CMakeFiles/zephyr.dir/lib/os/bitarray.c.obj
[31/153] Building C object zephyr/CMakeFiles/zephyr.dir/lib/os/assert.c.obj
[32/153] Building C object zephyr/CMakeFiles/zephyr.dir/lib/os/cbprintf_complete.c.obj
[33/153] Building C object zephyr/CMakeFiles/zephyr.dir/lib/os/ring_buffer.c.obj
[34/153] Building C object zephyr/CMakeFiles/zephyr.dir/misc/generated/configs.c.obj
[35/153] Building C object zephyr/CMakeFiles/zephyr.dir/subsys/net/lib/utils/addr_utils.c.obj
[36/153] Building C object zephyr/CMakeFiles/zephyr.dir/subsys/logging/log_minimal.c.obj
[37/153] Building C object zephyr/CMakeFiles/zephyr.dir/subsys/tracing/tracing_none.c.obj
[38/153] Building C object zephyr/CMakeFiles/zephyr.dir/drivers/console/uart_console.c.obj
[39/153] Building C object zephyr/CMakeFiles/zephyr.dir/lib/os/mpsc_pbuf.c.obj
[40/153] Building C object zephyr/CMakeFiles/zephyr.dir/drivers/console/native_posix_console.c.obj
[41/153] Building C object zephyr/CMakeFiles/zephyr.dir/drivers/modem/modem_context.c.obj
[42/153] Building C object zephyr/CMakeFiles/zephyr.dir/drivers/modem/modem_receiver.c.obj
[43/153] Building C object zephyr/CMakeFiles/zephyr.dir/drivers/modem/modem_pin.c.obj
[44/153] Building C object zephyr/CMakeFiles/zephyr.dir/drivers/modem/modem_iface_uart.c.obj
[45/153] Building C object zephyr/CMakeFiles/zephyr.dir/drivers/modem/modem_cmd_handler.c.obj
FAILED: zephyr/CMakeFiles/zephyr.dir/drivers/modem/modem_cmd_handler.c.obj
ccache /usr/bin/gcc -DBUILD_VERSION=zephyr-v2.6.0-1623-g997bbcb000c3 -DKERNEL -D_FORTIFY_SOURCE=2 -D_POSIX_C_SOURCE=200809 -D_XOPEN_SOURCE=600 -D_XOPEN_SOURCE_EXTENDED -D__ZEPHYR__=1 -I../../../../../../../kernel/include -I../../../../../../../arch/posix/include -I../../../../../../../subsys/net/ip -I../../../../../../../include -Izephyr/include/generated -I../../../../../../../soc/posix/inf_clock -I../../../../../../../boards/posix/native_posix -I../../../../../../../subsys/testsuite/include -I../../../../../../../subsys/net/l2 -Os -imacros /workdir/zephyr/twister-out/native_posix_64/tests/drivers/build_all/modem/drivers.modem.build/zephyr/include/generated/autoconf.h -ffreestanding -fno-common -g -gdwarf-4 -fdiagnostics-color=always -imacros /workdir/zephyr/include/toolchain/zephyr_stdint.h -Wall -Wformat -Wformat-security -Wno-format-zero-length -Wno-main -Wno-pointer-sign -Wpointer-arith -Wexpansion-to-defined -Wno-address-of-packed-member -Wno-unused-but-set-variable -Werror=implicit-int -Werror -fno-asynchronous-unwind-tables -fno-pie -fno-pic -fno-strict-overflow -fno-reorder-functions -fno-defer-pop -fmacro-prefix-map=/workdir/zephyr/tests/drivers/build_all/modem=CMAKE_SOURCE_DIR -fmacro-prefix-map=/workdir/zephyr=ZEPHYR_BASE -fmacro-prefix-map=/workdir=WEST_TOPDIR -ffunction-sections -fdata-sections -m64 -fPIC -include /workdir/zephyr/arch/posix/include/posix_cheats.h -fno-freestanding -std=c11 -MD -MT zephyr/CMakeFiles/zephyr.dir/drivers/modem/modem_cmd_handler.c.obj -MF zephyr/CMakeFiles/zephyr.dir/drivers/modem/modem_cmd_handler.c.obj.d -o zephyr/CMakeFiles/zephyr.dir/drivers/modem/modem_cmd_handler.c.obj -c /workdir/zephyr/drivers/modem/modem_cmd_handler.c
/workdir/zephyr/drivers/modem/modem_cmd_handler.c: In function modem_cmd_send_ext:
/workdir/zephyr/drivers/modem/modem_cmd_handler.c:545:9: error: ret may be used uninitialized in this function [-Werror=maybe-uninitialized]
  545 |  return ret;
      |         ^~~
cc1: all warnings being treated as errors
[46/153] Building C object zephyr/CMakeFiles/zephyr.dir/drivers/modem/gsm_ppp.c.obj
[47/153] Building C object zephyr/CMakeFiles/zephyr.dir/drivers/modem/wncm14a2a.c.obj
ninja: build stopped: subcommand failed.

in Job #c6842eff-4eb5-42d3-8188-23b919b978b1

tests/drivers/build_all/modem/drivers.modem.quectel_bg9x.build in native_posix_64:tests/drivers/build_all/modem/drivers.modem
Including boilerplate (Zephyr base): /workdir/zephyr/cmake/app/boilerplate.cmake
-- Application: /workdir/zephyr/tests/drivers/build_all/modem
-- Zephyr version: 2.6.99 (/workdir/zephyr), build: zephyr-v2.6.0-1623-g997bbcb000c3
-- Found Python3: /usr/bin/python3.8 (found suitable exact version "3.8.10") found components: Interpreter
-- Found west (found suitable version "0.11.0", minimum required is "0.7.1")
-- Board: native_posix_64
-- Cache files will be written to: /root/.cache/zephyr
-- Using toolchain: zephyr 0.13.0 (/opt/toolchains/zephyr-sdk-0.13.0-rc4)
-- Found dtc: /opt/toolchains/zephyr-sdk-0.13.0-rc4/sysroots/x86_64-pokysdk-linux/usr/bin/dtc (found suitable version "1.6.0", minimum required is "1.4.6")
-- Found toolchain: host (gcc/ld)
-- Found BOARD.dts: /workdir/zephyr/boards/posix/native_posix/native_posix_64.dts
-- Found devicetree overlay: /workdir/zephyr/tests/drivers/build_all/modem/app.overlay
-- Generated zephyr.dts: /workdir/zephyr/twister-out/native_posix_64/tests/drivers/build_all/modem/drivers.modem.quectel_bg9x.build/zephyr/zephyr.dts
-- Generated devicetree_unfixed.h: /workdir/zephyr/twister-out/native_posix_64/tests/drivers/build_all/modem/drivers.modem.quectel_bg9x.build/zephyr/include/generated/devicetree_unfixed.h
-- Generated device_extern.h: /workdir/zephyr/twister-out/native_posix_64/tests/drivers/build_all/modem/drivers.modem.quectel_bg9x.build/zephyr/include/generated/device_extern.h

warning: TEST_RANDOM_GENERATOR (defined at subsys/random/Kconfig:8) was assigned the value 'y' but
got the value 'n'. Check these unsatisfied dependencies: (!ENTROPY_HAS_DRIVER) (=n). See
http://docs.zephyrproject.org/latest/reference/kconfig/CONFIG_TEST_RANDOM_GENERATOR.html and/or look
up TEST_RANDOM_GENERATOR in the menuconfig/guiconfig interface. The Application Development Primer,
Setting Configuration Values, and Kconfig - Tips and Best Practices sections of the manual might be
helpful too.

Parsing /workdir/zephyr/tests/drivers/build_all/modem/Kconfig
Loaded configuration '/workdir/zephyr/boards/posix/native_posix/native_posix_64_defconfig'
Merged configuration 'modem_quectel_bg9x.conf'
Configuration saved to '/workdir/zephyr/twister-out/native_posix_64/tests/drivers/build_all/modem/drivers.modem.quectel_bg9x.build/zephyr/.config'
Kconfig header saved to '/workdir/zephyr/twister-out/native_posix_64/tests/drivers/build_all/modem/drivers.modem.quectel_bg9x.build/zephyr/include/generated/autoconf.h'
-- The C compiler identification is GNU 9.3.0
-- The CXX compiler identification is GNU 9.3.0
-- The ASM compiler identification is GNU
-- Found assembler: /usr/bin/gcc
CMake Warning at ../../../../CMakeLists.txt:718 (message):
  No SOURCES given to Zephyr library: drivers__gpio

  Excluding target from build.


-- Configuring done
-- Generating done
-- Build files have been written to: /workdir/zephyr/twister-out/native_posix_64/tests/drivers/build_all/modem/drivers.modem.quectel_bg9x.build
[1/138] Preparing syscall dependency handling

[2/138] Generating misc/generated/syscalls_subdirs.trigger
[3/138] Generating misc/generated/syscalls.json, misc/generated/struct_tags.json
[4/138] Generating include/generated/syscall_dispatch.c, include/generated/syscall_list.h
[5/138] Generating include/generated/driver-validation.h
[6/138] Generating include/generated/kobj-types-enum.h, include/generated/otype-to-str.h, include/generated/otype-to-size.h
[7/138] Building C object zephyr/CMakeFiles/offsets.dir/arch/posix/core/offsets/offsets.c.obj
[8/138] Generating include/generated/offsets.h
[9/138] Building C object zephyr/CMakeFiles/zephyr.dir/lib/os/cbprintf.c.obj
[10/138] Building C object zephyr/arch/arch/posix/core/CMakeFiles/arch__posix__core.dir/cpuhalt.c.obj
[11/138] Building C object CMakeFiles/app.dir/src/main.c.obj
[12/138] Linking C static library app/libapp.a
[13/138] Building C object zephyr/CMakeFiles/zephyr.dir/lib/os/crc32c_sw.c.obj
[14/138] Building C object zephyr/CMakeFiles/zephyr.dir/lib/os/crc32_sw.c.obj
[15/138] Building C object zephyr/CMakeFiles/zephyr.dir/lib/os/crc16_sw.c.obj
[16/138] Building C object zephyr/CMakeFiles/zephyr.dir/lib/os/crc8_sw.c.obj
[17/138] Building C object zephyr/CMakeFiles/zephyr.dir/lib/os/cbprintf_packaged.c.obj
[18/138] Building C object zephyr/CMakeFiles/zephyr.dir/lib/os/crc7_sw.c.obj
[19/138] Building C object zephyr/CMakeFiles/zephyr.dir/lib/os/dec.c.obj
[20/138] Building C object zephyr/CMakeFiles/zephyr.dir/lib/os/hex.c.obj
[21/138] Building C object zephyr/CMakeFiles/zephyr.dir/lib/os/notify.c.obj
[22/138] Building C object zephyr/CMakeFiles/zephyr.dir/lib/os/fdtable.c.obj
[23/138] Building C object zephyr/CMakeFiles/zephyr.dir/lib/os/printk.c.obj
[24/138] Building C object zephyr/CMakeFiles/zephyr.dir/lib/os/sem.c.obj
[25/138] Building C object zephyr/CMakeFiles/zephyr.dir/lib/os/thread_entry.c.obj
[26/138] Building C object zephyr/CMakeFiles/zephyr.dir/lib/os/rb.c.obj
[27/138] Building C object zephyr/CMakeFiles/zephyr.dir/lib/os/onoff.c.obj
[28/138] Building C object zephyr/CMakeFiles/zephyr.dir/lib/os/timeutil.c.obj
[29/138] Building C object zephyr/CMakeFiles/zephyr.dir/lib/os/heap-validate.c.obj
[30/138] Building C object zephyr/CMakeFiles/zephyr.dir/lib/os/heap.c.obj
[31/138] Building C object zephyr/CMakeFiles/zephyr.dir/lib/os/bitarray.c.obj
[32/138] Building C object zephyr/CMakeFiles/zephyr.dir/lib/os/assert.c.obj
[33/138] Building C object zephyr/CMakeFiles/zephyr.dir/lib/os/ring_buffer.c.obj
[34/138] Building C object zephyr/CMakeFiles/zephyr.dir/misc/generated/configs.c.obj
[35/138] Building C object zephyr/CMakeFiles/zephyr.dir/lib/os/cbprintf_complete.c.obj
[36/138] Building C object zephyr/CMakeFiles/zephyr.dir/subsys/logging/log_minimal.c.obj
[37/138] Building C object zephyr/CMakeFiles/zephyr.dir/lib/os/mpsc_pbuf.c.obj
[38/138] Building C object zephyr/CMakeFiles/zephyr.dir/subsys/net/lib/utils/addr_utils.c.obj
[39/138] Building C object zephyr/CMakeFiles/zephyr.dir/subsys/net/lib/sockets/getaddrinfo.c.obj
[40/138] Building C object zephyr/CMakeFiles/zephyr.dir/subsys/net/lib/sockets/socket_offload.c.obj
[41/138] Building C object zephyr/CMakeFiles/zephyr.dir/subsys/net/lib/sockets/sockets_select.c.obj
[42/138] Building C object zephyr/CMakeFiles/zephyr.dir/subsys/tracing/tracing_none.c.obj
[43/138] Building C object zephyr/CMakeFiles/zephyr.dir/drivers/console/uart_console.c.obj
[44/138] Building C object zephyr/CMakeFiles/zephyr.dir/drivers/console/native_posix_console.c.obj
[45/138] Building C object zephyr/CMakeFiles/zephyr.dir/drivers/modem/modem_context.c.obj
[46/138] Building C object zephyr/CMakeFiles/zephyr.dir/drivers/modem/modem_pin.c.obj
[47/138] Building C object zephyr/CMakeFiles/zephyr.dir/drivers/modem/modem_iface_uart.c.obj
[48/138] Building C object zephyr/CMakeFiles/zephyr.dir/subsys/net/lib/sockets/sockets.c.obj
[49/138] Building C object zephyr/CMakeFiles/zephyr.dir/drivers/modem/modem_cmd_handler.c.obj
FAILED: zephyr/CMakeFiles/zephyr.dir/drivers/modem/modem_cmd_handler.c.obj
ccache /usr/bin/gcc -DBUILD_VERSION=zephyr-v2.6.0-1623-g997bbcb000c3 -DKERNEL -D_FORTIFY_SOURCE=2 -D_POSIX_C_SOURCE=200809 -D_XOPEN_SOURCE=600 -D_XOPEN_SOURCE_EXTENDED -D__ZEPHYR__=1 -I../../../../../../../kernel/include -I../../../../../../../arch/posix/include -I../../../../../../../subsys/net/ip -I../../../../../../../include -Izephyr/include/generated -I../../../../../../../soc/posix/inf_clock -I../../../../../../../boards/posix/native_posix -I../../../../../../../subsys/net/lib/sockets/. -I../../../../../../../subsys/testsuite/include -I../../../../../../../subsys/net/l2 -Os -imacros /workdir/zephyr/twister-out/native_posix_64/tests/drivers/build_all/modem/drivers.modem.quectel_bg9x.build/zephyr/include/generated/autoconf.h -ffreestanding -fno-common -g -gdwarf-4 -fdiagnostics-color=always -imacros /workdir/zephyr/include/toolchain/zephyr_stdint.h -Wall -Wformat -Wformat-security -Wno-format-zero-length -Wno-main -Wno-pointer-sign -Wpointer-arith -Wexpansion-to-defined -Wno-address-of-packed-member -Wno-unused-but-set-variable -Werror=implicit-int -Werror -fno-asynchronous-unwind-tables -fno-pie -fno-pic -fno-strict-overflow -fno-reorder-functions -fno-defer-pop -fmacro-prefix-map=/workdir/zephyr/tests/drivers/build_all/modem=CMAKE_SOURCE_DIR -fmacro-prefix-map=/workdir/zephyr=ZEPHYR_BASE -fmacro-prefix-map=/workdir=WEST_TOPDIR -ffunction-sections -fdata-sections -m64 -fPIC -include /workdir/zephyr/arch/posix/include/posix_cheats.h -fno-freestanding -std=c11 -MD -MT zephyr/CMakeFiles/zephyr.dir/drivers/modem/modem_cmd_handler.c.obj -MF zephyr/CMakeFiles/zephyr.dir/drivers/modem/modem_cmd_handler.c.obj.d -o zephyr/CMakeFiles/zephyr.dir/drivers/modem/modem_cmd_handler.c.obj -c /workdir/zephyr/drivers/modem/modem_cmd_handler.c
/workdir/zephyr/drivers/modem/modem_cmd_handler.c: In function modem_cmd_send_ext:
/workdir/zephyr/drivers/modem/modem_cmd_handler.c:545:9: error: ret may be used uninitialized in this function [-Werror=maybe-uninitialized]
  545 |  return ret;
      |         ^~~
cc1: all warnings being treated as errors
[50/138] Building C object zephyr/CMakeFiles/zephyr.dir/drivers/modem/modem_socket.c.obj
[51/138] Building C object zephyr/CMakeFiles/zephyr.dir/drivers/modem/quectel-bg9x.c.obj
ninja: build stopped: subcommand failed.

in Job #c6842eff-4eb5-42d3-8188-23b919b978b1

tests/drivers/build_all/modem/drivers.modem.ublox_sara.build in native_posix_64:tests/drivers/build_all/modem/drivers.modem
Including boilerplate (Zephyr base): /workdir/zephyr/cmake/app/boilerplate.cmake
-- Application: /workdir/zephyr/tests/drivers/build_all/modem
-- Zephyr version: 2.6.99 (/workdir/zephyr), build: zephyr-v2.6.0-1623-g997bbcb000c3
-- Found Python3: /usr/bin/python3.8 (found suitable exact version "3.8.10") found components: Interpreter
-- Found west (found suitable version "0.11.0", minimum required is "0.7.1")
-- Board: native_posix_64
-- Cache files will be written to: /root/.cache/zephyr
-- Using toolchain: zephyr 0.13.0 (/opt/toolchains/zephyr-sdk-0.13.0-rc4)
-- Found dtc: /opt/toolchains/zephyr-sdk-0.13.0-rc4/sysroots/x86_64-pokysdk-linux/usr/bin/dtc (found suitable version "1.6.0", minimum required is "1.4.6")
-- Found toolchain: host (gcc/ld)
-- Found BOARD.dts: /workdir/zephyr/boards/posix/native_posix/native_posix_64.dts
-- Found devicetree overlay: /workdir/zephyr/tests/drivers/build_all/modem/app.overlay
-- Generated zephyr.dts: /workdir/zephyr/twister-out/native_posix_64/tests/drivers/build_all/modem/drivers.modem.ublox_sara.build/zephyr/zephyr.dts
-- Generated devicetree_unfixed.h: /workdir/zephyr/twister-out/native_posix_64/tests/drivers/build_all/modem/drivers.modem.ublox_sara.build/zephyr/include/generated/devicetree_unfixed.h
-- Generated device_extern.h: /workdir/zephyr/twister-out/native_posix_64/tests/drivers/build_all/modem/drivers.modem.ublox_sara.build/zephyr/include/generated/device_extern.h

warning: TEST_RANDOM_GENERATOR (defined at subsys/random/Kconfig:8) was assigned the value 'y' but
got the value 'n'. Check these unsatisfied dependencies: (!ENTROPY_HAS_DRIVER) (=n). See
http://docs.zephyrproject.org/latest/reference/kconfig/CONFIG_TEST_RANDOM_GENERATOR.html and/or look
up TEST_RANDOM_GENERATOR in the menuconfig/guiconfig interface. The Application Development Primer,
Setting Configuration Values, and Kconfig - Tips and Best Practices sections of the manual might be
helpful too.

Parsing /workdir/zephyr/tests/drivers/build_all/modem/Kconfig
Loaded configuration '/workdir/zephyr/boards/posix/native_posix/native_posix_64_defconfig'
Merged configuration 'modem_ublox_sara.conf'
Configuration saved to '/workdir/zephyr/twister-out/native_posix_64/tests/drivers/build_all/modem/drivers.modem.ublox_sara.build/zephyr/.config'
Kconfig header saved to '/workdir/zephyr/twister-out/native_posix_64/tests/drivers/build_all/modem/drivers.modem.ublox_sara.build/zephyr/include/generated/autoconf.h'
-- The C compiler identification is GNU 9.3.0
-- The CXX compiler identification is GNU 9.3.0
-- The ASM compiler identification is GNU
-- Found assembler: /usr/bin/gcc
CMake Warning at ../../../../CMakeLists.txt:718 (message):
  No SOURCES given to Zephyr library: drivers__gpio

  Excluding target from build.


-- Configuring done
-- Generating done
-- Build files have been written to: /workdir/zephyr/twister-out/native_posix_64/tests/drivers/build_all/modem/drivers.modem.ublox_sara.build
[1/138] Preparing syscall dependency handling

[2/138] Generating misc/generated/syscalls_subdirs.trigger
[3/138] Generating misc/generated/syscalls.json, misc/generated/struct_tags.json
[4/138] Generating include/generated/syscall_dispatch.c, include/generated/syscall_list.h
[5/138] Generating include/generated/kobj-types-enum.h, include/generated/otype-to-str.h, include/generated/otype-to-size.h
[6/138] Generating include/generated/driver-validation.h
[7/138] Building C object zephyr/CMakeFiles/offsets.dir/arch/posix/core/offsets/offsets.c.obj
[8/138] Generating include/generated/offsets.h
[9/138] Building C object CMakeFiles/app.dir/src/main.c.obj
[10/138] Linking C static library app/libapp.a
[11/138] Building C object zephyr/CMakeFiles/zephyr.dir/lib/os/cbprintf.c.obj
[12/138] Building C object zephyr/CMakeFiles/zephyr.dir/lib/os/crc32c_sw.c.obj
[13/138] Building C object zephyr/CMakeFiles/zephyr.dir/lib/os/crc32_sw.c.obj
[14/138] Building C object zephyr/CMakeFiles/zephyr.dir/lib/os/cbprintf_packaged.c.obj
[15/138] Building C object zephyr/CMakeFiles/zephyr.dir/lib/os/crc16_sw.c.obj
[16/138] Building C object zephyr/CMakeFiles/zephyr.dir/lib/os/crc8_sw.c.obj
[17/138] Building C object zephyr/CMakeFiles/zephyr.dir/lib/os/crc7_sw.c.obj
[18/138] Building C object zephyr/CMakeFiles/zephyr.dir/lib/os/dec.c.obj
[19/138] Building C object zephyr/CMakeFiles/zephyr.dir/lib/os/hex.c.obj
[20/138] Building C object zephyr/CMakeFiles/zephyr.dir/lib/os/fdtable.c.obj
[21/138] Building C object zephyr/CMakeFiles/zephyr.dir/lib/os/notify.c.obj
[22/138] Building C object zephyr/CMakeFiles/zephyr.dir/lib/os/printk.c.obj
[23/138] Building C object zephyr/CMakeFiles/zephyr.dir/lib/os/sem.c.obj
[24/138] Building C object zephyr/CMakeFiles/zephyr.dir/lib/os/rb.c.obj
[25/138] Building C object zephyr/CMakeFiles/zephyr.dir/lib/os/thread_entry.c.obj
[26/138] Building C object zephyr/CMakeFiles/zephyr.dir/lib/os/onoff.c.obj
[27/138] Building C object zephyr/CMakeFiles/zephyr.dir/lib/os/timeutil.c.obj
[28/138] Building C object zephyr/CMakeFiles/zephyr.dir/lib/os/heap.c.obj
[29/138] Building C object zephyr/CMakeFiles/zephyr.dir/lib/os/heap-validate.c.obj
[30/138] Building C object zephyr/CMakeFiles/zephyr.dir/lib/os/bitarray.c.obj
[31/138] Building C object zephyr/CMakeFiles/zephyr.dir/lib/os/ring_buffer.c.obj
[32/138] Building C object zephyr/CMakeFiles/zephyr.dir/lib/os/assert.c.obj
[33/138] Building C object zephyr/CMakeFiles/zephyr.dir/misc/generated/configs.c.obj
[34/138] Building C object zephyr/CMakeFiles/zephyr.dir/lib/os/cbprintf_complete.c.obj
[35/138] Building C object zephyr/CMakeFiles/zephyr.dir/subsys/logging/log_minimal.c.obj
[36/138] Building C object zephyr/CMakeFiles/zephyr.dir/lib/os/mpsc_pbuf.c.obj
[37/138] Building C object zephyr/CMakeFiles/zephyr.dir/subsys/net/lib/utils/addr_utils.c.obj
[38/138] Building C object zephyr/CMakeFiles/zephyr.dir/subsys/net/lib/sockets/getaddrinfo.c.obj
[39/138] Building C object zephyr/CMakeFiles/zephyr.dir/subsys/net/lib/sockets/socket_offload.c.obj
[40/138] Building C object zephyr/CMakeFiles/zephyr.dir/subsys/net/lib/sockets/sockets_select.c.obj
[41/138] Building C object zephyr/CMakeFiles/zephyr.dir/subsys/tracing/tracing_none.c.obj
[42/138] Building C object zephyr/CMakeFiles/zephyr.dir/drivers/console/uart_console.c.obj
[43/138] Building C object zephyr/CMakeFiles/zephyr.dir/drivers/console/native_posix_console.c.obj
[44/138] Building C object zephyr/CMakeFiles/zephyr.dir/drivers/modem/modem_context.c.obj
[45/138] Building C object zephyr/CMakeFiles/zephyr.dir/drivers/modem/modem_pin.c.obj
[46/138] Building C object zephyr/CMakeFiles/zephyr.dir/drivers/modem/modem_iface_uart.c.obj
[47/138] Building C object zephyr/CMakeFiles/zephyr.dir/subsys/net/lib/sockets/sockets.c.obj
[48/138] Building C object zephyr/CMakeFiles/zephyr.dir/drivers/modem/modem_cmd_handler.c.obj
FAILED: zephyr/CMakeFiles/zephyr.dir/drivers/modem/modem_cmd_handler.c.obj
ccache /usr/bin/gcc -DBUILD_VERSION=zephyr-v2.6.0-1623-g997bbcb000c3 -DKERNEL -D_FORTIFY_SOURCE=2 -D_POSIX_C_SOURCE=200809 -D_XOPEN_SOURCE=600 -D_XOPEN_SOURCE_EXTENDED -D__ZEPHYR__=1 -I../../../../../../../kernel/include -I../../../../../../../arch/posix/include -I../../../../../../../subsys/net/ip -I../../../../../../../include -Izephyr/include/generated -I../../../../../../../soc/posix/inf_clock -I../../../../../../../boards/posix/native_posix -I../../../../../../../subsys/net/lib/sockets/. -I../../../../../../../subsys/testsuite/include -I../../../../../../../subsys/net/l2 -Os -imacros /workdir/zephyr/twister-out/native_posix_64/tests/drivers/build_all/modem/drivers.modem.ublox_sara.build/zephyr/include/generated/autoconf.h -ffreestanding -fno-common -g -gdwarf-4 -fdiagnostics-color=always -imacros /workdir/zephyr/include/toolchain/zephyr_stdint.h -Wall -Wformat -Wformat-security -Wno-format-zero-length -Wno-main -Wno-pointer-sign -Wpointer-arith -Wexpansion-to-defined -Wno-address-of-packed-member -Wno-unused-but-set-variable -Werror=implicit-int -Werror -fno-asynchronous-unwind-tables -fno-pie -fno-pic -fno-strict-overflow -fno-reorder-functions -fno-defer-pop -fmacro-prefix-map=/workdir/zephyr/tests/drivers/build_all/modem=CMAKE_SOURCE_DIR -fmacro-prefix-map=/workdir/zephyr=ZEPHYR_BASE -fmacro-prefix-map=/workdir=WEST_TOPDIR -ffunction-sections -fdata-sections -m64 -fPIC -include /workdir/zephyr/arch/posix/include/posix_cheats.h -fno-freestanding -std=c11 -MD -MT zephyr/CMakeFiles/zephyr.dir/drivers/modem/modem_cmd_handler.c.obj -MF zephyr/CMakeFiles/zephyr.dir/drivers/modem/modem_cmd_handler.c.obj.d -o zephyr/CMakeFiles/zephyr.dir/drivers/modem/modem_cmd_handler.c.obj -c /workdir/zephyr/drivers/modem/modem_cmd_handler.c
/workdir/zephyr/drivers/modem/modem_cmd_handler.c: In function modem_cmd_send_ext:
/workdir/zephyr/drivers/modem/modem_cmd_handler.c:545:9: error: ret may be used uninitialized in this function [-Werror=maybe-uninitialized]
  545 |  return ret;
      |         ^~~
cc1: all warnings being treated as errors
[49/138] Building C object zephyr/CMakeFiles/zephyr.dir/drivers/modem/modem_socket.c.obj
[50/138] Building C object zephyr/CMakeFiles/zephyr.dir/drivers/modem/ublox-sara-r4.c.obj
ninja: build stopped: subcommand failed.

in Job #c6842eff-4eb5-42d3-8188-23b919b978b1

tests/drivers/adc/adc_api/drivers.adc in nucleo_h753zi:tests/drivers/adc/adc_api/drivers.adc
Including boilerplate (Zephyr base): /workdir/zephyr/cmake/app/boilerplate.cmake
-- Application: /workdir/zephyr/tests/drivers/adc/adc_api
-- Zephyr version: 2.6.99 (/workdir/zephyr), build: zephyr-v2.6.0-1623-g997bbcb000c3
-- Found Python3: /usr/bin/python3.8 (found suitable exact version "3.8.10") found components: Interpreter
-- Found west (found suitable version "0.11.0", minimum required is "0.7.1")
-- Board: nucleo_h753zi
-- Cache files will be written to: /root/.cache/zephyr
-- Using toolchain: zephyr 0.13.0 (/opt/toolchains/zephyr-sdk-0.13.0-rc4)
-- Found dtc: /opt/toolchains/zephyr-sdk-0.13.0-rc4/sysroots/x86_64-pokysdk-linux/usr/bin/dtc (found suitable version "1.6.0", minimum required is "1.4.6")
-- Found BOARD.dts: /workdir/zephyr/boards/arm/nucleo_h753zi/nucleo_h753zi.dts
-- Generated zephyr.dts: /workdir/zephyr/twister-out/nucleo_h753zi/tests/drivers/adc/adc_api/drivers.adc/zephyr/zephyr.dts
-- Generated devicetree_unfixed.h: /workdir/zephyr/twister-out/nucleo_h753zi/tests/drivers/adc/adc_api/drivers.adc/zephyr/include/generated/devicetree_unfixed.h
-- Generated device_extern.h: /workdir/zephyr/twister-out/nucleo_h753zi/tests/drivers/adc/adc_api/drivers.adc/zephyr/include/generated/device_extern.h
Parsing /workdir/zephyr/Kconfig
Loaded configuration '/workdir/zephyr/boards/arm/nucleo_h753zi/nucleo_h753zi_defconfig'
Merged configuration '/workdir/zephyr/tests/drivers/adc/adc_api/prj.conf'
Configuration saved to '/workdir/zephyr/twister-out/nucleo_h753zi/tests/drivers/adc/adc_api/drivers.adc/zephyr/.config'
Kconfig header saved to '/workdir/zephyr/twister-out/nucleo_h753zi/tests/drivers/adc/adc_api/drivers.adc/zephyr/include/generated/autoconf.h'
-- The C compiler identification is GNU 10.3.0
-- The CXX compiler identification is GNU 10.3.0
-- The ASM compiler identification is GNU
-- Found assembler: /opt/toolchains/zephyr-sdk-0.13.0-rc4/arm-zephyr-eabi/bin/arm-zephyr-eabi-gcc
-- Configuring done
-- Generating done
-- Build files have been written to: /workdir/zephyr/twister-out/nucleo_h753zi/tests/drivers/adc/adc_api/drivers.adc
[1/177] Preparing syscall dependency handling

[2/177] Generating misc/generated/syscalls_subdirs.trigger
[3/177] Generating misc/generated/syscalls.json, misc/generated/struct_tags.json
[4/177] Generating include/generated/driver-validation.h
[5/177] Generating include/generated/syscall_dispatch.c, include/generated/syscall_list.h
[6/177] Generating include/generated/kobj-types-enum.h, include/generated/otype-to-str.h, include/generated/otype-to-size.h
[7/177] Building C object zephyr/CMakeFiles/offsets.dir/arch/arm/core/offsets/offsets.c.obj
[8/177] Generating include/generated/offsets.h
[9/177] Building C object zephyr/CMakeFiles/zephyr.dir/lib/os/cbprintf.c.obj
[10/177] Building C object zephyr/CMakeFiles/zephyr.dir/lib/os/cbprintf_packaged.c.obj
[11/177] Building C object zephyr/CMakeFiles/zephyr.dir/lib/os/crc32c_sw.c.obj
[12/177] Building C object zephyr/CMakeFiles/zephyr.dir/lib/os/crc32_sw.c.obj
[13/177] Building C object zephyr/CMakeFiles/zephyr.dir/lib/os/crc16_sw.c.obj
[14/177] Building C object CMakeFiles/app.dir/src/main.c.obj
[15/177] Building C object zephyr/CMakeFiles/zephyr.dir/lib/os/crc8_sw.c.obj
[16/177] Building C object zephyr/CMakeFiles/zephyr.dir/lib/os/crc7_sw.c.obj
[17/177] Building C object zephyr/CMakeFiles/zephyr.dir/lib/os/dec.c.obj
[18/177] Building C object zephyr/CMakeFiles/zephyr.dir/lib/os/hex.c.obj
[19/177] Building C object CMakeFiles/app.dir/src/test_adc.c.obj
[20/177] Linking C static library app/libapp.a
[21/177] Building C object zephyr/CMakeFiles/zephyr.dir/lib/os/notify.c.obj
[22/177] Building C object zephyr/CMakeFiles/zephyr.dir/lib/os/fdtable.c.obj
[23/177] Building C object zephyr/CMakeFiles/zephyr.dir/lib/os/printk.c.obj
[24/177] Building C object zephyr/CMakeFiles/zephyr.dir/lib/os/onoff.c.obj
[25/177] Building C object zephyr/CMakeFiles/zephyr.dir/lib/os/rb.c.obj
[26/177] Building C object zephyr/CMakeFiles/zephyr.dir/lib/os/sem.c.obj
[27/177] Building C object zephyr/CMakeFiles/zephyr.dir/lib/os/timeutil.c.obj
[28/177] Building C object zephyr/CMakeFiles/zephyr.dir/lib/os/thread_entry.c.obj
[29/177] Building C object zephyr/CMakeFiles/zephyr.dir/lib/os/heap.c.obj
[30/177] Building C object zephyr/CMakeFiles/zephyr.dir/lib/os/heap-validate.c.obj
[31/177] Building C object zephyr/CMakeFiles/zephyr.dir/lib/os/cbprintf_complete.c.obj
[32/177] Building C object zephyr/CMakeFiles/zephyr.dir/lib/os/bitarray.c.obj
[33/177] Building C object zephyr/CMakeFiles/zephyr.dir/lib/os/assert.c.obj
[34/177] Building C object zephyr/CMakeFiles/zephyr.dir/lib/os/mutex.c.obj
[35/177] Building C object zephyr/CMakeFiles/zephyr.dir/misc/generated/configs.c.obj
[36/177] Building C object zephyr/CMakeFiles/zephyr.dir/lib/os/user_work.c.obj
[37/177] Building C object zephyr/CMakeFiles/zephyr.dir/lib/os/mpsc_pbuf.c.obj
[38/177] Building C object zephyr/CMakeFiles/zephyr.dir/soc/arm/st_stm32/stm32h7/soc_m7.c.obj
[39/177] Building C object zephyr/CMakeFiles/zephyr.dir/soc/arm/st_stm32/stm32h7/mpu_regions.c.obj
[40/177] Building C object zephyr/CMakeFiles/zephyr.dir/subsys/logging/log_minimal.c.obj
[41/177] Building C object zephyr/CMakeFiles/zephyr.dir/soc/arm/st_stm32/common/stm32cube_hal.c.obj
[42/177] Building C object zephyr/CMakeFiles/zephyr.dir/soc/arm/st_stm32/common/soc_config.c.obj
[43/177] Building C object zephyr/CMakeFiles/zephyr.dir/subsys/tracing/tracing_none.c.obj
[44/177] Building C object zephyr/CMakeFiles/zephyr.dir/drivers/console/uart_console.c.obj
[45/177] Building C object zephyr/CMakeFiles/zephyr.dir/drivers/interrupt_controller/intc_exti_stm32.c.obj
[46/177] Building C object zephyr/CMakeFiles/zephyr.dir/drivers/clock_control/clock_stm32_ll_h7.c.obj
[47/177] Building C object zephyr/CMakeFiles/zephyr.dir/drivers/pinmux/pinmux_stm32.c.obj
[48/177] Building C object zephyr/CMakeFiles/zephyr.dir/drivers/timer/sys_clock_init.c.obj
[49/177] Building C object zephyr/CMakeFiles/zephyr.dir/drivers/timer/cortex_m_systick.c.obj
[50/177] Linking C static library zephyr/libzephyr.a
[51/177] Building C object zephyr/arch/common/CMakeFiles/isr_tables.dir/isr_tables.c.obj
[52/177] Building ASM object zephyr/arch/arch/arm/core/aarch32/CMakeFiles/arch__arm__core__aarch32.dir/cpu_idle.S.obj
[53/177] Linking C static library zephyr/arch/common/libisr_tables.a
[54/177] Building C object zephyr/arch/common/CMakeFiles/arch__common.dir/sw_isr_common.c.obj
[55/177] Linking C static library zephyr/arch/common/libarch__common.a
[56/177] Building C object zephyr/arch/arch/arm/core/aarch32/CMakeFiles/arch__arm__core__aarch32.dir/irq_manage.c.obj
[57/177] Building ASM object zephyr/arch/arch/arm/core/aarch32/CMakeFiles/arch__arm__core__aarch32.dir/nmi_on_reset.S.obj
[58/177] Building C object zephyr/arch/arch/arm/core/aarch32/CMakeFiles/arch__arm__core__aarch32.dir/fatal.c.obj
[59/177] Building C object zephyr/arch/arch/arm/core/aarch32/CMakeFiles/arch__arm__core__aarch32.dir/nmi.c.obj
[60/177] Building ASM object zephyr/arch/arch/arm/core/aarch32/CMakeFiles/arch__arm__core__aarch32.dir/swap_helper.S.obj
[61/177] Building C object zephyr/arch/arch/arm/core/aarch32/CMakeFiles/arch__arm__core__aarch32.dir/prep_c.c.obj
[62/177] Building C object zephyr/arch/arch/arm/core/aarch32/CMakeFiles/arch__arm__core__aarch32.dir/swap.c.obj
[63/177] Building ASM object zephyr/arch/arch/arm/core/aarch32/CMakeFiles/arch__arm__core__aarch32.dir/userspace.S.obj
[64/177] Building ASM object zephyr/arch/arch/arm/core/aarch32/CMakeFiles/arch__arm__core__aarch32.dir/isr_wrapper.S.obj
[65/177] Building C object zephyr/arch/arch/arm/core/aarch32/CMakeFiles/arch__arm__core__aarch32.dir/thread.c.obj
[66/177] Linking C static library zephyr/arch/arch/arm/core/aarch32/libarch__arm__core__aarch32.a
[67/177] Building ASM object zephyr/arch/arch/arm/core/aarch32/cortex_m/CMakeFiles/arch__arm__core__aarch32__cortex_m.dir/exc_exit.S.obj
[68/177] Building ASM object zephyr/arch/arch/arm/core/aarch32/cortex_m/CMakeFiles/arch__arm__core__aarch32__cortex_m.dir/fault_s.S.obj
[69/177] Building C object zephyr/arch/arch/arm/core/aarch32/cortex_m/CMakeFiles/arch__arm__core__aarch32__cortex_m.dir/irq_init.c.obj
[70/177] Building C object zephyr/arch/arch/arm/core/aarch32/cortex_m/CMakeFiles/arch__arm__core__aarch32__cortex_m.dir/fpu.c.obj
[71/177] Building ASM object zephyr/arch/arch/arm/core/aarch32/cortex_m/CMakeFiles/arch__arm__core__aarch32__cortex_m.dir/reset.S.obj
[72/177] Building C object zephyr/arch/arch/arm/core/aarch32/cortex_m/CMakeFiles/arch__arm__core__aarch32__cortex_m.dir/fault.c.obj
[73/177] Building ASM object zephyr/arch/arch/arm/core/aarch32/cortex_m/CMakeFiles/arch__arm__core__aarch32__cortex_m.dir/vector_table.S.obj
[74/177] Building C object zephyr/arch/arch/arm/core/aarch32/cortex_m/CMakeFiles/arch__arm__core__aarch32__cortex_m.dir/scb.c.obj
[75/177] Building C object zephyr/arch/arch/arm/core/aarch32/cortex_m/CMakeFiles/arch__arm__core__aarch32__cortex_m.dir/thread_abort.c.obj
[76/177] Building C object zephyr/arch/arch/arm/core/aarch32/cortex_m/CMakeFiles/arch__arm__core__aarch32__cortex_m.dir/thread.c.obj
[77/177] Linking C static library zephyr/arch/arch/arm/core/aarch32/cortex_m/libarch__arm__core__aarch32__cortex_m.a
[78/177] Building C object zephyr/arch/arch/arm/core/aarch32/mpu/CMakeFiles/arch__arm__core__aarch32__mpu.dir/arm_core_mpu.c.obj
[79/177] Building C object zephyr/lib/libc/minimal/CMakeFiles/lib__libc__minimal.dir/source/stdlib/abort.c.obj
[80/177] Building C object zephyr/lib/libc/minimal/CMakeFiles/lib__libc__minimal.dir/source/stdlib/atoi.c.obj
[81/177] Building C object zephyr/lib/libc/minimal/CMakeFiles/lib__libc__minimal.dir/source/stdlib/strtol.c.obj
[82/177] Building C object zephyr/arch/arch/arm/core/aarch32/mpu/CMakeFiles/arch__arm__core__aarch32__mpu.dir/arm_mpu.c.obj
[83/177] Linking C static library zephyr/arch/arch/arm/core/aarch32/mpu/libarch__arm__core__aarch32__mpu.a
[84/177] Building C object zephyr/lib/libc/minimal/CMakeFiles/lib__libc__minimal.dir/source/stdlib/strtoul.c.obj
[85/177] Building C object zephyr/lib/libc/minimal/CMakeFiles/lib__libc__minimal.dir/source/stdlib/bsearch.c.obj
[86/177] Building C object zephyr/lib/libc/minimal/CMakeFiles/lib__libc__minimal.dir/source/string/strncasecmp.c.obj
[87/177] Building C object zephyr/lib/libc/minimal/CMakeFiles/lib__libc__minimal.dir/source/string/strstr.c.obj
[88/177] Building C object zephyr/lib/libc/minimal/CMakeFiles/lib__libc__minimal.dir/source/string/string.c.obj
[89/177] Building C object zephyr/lib/libc/minimal/CMakeFiles/lib__libc__minimal.dir/source/string/strspn.c.obj
[90/177] Building C object zephyr/lib/libc/minimal/CMakeFiles/lib__libc__minimal.dir/source/stdlib/malloc.c.obj
[91/177] Building C object zephyr/lib/libc/minimal/CMakeFiles/lib__libc__minimal.dir/source/stdlib/exit.c.obj
[92/177] Building C object zephyr/lib/libc/minimal/CMakeFiles/lib__libc__minimal.dir/source/stdout/sprintf.c.obj
[93/177] Building C object zephyr/lib/libc/minimal/CMakeFiles/lib__libc__minimal.dir/source/stdout/fprintf.c.obj
[94/177] Building C object zephyr/lib/libc/minimal/CMakeFiles/lib__libc__minimal.dir/source/time/gmtime.c.obj
[95/177] Building C object zephyr/lib/libc/minimal/CMakeFiles/lib__libc__minimal.dir/source/stdout/stdout_console.c.obj
[96/177] Linking C static library zephyr/lib/libc/minimal/liblib__libc__minimal.a
[97/177] Building C object zephyr/lib/posix/CMakeFiles/lib__posix.dir/pthread_common.c.obj
[98/177] Building C object zephyr/lib/posix/CMakeFiles/lib__posix.dir/nanosleep.c.obj
[99/177] Linking C static library zephyr/lib/posix/liblib__posix.a
[100/177] Building C object zephyr/subsys/testsuite/ztest/CMakeFiles/subsys__testsuite__ztest.dir/src/ztest.c.obj
[101/177] Building C object zephyr/subsys/testsuite/ztest/CMakeFiles/subsys__testsuite__ztest.dir/src/ztest_error_hook.c.obj
[102/177] Linking C static library zephyr/subsys/testsuite/ztest/libsubsys__testsuite__ztest.a
[103/177] Building C object zephyr/drivers/adc/CMakeFiles/drivers__adc.dir/adc_common.c.obj
[104/177] Building C object zephyr/drivers/adc/CMakeFiles/drivers__adc.dir/adc_handlers.c.obj
[105/177] Building C object zephyr/drivers/gpio/CMakeFiles/drivers__gpio.dir/gpio_stm32.c.obj
[106/177] Building C object zephyr/drivers/adc/CMakeFiles/drivers__adc.dir/adc_stm32.c.obj
FAILED: zephyr/drivers/adc/CMakeFiles/drivers__adc.dir/adc_stm32.c.obj
ccache /opt/toolchains/zephyr-sdk-0.13.0-rc4/arm-zephyr-eabi/bin/arm-zephyr-eabi-gcc -DBUILD_VERSION=zephyr-v2.6.0-1623-g997bbcb000c3 -DCORE_CM7 -DHSE_VALUE=8000000 -DKERNEL -DSTM32H753xx -DUSE_FULL_LL_DRIVER -DUSE_HAL_DRIVER -D_FORTIFY_SOURCE=2 -D__PROGRAM_START -D__ZEPHYR_SUPERVISOR__ -D__ZEPHYR__=1 -I../../../../../../../include -Izephyr/include/generated -I../../../../../../../soc/arm/st_stm32/stm32h7 -I../../../../../../../drivers -I../../../../../../../soc/arm/st_stm32/common -I../../../../../../../subsys/testsuite/include -I../../../../../../../subsys/testsuite/ztest/include -I/var/lib/buildkite-agent/zephyr-module-cache/modules/hal/cmsis/CMSIS/Core/Include -I/var/lib/buildkite-agent/zephyr-module-cache/modules/hal/stm32/stm32cube/stm32h7xx/soc -I/var/lib/buildkite-agent/zephyr-module-cache/modules/hal/stm32/stm32cube/stm32h7xx/drivers/include -I/var/lib/buildkite-agent/zephyr-module-cache/modules/hal/stm32/stm32cube/stm32h7xx/drivers/include/Legacy -I/var/lib/buildkite-agent/zephyr-module-cache/modules/hal/stm32/stm32cube/common_ll/include -isystem ../../../../../../../lib/libc/minimal/include -isystem /opt/toolchains/zephyr-sdk-0.13.0-rc4/arm-zephyr-eabi/bin/../lib/gcc/arm-zephyr-eabi/10.3.0/include -isystem /opt/toolchains/zephyr-sdk-0.13.0-rc4/arm-zephyr-eabi/bin/../lib/gcc/arm-zephyr-eabi/10.3.0/include-fixed -Os -imacros /workdir/zephyr/twister-out/nucleo_h753zi/tests/drivers/adc/adc_api/drivers.adc/zephyr/include/generated/autoconf.h -ffreestanding -fno-common -g -gdwarf-4 -fdiagnostics-color=always -mcpu=cortex-m7 -mthumb -mabi=aapcs -imacros /workdir/zephyr/include/toolchain/zephyr_stdint.h -Wall -Wformat -Wformat-security -Wno-format-zero-length -Wno-main -Wno-pointer-sign -Wpointer-arith -Wexpansion-to-defined -Wno-address-of-packed-member -Wno-unused-but-set-variable -Werror=implicit-int -Werror -fno-asynchronous-unwind-tables -fno-pie -fno-pic -fno-strict-overflow -fno-reorder-functions -fno-defer-pop -fmacro-prefix-map=/workdir/zephyr/tests/drivers/adc/adc_api=CMAKE_SOURCE_DIR -fmacro-prefix-map=/workdir/zephyr=ZEPHYR_BASE -fmacro-prefix-map=/workdir=WEST_TOPDIR -ffunction-sections -fdata-sections -std=c99 -nostdinc -MD -MT zephyr/drivers/adc/CMakeFiles/drivers__adc.dir/adc_stm32.c.obj -MF zephyr/drivers/adc/CMakeFiles/drivers__adc.dir/adc_stm32.c.obj.d -o zephyr/drivers/adc/CMakeFiles/drivers__adc.dir/adc_stm32.c.obj -c /workdir/zephyr/drivers/adc/adc_stm32.c
/workdir/zephyr/drivers/adc/adc_stm32.c: In function 'start_read':
/workdir/zephyr/drivers/adc/adc_stm32.c:444:44: error: 'LL_ADC_OVS_RATIO_2' undeclared (first use in this function); did you mean 'LL_ADC_INJ_RANK_2'?
  444 |   LL_ADC_ConfigOverSamplingRatioShift(adc, LL_ADC_OVS_RATIO_2,
      |                                            ^~~~~~~~~~~~~~~~~~
      |                                            LL_ADC_INJ_RANK_2
/workdir/zephyr/drivers/adc/adc_stm32.c:444:44: note: each undeclared identifier is reported only once for each function it appears in
/workdir/zephyr/drivers/adc/adc_stm32.c:449:44: error: 'LL_ADC_OVS_RATIO_4' undeclared (first use in this function); did you mean 'LL_ADC_INJ_RANK_4'?
  449 |   LL_ADC_ConfigOverSamplingRatioShift(adc, LL_ADC_OVS_RATIO_4,
      |                                            ^~~~~~~~~~~~~~~~~~
      |                                            LL_ADC_INJ_RANK_4
/workdir/zephyr/drivers/adc/adc_stm32.c:454:44: error: 'LL_ADC_OVS_RATIO_8' undeclared (first use in this function); did you mean 'LL_ADC_REG_RANK_8'?
  454 |   LL_ADC_ConfigOverSamplingRatioShift(adc, LL_ADC_OVS_RATIO_8,
      |                                            ^~~~~~~~~~~~~~~~~~
      |                                            LL_ADC_REG_RANK_8
/workdir/zephyr/drivers/adc/adc_stm32.c:459:44: error: 'LL_ADC_OVS_RATIO_16' undeclared (first use in this function); did you mean 'LL_ADC_REG_RANK_16'?
  459 |   LL_ADC_ConfigOverSamplingRatioShift(adc, LL_ADC_OVS_RATIO_16,
      |                                            ^~~~~~~~~~~~~~~~~~~
      |                                            LL_ADC_REG_RANK_16
/workdir/zephyr/drivers/adc/adc_stm32.c:464:44: error: 'LL_ADC_OVS_RATIO_32' undeclared (first use in this function)
  464 |   LL_ADC_ConfigOverSamplingRatioShift(adc, LL_ADC_OVS_RATIO_32,
      |                                            ^~~~~~~~~~~~~~~~~~~
/workdir/zephyr/drivers/adc/adc_stm32.c:469:44: error: 'LL_ADC_OVS_RATIO_64' undeclared (first use in this function); did you mean 'LL_ADC_INJ_RANK_4'?
  469 |   LL_ADC_ConfigOverSamplingRatioShift(adc, LL_ADC_OVS_RATIO_64,
      |                                            ^~~~~~~~~~~~~~~~~~~
      |                                            LL_ADC_INJ_RANK_4
/workdir/zephyr/drivers/adc/adc_stm32.c:474:44: error: 'LL_ADC_OVS_RATIO_128' undeclared (first use in this function); did you mean 'LL_ADC_REG_RANK_12'?
  474 |   LL_ADC_ConfigOverSamplingRatioShift(adc, LL_ADC_OVS_RATIO_128,
      |                                            ^~~~~~~~~~~~~~~~~~~~
      |                                            LL_ADC_REG_RANK_12
/workdir/zephyr/drivers/adc/adc_stm32.c:479:44: error: 'LL_ADC_OVS_RATIO_256' undeclared (first use in this function)
  479 |   LL_ADC_ConfigOverSamplingRatioShift(adc, LL_ADC_OVS_RATIO_256,
      |                                            ^~~~~~~~~~~~~~~~~~~~
[107/177] Building C object zephyr/drivers/serial/CMakeFiles/drivers__serial.dir/uart_stm32.c.obj
[108/177] Building C object zephyr/drivers/gpio/CMakeFiles/drivers__gpio.dir/gpio_handlers.c.obj
ninja: build stopped: subcommand failed.

in Job #cad9c5bb-660a-4151-8079-c381bc4667eb

samples/drivers/i2s/echo/sample.drivers.i2s.echo in litex_vexriscv:samples/drivers/i2s/echo/sample.drivers
Including boilerplate (Zephyr base): /workdir/zephyr/cmake/app/boilerplate.cmake
-- Application: /workdir/zephyr/samples/drivers/i2s/echo
-- Zephyr version: 2.6.99 (/workdir/zephyr), build: zephyr-v2.6.0-1623-g997bbcb000c3
-- Found Python3: /usr/bin/python3.8 (found suitable exact version "3.8.10") found components: Interpreter
-- Found west (found suitable version "0.11.0", minimum required is "0.7.1")
-- Board: litex_vexriscv
-- Cache files will be written to: /root/.cache/zephyr
-- Using toolchain: zephyr 0.13.0 (/opt/toolchains/zephyr-sdk-0.13.0-rc4)
-- Found dtc: /opt/toolchains/zephyr-sdk-0.13.0-rc4/sysroots/x86_64-pokysdk-linux/usr/bin/dtc (found suitable version "1.6.0", minimum required is "1.4.6")
-- Found BOARD.dts: /workdir/zephyr/boards/riscv/litex_vexriscv/litex_vexriscv.dts
-- Generated zephyr.dts: /workdir/zephyr/twister-out/litex_vexriscv/samples/drivers/i2s/echo/sample.drivers.i2s.echo/zephyr/zephyr.dts
-- Generated devicetree_unfixed.h: /workdir/zephyr/twister-out/litex_vexriscv/samples/drivers/i2s/echo/sample.drivers.i2s.echo/zephyr/include/generated/devicetree_unfixed.h
-- Generated device_extern.h: /workdir/zephyr/twister-out/litex_vexriscv/samples/drivers/i2s/echo/sample.drivers.i2s.echo/zephyr/include/generated/device_extern.h
Parsing /workdir/zephyr/samples/drivers/i2s/echo/Kconfig
Loaded configuration '/workdir/zephyr/boards/riscv/litex_vexriscv/litex_vexriscv_defconfig'
Merged configuration '/workdir/zephyr/samples/drivers/i2s/echo/prj.conf'
Configuration saved to '/workdir/zephyr/twister-out/litex_vexriscv/samples/drivers/i2s/echo/sample.drivers.i2s.echo/zephyr/.config'
Kconfig header saved to '/workdir/zephyr/twister-out/litex_vexriscv/samples/drivers/i2s/echo/sample.drivers.i2s.echo/zephyr/include/generated/autoconf.h'
-- The C compiler identification is GNU 10.3.0
-- The CXX compiler identification is GNU 10.3.0
-- The ASM compiler identification is GNU
-- Found assembler: /opt/toolchains/zephyr-sdk-0.13.0-rc4/riscv64-zephyr-elf/bin/riscv64-zephyr-elf-gcc
-- Configuring done
-- Generating done
-- Build files have been written to: /workdir/zephyr/twister-out/litex_vexriscv/samples/drivers/i2s/echo/sample.drivers.i2s.echo
[1/155] Preparing syscall dependency handling

[2/155] Generating misc/generated/syscalls_subdirs.trigger
[3/155] Generating misc/generated/syscalls.json, misc/generated/struct_tags.json
[4/155] Generating include/generated/syscall_dispatch.c, include/generated/syscall_list.h
[5/155] Generating include/generated/driver-validation.h
[6/155] Generating include/generated/kobj-types-enum.h, include/generated/otype-to-str.h, include/generated/otype-to-size.h
[7/155] Building C object zephyr/CMakeFiles/offsets.dir/arch/riscv/core/offsets/offsets.c.obj
[8/155] Generating include/generated/offsets.h
[9/155] Building C object zephyr/CMakeFiles/zephyr.dir/lib/os/cbprintf.c.obj
[10/155] Building C object CMakeFiles/app.dir/src/codec.c.obj
[11/155] Building C object CMakeFiles/app.dir/src/main.c.obj
FAILED: CMakeFiles/app.dir/src/main.c.obj
ccache /opt/toolchains/zephyr-sdk-0.13.0-rc4/riscv64-zephyr-elf/bin/riscv64-zephyr-elf-gcc -DBUILD_VERSION=zephyr-v2.6.0-1623-g997bbcb000c3 -DKERNEL -D_FORTIFY_SOURCE=2 -D__ZEPHYR__=1 -I/workdir/zephyr/include -Izephyr/include/generated -I/workdir/zephyr/soc/riscv/litex-vexriscv -I/workdir/zephyr/subsys/net/l2 -isystem /workdir/zephyr/lib/libc/minimal/include -isystem /opt/toolchains/zephyr-sdk-0.13.0-rc4/riscv64-zephyr-elf/bin/../lib/gcc/riscv64-zephyr-elf/10.3.0/include -isystem /opt/toolchains/zephyr-sdk-0.13.0-rc4/riscv64-zephyr-elf/bin/../lib/gcc/riscv64-zephyr-elf/10.3.0/include-fixed -Os -imacros /workdir/zephyr/twister-out/litex_vexriscv/samples/drivers/i2s/echo/sample.drivers.i2s.echo/zephyr/include/generated/autoconf.h -ffreestanding -fno-common -g -gdwarf-4 -fdiagnostics-color=always -mabi=ilp32 -march=rv32ima -imacros /workdir/zephyr/include/toolchain/zephyr_stdint.h -Wall -Wformat -Wformat-security -Wno-format-zero-length -Wno-main -Wno-pointer-sign -Wpointer-arith -Wexpansion-to-defined -Wno-address-of-packed-member -Wno-unused-but-set-variable -Werror=implicit-int -Werror -fno-asynchronous-unwind-tables -fno-pie -fno-pic -fno-strict-overflow -fno-reorder-functions -fno-defer-pop -fmacro-prefix-map=/workdir/zephyr/samples/drivers/i2s/echo=CMAKE_SOURCE_DIR -fmacro-prefix-map=/workdir/zephyr=ZEPHYR_BASE -fmacro-prefix-map=/workdir=WEST_TOPDIR -ffunction-sections -fdata-sections -std=c99 -nostdinc -MD -MT CMakeFiles/app.dir/src/main.c.obj -MF CMakeFiles/app.dir/src/main.c.obj.d -o CMakeFiles/app.dir/src/main.c.obj -c /workdir/zephyr/samples/drivers/i2s/echo/src/main.c
In file included from /workdir/zephyr/samples/drivers/i2s/echo/src/main.c:13:
/workdir/zephyr/include/drivers/clock_control/nrf_clock_control.h:11:10: fatal error: hal/nrf_clock.h: No such file or directory
   11 | #include
      |          ^~~~~~~~~~~~~~~~~
compilation terminated.
[12/155] Building C object zephyr/CMakeFiles/zephyr.dir/lib/os/crc32c_sw.c.obj
[13/155] Building C object zephyr/CMakeFiles/zephyr.dir/lib/os/cbprintf_packaged.c.obj
ninja: build stopped: subcommand failed.

in Job #ccd3493f-e321-4511-a473-cdce63063cfd

tests/drivers/adc/adc_api/drivers.adc in nucleo_h743zi:tests/drivers/adc/adc_api/drivers.adc
Including boilerplate (Zephyr base): /workdir/zephyr/cmake/app/boilerplate.cmake
-- Application: /workdir/zephyr/tests/drivers/adc/adc_api
-- Zephyr version: 2.6.99 (/workdir/zephyr), build: zephyr-v2.6.0-1623-g997bbcb000c3
-- Found Python3: /usr/bin/python3.8 (found suitable exact version "3.8.10") found components: Interpreter
-- Found west (found suitable version "0.11.0", minimum required is "0.7.1")
-- Board: nucleo_h743zi
-- Cache files will be written to: /root/.cache/zephyr
-- Using toolchain: zephyr 0.13.0 (/opt/toolchains/zephyr-sdk-0.13.0-rc4)
-- Found dtc: /opt/toolchains/zephyr-sdk-0.13.0-rc4/sysroots/x86_64-pokysdk-linux/usr/bin/dtc (found suitable version "1.6.0", minimum required is "1.4.6")
-- Found BOARD.dts: /workdir/zephyr/boards/arm/nucleo_h743zi/nucleo_h743zi.dts
-- Generated zephyr.dts: /workdir/zephyr/twister-out/nucleo_h743zi/tests/drivers/adc/adc_api/drivers.adc/zephyr/zephyr.dts
-- Generated devicetree_unfixed.h: /workdir/zephyr/twister-out/nucleo_h743zi/tests/drivers/adc/adc_api/drivers.adc/zephyr/include/generated/devicetree_unfixed.h
-- Generated device_extern.h: /workdir/zephyr/twister-out/nucleo_h743zi/tests/drivers/adc/adc_api/drivers.adc/zephyr/include/generated/device_extern.h
Parsing /workdir/zephyr/Kconfig
Loaded configuration '/workdir/zephyr/boards/arm/nucleo_h743zi/nucleo_h743zi_defconfig'
Merged configuration '/workdir/zephyr/tests/drivers/adc/adc_api/prj.conf'
Configuration saved to '/workdir/zephyr/twister-out/nucleo_h743zi/tests/drivers/adc/adc_api/drivers.adc/zephyr/.config'
Kconfig header saved to '/workdir/zephyr/twister-out/nucleo_h743zi/tests/drivers/adc/adc_api/drivers.adc/zephyr/include/generated/autoconf.h'
-- The C compiler identification is GNU 10.3.0
-- The CXX compiler identification is GNU 10.3.0
-- The ASM compiler identification is GNU
-- Found assembler: /opt/toolchains/zephyr-sdk-0.13.0-rc4/arm-zephyr-eabi/bin/arm-zephyr-eabi-gcc
-- Configuring done
-- Generating done
-- Build files have been written to: /workdir/zephyr/twister-out/nucleo_h743zi/tests/drivers/adc/adc_api/drivers.adc
[1/177] Preparing syscall dependency handling

[2/177] Generating misc/generated/syscalls_subdirs.trigger
[3/177] Generating misc/generated/syscalls.json, misc/generated/struct_tags.json
[4/177] Generating include/generated/syscall_dispatch.c, include/generated/syscall_list.h
[5/177] Generating include/generated/driver-validation.h
[6/177] Generating include/generated/kobj-types-enum.h, include/generated/otype-to-str.h, include/generated/otype-to-size.h
[7/177] Building C object zephyr/CMakeFiles/offsets.dir/arch/arm/core/offsets/offsets.c.obj
[8/177] Generating include/generated/offsets.h
[9/177] Building C object zephyr/CMakeFiles/zephyr.dir/lib/os/cbprintf.c.obj
[10/177] Building C object zephyr/CMakeFiles/zephyr.dir/lib/os/cbprintf_packaged.c.obj
[11/177] Building C object zephyr/CMakeFiles/zephyr.dir/lib/os/crc32c_sw.c.obj
[12/177] Building C object zephyr/CMakeFiles/zephyr.dir/lib/os/crc32_sw.c.obj
[13/177] Building C object zephyr/CMakeFiles/zephyr.dir/lib/os/crc16_sw.c.obj
[14/177] Building C object zephyr/CMakeFiles/zephyr.dir/lib/os/crc8_sw.c.obj
[15/177] Building C object zephyr/CMakeFiles/zephyr.dir/lib/os/crc7_sw.c.obj
[16/177] Building C object CMakeFiles/app.dir/src/main.c.obj
[17/177] Building C object zephyr/CMakeFiles/zephyr.dir/lib/os/dec.c.obj
[18/177] Building C object zephyr/CMakeFiles/zephyr.dir/lib/os/hex.c.obj
[19/177] Building C object CMakeFiles/app.dir/src/test_adc.c.obj
[20/177] Linking C static library app/libapp.a
[21/177] Building C object zephyr/CMakeFiles/zephyr.dir/lib/os/fdtable.c.obj
[22/177] Building C object zephyr/CMakeFiles/zephyr.dir/lib/os/notify.c.obj
[23/177] Building C object zephyr/CMakeFiles/zephyr.dir/lib/os/printk.c.obj
[24/177] Building C object zephyr/CMakeFiles/zephyr.dir/lib/os/sem.c.obj
[25/177] Building C object zephyr/CMakeFiles/zephyr.dir/lib/os/onoff.c.obj
[26/177] Building C object zephyr/CMakeFiles/zephyr.dir/lib/os/rb.c.obj
[27/177] Building C object zephyr/CMakeFiles/zephyr.dir/lib/os/timeutil.c.obj
[28/177] Building C object zephyr/CMakeFiles/zephyr.dir/lib/os/thread_entry.c.obj
[29/177] Building C object zephyr/CMakeFiles/zephyr.dir/lib/os/heap-validate.c.obj
[30/177] Building C object zephyr/CMakeFiles/zephyr.dir/lib/os/heap.c.obj
[31/177] Building C object zephyr/CMakeFiles/zephyr.dir/lib/os/cbprintf_complete.c.obj
[32/177] Building C object zephyr/CMakeFiles/zephyr.dir/lib/os/bitarray.c.obj
[33/177] Building C object zephyr/CMakeFiles/zephyr.dir/lib/os/assert.c.obj
[34/177] Building C object zephyr/CMakeFiles/zephyr.dir/lib/os/mutex.c.obj
[35/177] Building C object zephyr/CMakeFiles/zephyr.dir/misc/generated/configs.c.obj
[36/177] Building C object zephyr/CMakeFiles/zephyr.dir/lib/os/user_work.c.obj
[37/177] Building C object zephyr/CMakeFiles/zephyr.dir/lib/os/mpsc_pbuf.c.obj
[38/177] Building C object zephyr/CMakeFiles/zephyr.dir/soc/arm/st_stm32/stm32h7/soc_m7.c.obj
[39/177] Building C object zephyr/CMakeFiles/zephyr.dir/soc/arm/st_stm32/stm32h7/mpu_regions.c.obj
[40/177] Building C object zephyr/CMakeFiles/zephyr.dir/subsys/logging/log_minimal.c.obj
[41/177] Building C object zephyr/CMakeFiles/zephyr.dir/soc/arm/st_stm32/common/stm32cube_hal.c.obj
[42/177] Building C object zephyr/CMakeFiles/zephyr.dir/soc/arm/st_stm32/common/soc_config.c.obj
[43/177] Building C object zephyr/CMakeFiles/zephyr.dir/subsys/tracing/tracing_none.c.obj
[44/177] Building C object zephyr/CMakeFiles/zephyr.dir/drivers/console/uart_console.c.obj
[45/177] Building C object zephyr/CMakeFiles/zephyr.dir/drivers/interrupt_controller/intc_exti_stm32.c.obj
[46/177] Building C object zephyr/CMakeFiles/zephyr.dir/drivers/clock_control/clock_stm32_ll_h7.c.obj
[47/177] Building C object zephyr/CMakeFiles/zephyr.dir/drivers/pinmux/pinmux_stm32.c.obj
[48/177] Building C object zephyr/CMakeFiles/zephyr.dir/drivers/timer/sys_clock_init.c.obj
[49/177] Building C object zephyr/arch/common/CMakeFiles/isr_tables.dir/isr_tables.c.obj
[50/177] Linking C static library zephyr/arch/common/libisr_tables.a
[51/177] Building ASM object zephyr/arch/arch/arm/core/aarch32/CMakeFiles/arch__arm__core__aarch32.dir/cpu_idle.S.obj
[52/177] Building C object zephyr/CMakeFiles/zephyr.dir/drivers/timer/cortex_m_systick.c.obj
[53/177] Linking C static library zephyr/libzephyr.a
[54/177] Building C object zephyr/arch/common/CMakeFiles/arch__common.dir/sw_isr_common.c.obj
[55/177] Linking C static library zephyr/arch/common/libarch__common.a
[56/177] Building C object zephyr/arch/arch/arm/core/aarch32/CMakeFiles/arch__arm__core__aarch32.dir/irq_manage.c.obj
[57/177] Building ASM object zephyr/arch/arch/arm/core/aarch32/CMakeFiles/arch__arm__core__aarch32.dir/nmi_on_reset.S.obj
[58/177] Building C object zephyr/arch/arch/arm/core/aarch32/CMakeFiles/arch__arm__core__aarch32.dir/fatal.c.obj
[59/177] Building C object zephyr/arch/arch/arm/core/aarch32/CMakeFiles/arch__arm__core__aarch32.dir/nmi.c.obj
[60/177] Building ASM object zephyr/arch/arch/arm/core/aarch32/CMakeFiles/arch__arm__core__aarch32.dir/swap_helper.S.obj
[61/177] Building C object zephyr/arch/arch/arm/core/aarch32/CMakeFiles/arch__arm__core__aarch32.dir/prep_c.c.obj
[62/177] Building C object zephyr/arch/arch/arm/core/aarch32/CMakeFiles/arch__arm__core__aarch32.dir/swap.c.obj
[63/177] Building ASM object zephyr/arch/arch/arm/core/aarch32/CMakeFiles/arch__arm__core__aarch32.dir/isr_wrapper.S.obj
[64/177] Building ASM object zephyr/arch/arch/arm/core/aarch32/CMakeFiles/arch__arm__core__aarch32.dir/userspace.S.obj
[65/177] Building ASM object zephyr/arch/arch/arm/core/aarch32/cortex_m/CMakeFiles/arch__arm__core__aarch32__cortex_m.dir/exc_exit.S.obj
[66/177] Building ASM object zephyr/arch/arch/arm/core/aarch32/cortex_m/CMakeFiles/arch__arm__core__aarch32__cortex_m.dir/fault_s.S.obj
[67/177] Building C object zephyr/arch/arch/arm/core/aarch32/CMakeFiles/arch__arm__core__aarch32.dir/thread.c.obj
[68/177] Linking C static library zephyr/arch/arch/arm/core/aarch32/libarch__arm__core__aarch32.a
[69/177] Building C object zephyr/arch/arch/arm/core/aarch32/cortex_m/CMakeFiles/arch__arm__core__aarch32__cortex_m.dir/fpu.c.obj
[70/177] Building C object zephyr/arch/arch/arm/core/aarch32/cortex_m/CMakeFiles/arch__arm__core__aarch32__cortex_m.dir/irq_init.c.obj
[71/177] Building ASM object zephyr/arch/arch/arm/core/aarch32/cortex_m/CMakeFiles/arch__arm__core__aarch32__cortex_m.dir/reset.S.obj
[72/177] Building C object zephyr/arch/arch/arm/core/aarch32/cortex_m/CMakeFiles/arch__arm__core__aarch32__cortex_m.dir/fault.c.obj
[73/177] Building ASM object zephyr/arch/arch/arm/core/aarch32/cortex_m/CMakeFiles/arch__arm__core__aarch32__cortex_m.dir/vector_table.S.obj
[74/177] Building C object zephyr/arch/arch/arm/core/aarch32/cortex_m/CMakeFiles/arch__arm__core__aarch32__cortex_m.dir/scb.c.obj
[75/177] Building C object zephyr/arch/arch/arm/core/aarch32/cortex_m/CMakeFiles/arch__arm__core__aarch32__cortex_m.dir/thread.c.obj
[76/177] Building C object zephyr/arch/arch/arm/core/aarch32/cortex_m/CMakeFiles/arch__arm__core__aarch32__cortex_m.dir/thread_abort.c.obj
[77/177] Linking C static library zephyr/arch/arch/arm/core/aarch32/cortex_m/libarch__arm__core__aarch32__cortex_m.a
[78/177] Building C object zephyr/lib/libc/minimal/CMakeFiles/lib__libc__minimal.dir/source/stdlib/abort.c.obj
[79/177] Building C object zephyr/arch/arch/arm/core/aarch32/mpu/CMakeFiles/arch__arm__core__aarch32__mpu.dir/arm_core_mpu.c.obj
[80/177] Building C object zephyr/lib/libc/minimal/CMakeFiles/lib__libc__minimal.dir/source/stdlib/atoi.c.obj
[81/177] Building C object zephyr/arch/arch/arm/core/aarch32/mpu/CMakeFiles/arch__arm__core__aarch32__mpu.dir/arm_mpu.c.obj
[82/177] Building C object zephyr/lib/libc/minimal/CMakeFiles/lib__libc__minimal.dir/source/stdlib/strtol.c.obj
[83/177] Linking C static library zephyr/arch/arch/arm/core/aarch32/mpu/libarch__arm__core__aarch32__mpu.a
[84/177] Building C object zephyr/lib/libc/minimal/CMakeFiles/lib__libc__minimal.dir/source/stdlib/strtoul.c.obj
[85/177] Building C object zephyr/lib/libc/minimal/CMakeFiles/lib__libc__minimal.dir/source/stdlib/bsearch.c.obj
[86/177] Building C object zephyr/lib/libc/minimal/CMakeFiles/lib__libc__minimal.dir/source/string/strncasecmp.c.obj
[87/177] Building C object zephyr/lib/libc/minimal/CMakeFiles/lib__libc__minimal.dir/source/string/strstr.c.obj
[88/177] Building C object zephyr/lib/libc/minimal/CMakeFiles/lib__libc__minimal.dir/source/string/string.c.obj
[89/177] Building C object zephyr/lib/libc/minimal/CMakeFiles/lib__libc__minimal.dir/source/string/strspn.c.obj
[90/177] Building C object zephyr/lib/libc/minimal/CMakeFiles/lib__libc__minimal.dir/source/stdlib/malloc.c.obj
[91/177] Building C object zephyr/lib/libc/minimal/CMakeFiles/lib__libc__minimal.dir/source/stdlib/exit.c.obj
[92/177] Building C object zephyr/lib/libc/minimal/CMakeFiles/lib__libc__minimal.dir/source/stdout/sprintf.c.obj
[93/177] Building C object zephyr/lib/libc/minimal/CMakeFiles/lib__libc__minimal.dir/source/stdout/fprintf.c.obj
[94/177] Building C object zephyr/lib/libc/minimal/CMakeFiles/lib__libc__minimal.dir/source/time/gmtime.c.obj
[95/177] Building C object zephyr/lib/libc/minimal/CMakeFiles/lib__libc__minimal.dir/source/stdout/stdout_console.c.obj
[96/177] Linking C static library zephyr/lib/libc/minimal/liblib__libc__minimal.a
[97/177] Building C object zephyr/lib/posix/CMakeFiles/lib__posix.dir/pthread_common.c.obj
[98/177] Building C object zephyr/lib/posix/CMakeFiles/lib__posix.dir/nanosleep.c.obj
[99/177] Linking C static library zephyr/lib/posix/liblib__posix.a
[100/177] Building C object zephyr/subsys/testsuite/ztest/CMakeFiles/subsys__testsuite__ztest.dir/src/ztest.c.obj
[101/177] Building C object zephyr/subsys/testsuite/ztest/CMakeFiles/subsys__testsuite__ztest.dir/src/ztest_error_hook.c.obj
[102/177] Linking C static library zephyr/subsys/testsuite/ztest/libsubsys__testsuite__ztest.a
[103/177] Building C object zephyr/drivers/adc/CMakeFiles/drivers__adc.dir/adc_common.c.obj
[104/177] Building C object zephyr/drivers/adc/CMakeFiles/drivers__adc.dir/adc_handlers.c.obj
[105/177] Building C object zephyr/drivers/gpio/CMakeFiles/drivers__gpio.dir/gpio_stm32.c.obj
[106/177] Building C object zephyr/drivers/adc/CMakeFiles/drivers__adc.dir/adc_stm32.c.obj
FAILED: zephyr/drivers/adc/CMakeFiles/drivers__adc.dir/adc_stm32.c.obj
ccache /opt/toolchains/zephyr-sdk-0.13.0-rc4/arm-zephyr-eabi/bin/arm-zephyr-eabi-gcc -DBUILD_VERSION=zephyr-v2.6.0-1623-g997bbcb000c3 -DCORE_CM7 -DHSE_VALUE=8000000 -DKERNEL -DSTM32H743xx -DUSE_FULL_LL_DRIVER -DUSE_HAL_DRIVER -D_FORTIFY_SOURCE=2 -D__PROGRAM_START -D__ZEPHYR_SUPERVISOR__ -D__ZEPHYR__=1 -I../../../../../../../include -Izephyr/include/generated -I../../../../../../../soc/arm/st_stm32/stm32h7 -I../../../../../../../drivers -I../../../../../../../soc/arm/st_stm32/common -I../../../../../../../subsys/testsuite/include -I../../../../../../../subsys/testsuite/ztest/include -I/var/lib/buildkite-agent/zephyr-module-cache/modules/hal/cmsis/CMSIS/Core/Include -I/var/lib/buildkite-agent/zephyr-module-cache/modules/hal/stm32/stm32cube/stm32h7xx/soc -I/var/lib/buildkite-agent/zephyr-module-cache/modules/hal/stm32/stm32cube/stm32h7xx/drivers/include -I/var/lib/buildkite-agent/zephyr-module-cache/modules/hal/stm32/stm32cube/stm32h7xx/drivers/include/Legacy -I/var/lib/buildkite-agent/zephyr-module-cache/modules/hal/stm32/stm32cube/common_ll/include -isystem ../../../../../../../lib/libc/minimal/include -isystem /opt/toolchains/zephyr-sdk-0.13.0-rc4/arm-zephyr-eabi/bin/../lib/gcc/arm-zephyr-eabi/10.3.0/include -isystem /opt/toolchains/zephyr-sdk-0.13.0-rc4/arm-zephyr-eabi/bin/../lib/gcc/arm-zephyr-eabi/10.3.0/include-fixed -Os -imacros /workdir/zephyr/twister-out/nucleo_h743zi/tests/drivers/adc/adc_api/drivers.adc/zephyr/include/generated/autoconf.h -ffreestanding -fno-common -g -gdwarf-4 -fdiagnostics-color=always -mcpu=cortex-m7 -mthumb -mabi=aapcs -imacros /workdir/zephyr/include/toolchain/zephyr_stdint.h -Wall -Wformat -Wformat-security -Wno-format-zero-length -Wno-main -Wno-pointer-sign -Wpointer-arith -Wexpansion-to-defined -Wno-address-of-packed-member -Wno-unused-but-set-variable -Werror=implicit-int -Werror -fno-asynchronous-unwind-tables -fno-pie -fno-pic -fno-strict-overflow -fno-reorder-functions -fno-defer-pop -fmacro-prefix-map=/workdir/zephyr/tests/drivers/adc/adc_api=CMAKE_SOURCE_DIR -fmacro-prefix-map=/workdir/zephyr=ZEPHYR_BASE -fmacro-prefix-map=/workdir=WEST_TOPDIR -ffunction-sections -fdata-sections -std=c99 -nostdinc -MD -MT zephyr/drivers/adc/CMakeFiles/drivers__adc.dir/adc_stm32.c.obj -MF zephyr/drivers/adc/CMakeFiles/drivers__adc.dir/adc_stm32.c.obj.d -o zephyr/drivers/adc/CMakeFiles/drivers__adc.dir/adc_stm32.c.obj -c /workdir/zephyr/drivers/adc/adc_stm32.c
/workdir/zephyr/drivers/adc/adc_stm32.c: In function 'start_read':
/workdir/zephyr/drivers/adc/adc_stm32.c:444:44: error: 'LL_ADC_OVS_RATIO_2' undeclared (first use in this function); did you mean 'LL_ADC_INJ_RANK_2'?
  444 |   LL_ADC_ConfigOverSamplingRatioShift(adc, LL_ADC_OVS_RATIO_2,
      |                                            ^~~~~~~~~~~~~~~~~~
      |                                            LL_ADC_INJ_RANK_2
/workdir/zephyr/drivers/adc/adc_stm32.c:444:44: note: each undeclared identifier is reported only once for each function it appears in
/workdir/zephyr/drivers/adc/adc_stm32.c:449:44: error: 'LL_ADC_OVS_RATIO_4' undeclared (first use in this function); did you mean 'LL_ADC_INJ_RANK_4'?
  449 |   LL_ADC_ConfigOverSamplingRatioShift(adc, LL_ADC_OVS_RATIO_4,
      |                                            ^~~~~~~~~~~~~~~~~~
      |                                            LL_ADC_INJ_RANK_4
/workdir/zephyr/drivers/adc/adc_stm32.c:454:44: error: 'LL_ADC_OVS_RATIO_8' undeclared (first use in this function); did you mean 'LL_ADC_REG_RANK_8'?
  454 |   LL_ADC_ConfigOverSamplingRatioShift(adc, LL_ADC_OVS_RATIO_8,
      |                                            ^~~~~~~~~~~~~~~~~~
      |                                            LL_ADC_REG_RANK_8
/workdir/zephyr/drivers/adc/adc_stm32.c:459:44: error: 'LL_ADC_OVS_RATIO_16' undeclared (first use in this function); did you mean 'LL_ADC_REG_RANK_16'?
  459 |   LL_ADC_ConfigOverSamplingRatioShift(adc, LL_ADC_OVS_RATIO_16,
      |                                            ^~~~~~~~~~~~~~~~~~~
      |                                            LL_ADC_REG_RANK_16
/workdir/zephyr/drivers/adc/adc_stm32.c:464:44: error: 'LL_ADC_OVS_RATIO_32' undeclared (first use in this function)
  464 |   LL_ADC_ConfigOverSamplingRatioShift(adc, LL_ADC_OVS_RATIO_32,
      |                                            ^~~~~~~~~~~~~~~~~~~
/workdir/zephyr/drivers/adc/adc_stm32.c:469:44: error: 'LL_ADC_OVS_RATIO_64' undeclared (first use in this function); did you mean 'LL_ADC_INJ_RANK_4'?
  469 |   LL_ADC_ConfigOverSamplingRatioShift(adc, LL_ADC_OVS_RATIO_64,
      |                                            ^~~~~~~~~~~~~~~~~~~
      |                                            LL_ADC_INJ_RANK_4
/workdir/zephyr/drivers/adc/adc_stm32.c:474:44: error: 'LL_ADC_OVS_RATIO_128' undeclared (first use in this function); did you mean 'LL_ADC_REG_RANK_12'?
  474 |   LL_ADC_ConfigOverSamplingRatioShift(adc, LL_ADC_OVS_RATIO_128,
      |                                            ^~~~~~~~~~~~~~~~~~~~
      |                                            LL_ADC_REG_RANK_12
/workdir/zephyr/drivers/adc/adc_stm32.c:479:44: error: 'LL_ADC_OVS_RATIO_256' undeclared (first use in this function)
  479 |   LL_ADC_ConfigOverSamplingRatioShift(adc, LL_ADC_OVS_RATIO_256,
      |                                            ^~~~~~~~~~~~~~~~~~~~
[107/177] Building C object zephyr/drivers/serial/CMakeFiles/drivers__serial.dir/uart_stm32.c.obj
[108/177] Building C object zephyr/drivers/gpio/CMakeFiles/drivers__gpio.dir/gpio_handlers.c.obj
ninja: build stopped: subcommand failed.

in Job #e258deee-3419-4b5d-93ad-e42c19aada9a


[Still Failing] Zephyr / zephyr-daily #411 (main) #builds

Buildkite <notifications@...>
 

Scheduled build Duration: 6 hours, 50 minutes, 49 seconds
Build #411 | main | 75e9fa8
View Build →
ℹ︎

Read the JUnit test report

✖︎

8 failures:

samples/drivers/i2s/echo/sample.drivers.i2s.echo in litex_vexriscv:samples/drivers/i2s/echo/sample.drivers
Including boilerplate (Zephyr base): /workdir/zephyr/cmake/app/boilerplate.cmake
-- Application: /workdir/zephyr/samples/drivers/i2s/echo
-- Zephyr version: 2.6.99 (/workdir/zephyr), build: zephyr-v2.6.0-1617-g75e9fa827490
-- Found Python3: /usr/bin/python3.8 (found suitable exact version "3.8.10") found components: Interpreter
-- Found west (found suitable version "0.11.0", minimum required is "0.7.1")
-- Board: litex_vexriscv
-- Cache files will be written to: /root/.cache/zephyr
-- Using toolchain: zephyr 0.13.0 (/opt/toolchains/zephyr-sdk-0.13.0-rc4)
-- Found dtc: /opt/toolchains/zephyr-sdk-0.13.0-rc4/sysroots/x86_64-pokysdk-linux/usr/bin/dtc (found suitable version "1.6.0", minimum required is "1.4.6")
-- Found BOARD.dts: /workdir/zephyr/boards/riscv/litex_vexriscv/litex_vexriscv.dts
-- Generated zephyr.dts: /workdir/zephyr/twister-out/litex_vexriscv/samples/drivers/i2s/echo/sample.drivers.i2s.echo/zephyr/zephyr.dts
-- Generated devicetree_unfixed.h: /workdir/zephyr/twister-out/litex_vexriscv/samples/drivers/i2s/echo/sample.drivers.i2s.echo/zephyr/include/generated/devicetree_unfixed.h
-- Generated device_extern.h: /workdir/zephyr/twister-out/litex_vexriscv/samples/drivers/i2s/echo/sample.drivers.i2s.echo/zephyr/include/generated/device_extern.h
Parsing /workdir/zephyr/samples/drivers/i2s/echo/Kconfig
Loaded configuration '/workdir/zephyr/boards/riscv/litex_vexriscv/litex_vexriscv_defconfig'
Merged configuration '/workdir/zephyr/samples/drivers/i2s/echo/prj.conf'
Configuration saved to '/workdir/zephyr/twister-out/litex_vexriscv/samples/drivers/i2s/echo/sample.drivers.i2s.echo/zephyr/.config'
Kconfig header saved to '/workdir/zephyr/twister-out/litex_vexriscv/samples/drivers/i2s/echo/sample.drivers.i2s.echo/zephyr/include/generated/autoconf.h'
-- The C compiler identification is GNU 10.3.0
-- The CXX compiler identification is GNU 10.3.0
-- The ASM compiler identification is GNU
-- Found assembler: /opt/toolchains/zephyr-sdk-0.13.0-rc4/riscv64-zephyr-elf/bin/riscv64-zephyr-elf-gcc
-- Configuring done
-- Generating done
-- Build files have been written to: /workdir/zephyr/twister-out/litex_vexriscv/samples/drivers/i2s/echo/sample.drivers.i2s.echo
[1/155] Preparing syscall dependency handling

[2/155] Generating misc/generated/syscalls_subdirs.trigger
[3/155] Generating misc/generated/syscalls.json, misc/generated/struct_tags.json
[4/155] Generating include/generated/syscall_dispatch.c, include/generated/syscall_list.h
[5/155] Generating include/generated/driver-validation.h
[6/155] Generating include/generated/kobj-types-enum.h, include/generated/otype-to-str.h, include/generated/otype-to-size.h
[7/155] Building C object zephyr/CMakeFiles/offsets.dir/arch/riscv/core/offsets/offsets.c.obj
[8/155] Generating include/generated/offsets.h
[9/155] Building C object zephyr/CMakeFiles/zephyr.dir/lib/os/cbprintf.c.obj
[10/155] Building C object CMakeFiles/app.dir/src/main.c.obj
FAILED: CMakeFiles/app.dir/src/main.c.obj
ccache /opt/toolchains/zephyr-sdk-0.13.0-rc4/riscv64-zephyr-elf/bin/riscv64-zephyr-elf-gcc -DBUILD_VERSION=zephyr-v2.6.0-1617-g75e9fa827490 -DKERNEL -D_FORTIFY_SOURCE=2 -D__ZEPHYR__=1 -I/workdir/zephyr/include -Izephyr/include/generated -I/workdir/zephyr/soc/riscv/litex-vexriscv -I/workdir/zephyr/subsys/net/l2 -isystem /workdir/zephyr/lib/libc/minimal/include -isystem /opt/toolchains/zephyr-sdk-0.13.0-rc4/riscv64-zephyr-elf/bin/../lib/gcc/riscv64-zephyr-elf/10.3.0/include -isystem /opt/toolchains/zephyr-sdk-0.13.0-rc4/riscv64-zephyr-elf/bin/../lib/gcc/riscv64-zephyr-elf/10.3.0/include-fixed -Os -imacros /workdir/zephyr/twister-out/litex_vexriscv/samples/drivers/i2s/echo/sample.drivers.i2s.echo/zephyr/include/generated/autoconf.h -ffreestanding -fno-common -g -gdwarf-4 -fdiagnostics-color=always -mabi=ilp32 -march=rv32ima -imacros /workdir/zephyr/include/toolchain/zephyr_stdint.h -Wall -Wformat -Wformat-security -Wno-format-zero-length -Wno-main -Wno-pointer-sign -Wpointer-arith -Wexpansion-to-defined -Wno-address-of-packed-member -Wno-unused-but-set-variable -Werror=implicit-int -Werror -fno-asynchronous-unwind-tables -fno-pie -fno-pic -fno-strict-overflow -fno-reorder-functions -fno-defer-pop -fmacro-prefix-map=/workdir/zephyr/samples/drivers/i2s/echo=CMAKE_SOURCE_DIR -fmacro-prefix-map=/workdir/zephyr=ZEPHYR_BASE -fmacro-prefix-map=/workdir=WEST_TOPDIR -ffunction-sections -fdata-sections -std=c99 -nostdinc -MD -MT CMakeFiles/app.dir/src/main.c.obj -MF CMakeFiles/app.dir/src/main.c.obj.d -o CMakeFiles/app.dir/src/main.c.obj -c /workdir/zephyr/samples/drivers/i2s/echo/src/main.c
In file included from /workdir/zephyr/samples/drivers/i2s/echo/src/main.c:13:
/workdir/zephyr/include/drivers/clock_control/nrf_clock_control.h:11:10: fatal error: hal/nrf_clock.h: No such file or directory
   11 | #include
      |          ^~~~~~~~~~~~~~~~~
compilation terminated.
[11/155] Building C object CMakeFiles/app.dir/src/codec.c.obj
[12/155] Building C object zephyr/CMakeFiles/zephyr.dir/lib/os/cbprintf_packaged.c.obj
ninja: build stopped: subcommand failed.

in Job #0bfc157b-91de-458f-a39a-9727f33f4882

samples/subsys/usb/dfu/sample.usb.dfu in teensy40:samples/subsys/usb/dfu/sample.usb
Including boilerplate (Zephyr base): /workdir/zephyr/cmake/app/boilerplate.cmake
-- Application: /workdir/zephyr/samples/subsys/usb/dfu
-- Zephyr version: 2.6.99 (/workdir/zephyr), build: zephyr-v2.6.0-1617-g75e9fa827490
-- Found Python3: /usr/bin/python3.8 (found suitable exact version "3.8.10") found components: Interpreter
-- Found west (found suitable version "0.11.0", minimum required is "0.7.1")
-- Board: teensy40
-- Cache files will be written to: /root/.cache/zephyr
-- Using toolchain: zephyr 0.13.0 (/opt/toolchains/zephyr-sdk-0.13.0-rc4)
-- Found dtc: /opt/toolchains/zephyr-sdk-0.13.0-rc4/sysroots/x86_64-pokysdk-linux/usr/bin/dtc (found suitable version "1.6.0", minimum required is "1.4.6")
-- Found BOARD.dts: /workdir/zephyr/boards/arm/teensy4/teensy40.dts
-- Generated zephyr.dts: /workdir/zephyr/twister-out/teensy40/samples/subsys/usb/dfu/sample.usb.dfu/zephyr/zephyr.dts
-- Generated devicetree_unfixed.h: /workdir/zephyr/twister-out/teensy40/samples/subsys/usb/dfu/sample.usb.dfu/zephyr/include/generated/devicetree_unfixed.h
-- Generated device_extern.h: /workdir/zephyr/twister-out/teensy40/samples/subsys/usb/dfu/sample.usb.dfu/zephyr/include/generated/device_extern.h

warning: FLASH_PAGE_LAYOUT (defined at drivers/flash/Kconfig:54) has direct dependencies FLASH_HAS_PAGE_LAYOUT && FLASH with value n, but is currently being y-selected by the following symbols:
 - STREAM_FLASH (defined at subsys/storage/stream/Kconfig:7), with value y, direct dependencies y (value: y)

warning: FLASH_MAP (defined at subsys/storage/flash_map/Kconfig:10) has direct dependencies FLASH_HAS_DRIVER_ENABLED with value n, but is currently being y-selected by the following symbols:
 - MCUBOOT_IMG_MANAGER (defined at subsys/dfu/Kconfig:25), with value y, direct dependencies  (value: y), and select condition  (value: y)
Parsing /workdir/zephyr/samples/subsys/usb/dfu/Kconfig
Loaded configuration '/workdir/zephyr/boards/arm/teensy4/teensy40_defconfig'
Merged configuration '/workdir/zephyr/samples/subsys/usb/dfu/prj.conf'

error: Aborting due to Kconfig warnings

CMake Error at /workdir/zephyr/cmake/kconfig.cmake:268 (message):
  command failed with return code: 1
Call Stack (most recent call first):
  /workdir/zephyr/cmake/app/boilerplate.cmake:572 (include)
  /workdir/zephyr/share/zephyr-package/cmake/ZephyrConfig.cmake:24 (include)
  /workdir/zephyr/share/zephyr-package/cmake/ZephyrConfig.cmake:35 (include_boilerplate)
  CMakeLists.txt:4 (find_package)


-- Configuring incomplete, errors occurred!

in Job #5390f68c-cdf8-4d88-a3c2-fe5cdf75c54b

samples/subsys/usb/dfu/sample.usb.dfu in teensy41:samples/subsys/usb/dfu/sample.usb
Including boilerplate (Zephyr base): /workdir/zephyr/cmake/app/boilerplate.cmake
-- Application: /workdir/zephyr/samples/subsys/usb/dfu
-- Zephyr version: 2.6.99 (/workdir/zephyr), build: zephyr-v2.6.0-1617-g75e9fa827490
-- Found Python3: /usr/bin/python3.8 (found suitable exact version "3.8.10") found components: Interpreter
-- Found west (found suitable version "0.11.0", minimum required is "0.7.1")
-- Board: teensy41
-- Cache files will be written to: /root/.cache/zephyr
-- Using toolchain: zephyr 0.13.0 (/opt/toolchains/zephyr-sdk-0.13.0-rc4)
-- Found dtc: /opt/toolchains/zephyr-sdk-0.13.0-rc4/sysroots/x86_64-pokysdk-linux/usr/bin/dtc (found suitable version "1.6.0", minimum required is "1.4.6")
-- Found BOARD.dts: /workdir/zephyr/boards/arm/teensy4/teensy41.dts
-- Generated zephyr.dts: /workdir/zephyr/twister-out/teensy41/samples/subsys/usb/dfu/sample.usb.dfu/zephyr/zephyr.dts
-- Generated devicetree_unfixed.h: /workdir/zephyr/twister-out/teensy41/samples/subsys/usb/dfu/sample.usb.dfu/zephyr/include/generated/devicetree_unfixed.h
-- Generated device_extern.h: /workdir/zephyr/twister-out/teensy41/samples/subsys/usb/dfu/sample.usb.dfu/zephyr/include/generated/device_extern.h

warning: FLASH_PAGE_LAYOUT (defined at drivers/flash/Kconfig:54) has direct dependencies FLASH_HAS_PAGE_LAYOUT && FLASH with value n, but is currently being y-selected by the following symbols:
 - STREAM_FLASH (defined at subsys/storage/stream/Kconfig:7), with value y, direct dependencies y (value: y)

warning: FLASH_MAP (defined at subsys/storage/flash_map/Kconfig:10) has direct dependencies FLASH_HAS_DRIVER_ENABLED with value n, but is currently being y-selected by the following symbols:
 - MCUBOOT_IMG_MANAGER (defined at subsys/dfu/Kconfig:25), with value y, direct dependencies  (value: y), and select condition  (value: y)
Parsing /workdir/zephyr/samples/subsys/usb/dfu/Kconfig
Loaded configuration '/workdir/zephyr/boards/arm/teensy4/teensy41_defconfig'
Merged configuration '/workdir/zephyr/samples/subsys/usb/dfu/prj.conf'

error: Aborting due to Kconfig warnings

CMake Error at /workdir/zephyr/cmake/kconfig.cmake:268 (message):
  command failed with return code: 1
Call Stack (most recent call first):
  /workdir/zephyr/cmake/app/boilerplate.cmake:572 (include)
  /workdir/zephyr/share/zephyr-package/cmake/ZephyrConfig.cmake:24 (include)
  /workdir/zephyr/share/zephyr-package/cmake/ZephyrConfig.cmake:35 (include_boilerplate)
  CMakeLists.txt:4 (find_package)


-- Configuring incomplete, errors occurred!

in Job #6011a095-a821-4b78-8b17-8eda956725fa

tests/drivers/adc/adc_api/drivers.adc in nucleo_h743zi:tests/drivers/adc/adc_api/drivers.adc
Including boilerplate (Zephyr base): /workdir/zephyr/cmake/app/boilerplate.cmake
-- Application: /workdir/zephyr/tests/drivers/adc/adc_api
-- Zephyr version: 2.6.99 (/workdir/zephyr), build: zephyr-v2.6.0-1617-g75e9fa827490
-- Found Python3: /usr/bin/python3.8 (found suitable exact version "3.8.10") found components: Interpreter
-- Found west (found suitable version "0.11.0", minimum required is "0.7.1")
-- Board: nucleo_h743zi
-- Cache files will be written to: /root/.cache/zephyr
-- Using toolchain: zephyr 0.13.0 (/opt/toolchains/zephyr-sdk-0.13.0-rc4)
-- Found dtc: /opt/toolchains/zephyr-sdk-0.13.0-rc4/sysroots/x86_64-pokysdk-linux/usr/bin/dtc (found suitable version "1.6.0", minimum required is "1.4.6")
-- Found BOARD.dts: /workdir/zephyr/boards/arm/nucleo_h743zi/nucleo_h743zi.dts
-- Generated zephyr.dts: /workdir/zephyr/twister-out/nucleo_h743zi/tests/drivers/adc/adc_api/drivers.adc/zephyr/zephyr.dts
-- Generated devicetree_unfixed.h: /workdir/zephyr/twister-out/nucleo_h743zi/tests/drivers/adc/adc_api/drivers.adc/zephyr/include/generated/devicetree_unfixed.h
-- Generated device_extern.h: /workdir/zephyr/twister-out/nucleo_h743zi/tests/drivers/adc/adc_api/drivers.adc/zephyr/include/generated/device_extern.h
Parsing /workdir/zephyr/Kconfig
Loaded configuration '/workdir/zephyr/boards/arm/nucleo_h743zi/nucleo_h743zi_defconfig'
Merged configuration '/workdir/zephyr/tests/drivers/adc/adc_api/prj.conf'
Configuration saved to '/workdir/zephyr/twister-out/nucleo_h743zi/tests/drivers/adc/adc_api/drivers.adc/zephyr/.config'
Kconfig header saved to '/workdir/zephyr/twister-out/nucleo_h743zi/tests/drivers/adc/adc_api/drivers.adc/zephyr/include/generated/autoconf.h'
-- The C compiler identification is GNU 10.3.0
-- The CXX compiler identification is GNU 10.3.0
-- The ASM compiler identification is GNU
-- Found assembler: /opt/toolchains/zephyr-sdk-0.13.0-rc4/arm-zephyr-eabi/bin/arm-zephyr-eabi-gcc
-- Configuring done
-- Generating done
-- Build files have been written to: /workdir/zephyr/twister-out/nucleo_h743zi/tests/drivers/adc/adc_api/drivers.adc
[1/177] Preparing syscall dependency handling

[2/177] Generating misc/generated/syscalls_subdirs.trigger
[3/177] Generating misc/generated/syscalls.json, misc/generated/struct_tags.json
[4/177] Generating include/generated/syscall_dispatch.c, include/generated/syscall_list.h
[5/177] Generating include/generated/kobj-types-enum.h, include/generated/otype-to-str.h, include/generated/otype-to-size.h
[6/177] Generating include/generated/driver-validation.h
[7/177] Building C object zephyr/CMakeFiles/offsets.dir/arch/arm/core/offsets/offsets.c.obj
[8/177] Generating include/generated/offsets.h
[9/177] Building C object zephyr/CMakeFiles/zephyr.dir/lib/os/cbprintf.c.obj
[10/177] Building C object zephyr/CMakeFiles/zephyr.dir/lib/os/cbprintf_packaged.c.obj
[11/177] Building C object zephyr/CMakeFiles/zephyr.dir/lib/os/crc32c_sw.c.obj
[12/177] Building C object zephyr/CMakeFiles/zephyr.dir/lib/os/crc32_sw.c.obj
[13/177] Building C object zephyr/CMakeFiles/zephyr.dir/lib/os/crc16_sw.c.obj
[14/177] Building C object zephyr/CMakeFiles/zephyr.dir/lib/os/crc8_sw.c.obj
[15/177] Building C object zephyr/CMakeFiles/zephyr.dir/lib/os/crc7_sw.c.obj
[16/177] Building C object zephyr/CMakeFiles/zephyr.dir/lib/os/dec.c.obj
[17/177] Building C object CMakeFiles/app.dir/src/main.c.obj
[18/177] Building C object zephyr/CMakeFiles/zephyr.dir/lib/os/hex.c.obj
[19/177] Building C object CMakeFiles/app.dir/src/test_adc.c.obj
[20/177] Linking C static library app/libapp.a
[21/177] Building C object zephyr/CMakeFiles/zephyr.dir/lib/os/fdtable.c.obj
[22/177] Building C object zephyr/CMakeFiles/zephyr.dir/lib/os/notify.c.obj
[23/177] Building C object zephyr/CMakeFiles/zephyr.dir/lib/os/printk.c.obj
[24/177] Building C object zephyr/CMakeFiles/zephyr.dir/lib/os/rb.c.obj
[25/177] Building C object zephyr/CMakeFiles/zephyr.dir/lib/os/onoff.c.obj
[26/177] Building C object zephyr/CMakeFiles/zephyr.dir/lib/os/sem.c.obj
[27/177] Building C object zephyr/CMakeFiles/zephyr.dir/lib/os/timeutil.c.obj
[28/177] Building C object zephyr/CMakeFiles/zephyr.dir/lib/os/thread_entry.c.obj
[29/177] Building C object zephyr/CMakeFiles/zephyr.dir/lib/os/heap.c.obj
[30/177] Building C object zephyr/CMakeFiles/zephyr.dir/lib/os/heap-validate.c.obj
[31/177] Building C object zephyr/CMakeFiles/zephyr.dir/lib/os/cbprintf_complete.c.obj
[32/177] Building C object zephyr/CMakeFiles/zephyr.dir/lib/os/bitarray.c.obj
[33/177] Building C object zephyr/CMakeFiles/zephyr.dir/lib/os/assert.c.obj
[34/177] Building C object zephyr/CMakeFiles/zephyr.dir/lib/os/mutex.c.obj
[35/177] Building C object zephyr/CMakeFiles/zephyr.dir/misc/generated/configs.c.obj
[36/177] Building C object zephyr/CMakeFiles/zephyr.dir/lib/os/user_work.c.obj
[37/177] Building C object zephyr/CMakeFiles/zephyr.dir/lib/os/mpsc_pbuf.c.obj
[38/177] Building C object zephyr/CMakeFiles/zephyr.dir/soc/arm/st_stm32/stm32h7/mpu_regions.c.obj
[39/177] Building C object zephyr/CMakeFiles/zephyr.dir/soc/arm/st_stm32/stm32h7/soc_m7.c.obj
[40/177] Building C object zephyr/CMakeFiles/zephyr.dir/subsys/logging/log_minimal.c.obj
[41/177] Building C object zephyr/CMakeFiles/zephyr.dir/soc/arm/st_stm32/common/stm32cube_hal.c.obj
[42/177] Building C object zephyr/CMakeFiles/zephyr.dir/soc/arm/st_stm32/common/soc_config.c.obj
[43/177] Building C object zephyr/CMakeFiles/zephyr.dir/subsys/tracing/tracing_none.c.obj
[44/177] Building C object zephyr/CMakeFiles/zephyr.dir/drivers/console/uart_console.c.obj
[45/177] Building C object zephyr/CMakeFiles/zephyr.dir/drivers/interrupt_controller/intc_exti_stm32.c.obj
[46/177] Building C object zephyr/CMakeFiles/zephyr.dir/drivers/clock_control/clock_stm32_ll_h7.c.obj
[47/177] Building C object zephyr/CMakeFiles/zephyr.dir/drivers/pinmux/pinmux_stm32.c.obj
[48/177] Building C object zephyr/CMakeFiles/zephyr.dir/drivers/timer/sys_clock_init.c.obj
[49/177] Building C object zephyr/CMakeFiles/zephyr.dir/drivers/timer/cortex_m_systick.c.obj
[50/177] Linking C static library zephyr/libzephyr.a
[51/177] Building ASM object zephyr/arch/arch/arm/core/aarch32/CMakeFiles/arch__arm__core__aarch32.dir/cpu_idle.S.obj
[52/177] Building C object zephyr/arch/common/CMakeFiles/isr_tables.dir/isr_tables.c.obj
[53/177] Linking C static library zephyr/arch/common/libisr_tables.a
[54/177] Building C object zephyr/arch/common/CMakeFiles/arch__common.dir/sw_isr_common.c.obj
[55/177] Linking C static library zephyr/arch/common/libarch__common.a
[56/177] Building C object zephyr/arch/arch/arm/core/aarch32/CMakeFiles/arch__arm__core__aarch32.dir/fatal.c.obj
[57/177] Building ASM object zephyr/arch/arch/arm/core/aarch32/CMakeFiles/arch__arm__core__aarch32.dir/nmi_on_reset.S.obj
[58/177] Building C object zephyr/arch/arch/arm/core/aarch32/CMakeFiles/arch__arm__core__aarch32.dir/irq_manage.c.obj
[59/177] Building C object zephyr/arch/arch/arm/core/aarch32/CMakeFiles/arch__arm__core__aarch32.dir/nmi.c.obj
[60/177] Building ASM object zephyr/arch/arch/arm/core/aarch32/CMakeFiles/arch__arm__core__aarch32.dir/swap_helper.S.obj
[61/177] Building C object zephyr/arch/arch/arm/core/aarch32/CMakeFiles/arch__arm__core__aarch32.dir/swap.c.obj
[62/177] Building C object zephyr/arch/arch/arm/core/aarch32/CMakeFiles/arch__arm__core__aarch32.dir/prep_c.c.obj
[63/177] Building ASM object zephyr/arch/arch/arm/core/aarch32/CMakeFiles/arch__arm__core__aarch32.dir/isr_wrapper.S.obj
[64/177] Building ASM object zephyr/arch/arch/arm/core/aarch32/CMakeFiles/arch__arm__core__aarch32.dir/userspace.S.obj
[65/177] Building ASM object zephyr/arch/arch/arm/core/aarch32/cortex_m/CMakeFiles/arch__arm__core__aarch32__cortex_m.dir/exc_exit.S.obj
[66/177] Building C object zephyr/arch/arch/arm/core/aarch32/CMakeFiles/arch__arm__core__aarch32.dir/thread.c.obj
[67/177] Building ASM object zephyr/arch/arch/arm/core/aarch32/cortex_m/CMakeFiles/arch__arm__core__aarch32__cortex_m.dir/fault_s.S.obj
[68/177] Linking C static library zephyr/arch/arch/arm/core/aarch32/libarch__arm__core__aarch32.a
[69/177] Building C object zephyr/arch/arch/arm/core/aarch32/cortex_m/CMakeFiles/arch__arm__core__aarch32__cortex_m.dir/irq_init.c.obj
[70/177] Building C object zephyr/arch/arch/arm/core/aarch32/cortex_m/CMakeFiles/arch__arm__core__aarch32__cortex_m.dir/fpu.c.obj
[71/177] Building ASM object zephyr/arch/arch/arm/core/aarch32/cortex_m/CMakeFiles/arch__arm__core__aarch32__cortex_m.dir/reset.S.obj
[72/177] Building C object zephyr/arch/arch/arm/core/aarch32/cortex_m/CMakeFiles/arch__arm__core__aarch32__cortex_m.dir/fault.c.obj
[73/177] Building ASM object zephyr/arch/arch/arm/core/aarch32/cortex_m/CMakeFiles/arch__arm__core__aarch32__cortex_m.dir/vector_table.S.obj
[74/177] Building C object zephyr/arch/arch/arm/core/aarch32/cortex_m/CMakeFiles/arch__arm__core__aarch32__cortex_m.dir/scb.c.obj
[75/177] Building C object zephyr/arch/arch/arm/core/aarch32/cortex_m/CMakeFiles/arch__arm__core__aarch32__cortex_m.dir/thread_abort.c.obj
[76/177] Building C object zephyr/arch/arch/arm/core/aarch32/cortex_m/CMakeFiles/arch__arm__core__aarch32__cortex_m.dir/thread.c.obj
[77/177] Linking C static library zephyr/arch/arch/arm/core/aarch32/cortex_m/libarch__arm__core__aarch32__cortex_m.a
[78/177] Building C object zephyr/arch/arch/arm/core/aarch32/mpu/CMakeFiles/arch__arm__core__aarch32__mpu.dir/arm_core_mpu.c.obj
[79/177] Building C object zephyr/lib/libc/minimal/CMakeFiles/lib__libc__minimal.dir/source/stdlib/atoi.c.obj
[80/177] Building C object zephyr/lib/libc/minimal/CMakeFiles/lib__libc__minimal.dir/source/stdlib/abort.c.obj
[81/177] Building C object zephyr/lib/libc/minimal/CMakeFiles/lib__libc__minimal.dir/source/stdlib/strtol.c.obj
[82/177] Building C object zephyr/lib/libc/minimal/CMakeFiles/lib__libc__minimal.dir/source/stdlib/strtoul.c.obj
[83/177] Building C object zephyr/arch/arch/arm/core/aarch32/mpu/CMakeFiles/arch__arm__core__aarch32__mpu.dir/arm_mpu.c.obj
[84/177] Linking C static library zephyr/arch/arch/arm/core/aarch32/mpu/libarch__arm__core__aarch32__mpu.a
[85/177] Building C object zephyr/lib/libc/minimal/CMakeFiles/lib__libc__minimal.dir/source/stdlib/bsearch.c.obj
[86/177] Building C object zephyr/lib/libc/minimal/CMakeFiles/lib__libc__minimal.dir/source/string/strncasecmp.c.obj
[87/177] Building C object zephyr/lib/libc/minimal/CMakeFiles/lib__libc__minimal.dir/source/string/strstr.c.obj
[88/177] Building C object zephyr/lib/libc/minimal/CMakeFiles/lib__libc__minimal.dir/source/string/string.c.obj
[89/177] Building C object zephyr/lib/libc/minimal/CMakeFiles/lib__libc__minimal.dir/source/string/strspn.c.obj
[90/177] Building C object zephyr/lib/libc/minimal/CMakeFiles/lib__libc__minimal.dir/source/stdlib/exit.c.obj
[91/177] Building C object zephyr/lib/libc/minimal/CMakeFiles/lib__libc__minimal.dir/source/stdlib/malloc.c.obj
[92/177] Building C object zephyr/lib/libc/minimal/CMakeFiles/lib__libc__minimal.dir/source/stdout/sprintf.c.obj
[93/177] Building C object zephyr/lib/libc/minimal/CMakeFiles/lib__libc__minimal.dir/source/stdout/fprintf.c.obj
[94/177] Building C object zephyr/lib/libc/minimal/CMakeFiles/lib__libc__minimal.dir/source/time/gmtime.c.obj
[95/177] Building C object zephyr/lib/libc/minimal/CMakeFiles/lib__libc__minimal.dir/source/stdout/stdout_console.c.obj
[96/177] Linking C static library zephyr/lib/libc/minimal/liblib__libc__minimal.a
[97/177] Building C object zephyr/lib/posix/CMakeFiles/lib__posix.dir/pthread_common.c.obj
[98/177] Building C object zephyr/lib/posix/CMakeFiles/lib__posix.dir/nanosleep.c.obj
[99/177] Linking C static library zephyr/lib/posix/liblib__posix.a
[100/177] Building C object zephyr/subsys/testsuite/ztest/CMakeFiles/subsys__testsuite__ztest.dir/src/ztest.c.obj
[101/177] Building C object zephyr/subsys/testsuite/ztest/CMakeFiles/subsys__testsuite__ztest.dir/src/ztest_error_hook.c.obj
[102/177] Linking C static library zephyr/subsys/testsuite/ztest/libsubsys__testsuite__ztest.a
[103/177] Building C object zephyr/drivers/adc/CMakeFiles/drivers__adc.dir/adc_common.c.obj
[104/177] Building C object zephyr/drivers/adc/CMakeFiles/drivers__adc.dir/adc_handlers.c.obj
[105/177] Building C object zephyr/drivers/gpio/CMakeFiles/drivers__gpio.dir/gpio_stm32.c.obj
[106/177] Building C object zephyr/drivers/adc/CMakeFiles/drivers__adc.dir/adc_stm32.c.obj
FAILED: zephyr/drivers/adc/CMakeFiles/drivers__adc.dir/adc_stm32.c.obj
ccache /opt/toolchains/zephyr-sdk-0.13.0-rc4/arm-zephyr-eabi/bin/arm-zephyr-eabi-gcc -DBUILD_VERSION=zephyr-v2.6.0-1617-g75e9fa827490 -DCORE_CM7 -DHSE_VALUE=8000000 -DKERNEL -DSTM32H743xx -DUSE_FULL_LL_DRIVER -DUSE_HAL_DRIVER -D_FORTIFY_SOURCE=2 -D__PROGRAM_START -D__ZEPHYR_SUPERVISOR__ -D__ZEPHYR__=1 -I../../../../../../../include -Izephyr/include/generated -I../../../../../../../soc/arm/st_stm32/stm32h7 -I../../../../../../../drivers -I../../../../../../../soc/arm/st_stm32/common -I../../../../../../../subsys/testsuite/include -I../../../../../../../subsys/testsuite/ztest/include -I/var/lib/buildkite-agent/zephyr-module-cache/modules/hal/cmsis/CMSIS/Core/Include -I/var/lib/buildkite-agent/zephyr-module-cache/modules/hal/stm32/stm32cube/stm32h7xx/soc -I/var/lib/buildkite-agent/zephyr-module-cache/modules/hal/stm32/stm32cube/stm32h7xx/drivers/include -I/var/lib/buildkite-agent/zephyr-module-cache/modules/hal/stm32/stm32cube/stm32h7xx/drivers/include/Legacy -I/var/lib/buildkite-agent/zephyr-module-cache/modules/hal/stm32/stm32cube/common_ll/include -isystem ../../../../../../../lib/libc/minimal/include -isystem /opt/toolchains/zephyr-sdk-0.13.0-rc4/arm-zephyr-eabi/bin/../lib/gcc/arm-zephyr-eabi/10.3.0/include -isystem /opt/toolchains/zephyr-sdk-0.13.0-rc4/arm-zephyr-eabi/bin/../lib/gcc/arm-zephyr-eabi/10.3.0/include-fixed -Os -imacros /workdir/zephyr/twister-out/nucleo_h743zi/tests/drivers/adc/adc_api/drivers.adc/zephyr/include/generated/autoconf.h -ffreestanding -fno-common -g -gdwarf-4 -fdiagnostics-color=always -mcpu=cortex-m7 -mthumb -mabi=aapcs -imacros /workdir/zephyr/include/toolchain/zephyr_stdint.h -Wall -Wformat -Wformat-security -Wno-format-zero-length -Wno-main -Wno-pointer-sign -Wpointer-arith -Wexpansion-to-defined -Wno-address-of-packed-member -Wno-unused-but-set-variable -Werror=implicit-int -Werror -fno-asynchronous-unwind-tables -fno-pie -fno-pic -fno-strict-overflow -fno-reorder-functions -fno-defer-pop -fmacro-prefix-map=/workdir/zephyr/tests/drivers/adc/adc_api=CMAKE_SOURCE_DIR -fmacro-prefix-map=/workdir/zephyr=ZEPHYR_BASE -fmacro-prefix-map=/workdir=WEST_TOPDIR -ffunction-sections -fdata-sections -std=c99 -nostdinc -MD -MT zephyr/drivers/adc/CMakeFiles/drivers__adc.dir/adc_stm32.c.obj -MF zephyr/drivers/adc/CMakeFiles/drivers__adc.dir/adc_stm32.c.obj.d -o zephyr/drivers/adc/CMakeFiles/drivers__adc.dir/adc_stm32.c.obj -c /workdir/zephyr/drivers/adc/adc_stm32.c
/workdir/zephyr/drivers/adc/adc_stm32.c: In function 'start_read':
/workdir/zephyr/drivers/adc/adc_stm32.c:444:44: error: 'LL_ADC_OVS_RATIO_2' undeclared (first use in this function); did you mean 'LL_ADC_INJ_RANK_2'?
  444 |   LL_ADC_ConfigOverSamplingRatioShift(adc, LL_ADC_OVS_RATIO_2,
      |                                            ^~~~~~~~~~~~~~~~~~
      |                                            LL_ADC_INJ_RANK_2
/workdir/zephyr/drivers/adc/adc_stm32.c:444:44: note: each undeclared identifier is reported only once for each function it appears in
/workdir/zephyr/drivers/adc/adc_stm32.c:449:44: error: 'LL_ADC_OVS_RATIO_4' undeclared (first use in this function); did you mean 'LL_ADC_INJ_RANK_4'?
  449 |   LL_ADC_ConfigOverSamplingRatioShift(adc, LL_ADC_OVS_RATIO_4,
      |                                            ^~~~~~~~~~~~~~~~~~
      |                                            LL_ADC_INJ_RANK_4
/workdir/zephyr/drivers/adc/adc_stm32.c:454:44: error: 'LL_ADC_OVS_RATIO_8' undeclared (first use in this function); did you mean 'LL_ADC_REG_RANK_8'?
  454 |   LL_ADC_ConfigOverSamplingRatioShift(adc, LL_ADC_OVS_RATIO_8,
      |                                            ^~~~~~~~~~~~~~~~~~
      |                                            LL_ADC_REG_RANK_8
/workdir/zephyr/drivers/adc/adc_stm32.c:459:44: error: 'LL_ADC_OVS_RATIO_16' undeclared (first use in this function); did you mean 'LL_ADC_REG_RANK_16'?
  459 |   LL_ADC_ConfigOverSamplingRatioShift(adc, LL_ADC_OVS_RATIO_16,
      |                                            ^~~~~~~~~~~~~~~~~~~
      |                                            LL_ADC_REG_RANK_16
/workdir/zephyr/drivers/adc/adc_stm32.c:464:44: error: 'LL_ADC_OVS_RATIO_32' undeclared (first use in this function)
  464 |   LL_ADC_ConfigOverSamplingRatioShift(adc, LL_ADC_OVS_RATIO_32,
      |                                            ^~~~~~~~~~~~~~~~~~~
/workdir/zephyr/drivers/adc/adc_stm32.c:469:44: error: 'LL_ADC_OVS_RATIO_64' undeclared (first use in this function); did you mean 'LL_ADC_INJ_RANK_4'?
  469 |   LL_ADC_ConfigOverSamplingRatioShift(adc, LL_ADC_OVS_RATIO_64,
      |                                            ^~~~~~~~~~~~~~~~~~~
      |                                            LL_ADC_INJ_RANK_4
/workdir/zephyr/drivers/adc/adc_stm32.c:474:44: error: 'LL_ADC_OVS_RATIO_128' undeclared (first use in this function); did you mean 'LL_ADC_REG_RANK_12'?
  474 |   LL_ADC_ConfigOverSamplingRatioShift(adc, LL_ADC_OVS_RATIO_128,
      |                                            ^~~~~~~~~~~~~~~~~~~~
      |                                            LL_ADC_REG_RANK_12
/workdir/zephyr/drivers/adc/adc_stm32.c:479:44: error: 'LL_ADC_OVS_RATIO_256' undeclared (first use in this function)
  479 |   LL_ADC_ConfigOverSamplingRatioShift(adc, LL_ADC_OVS_RATIO_256,
      |                                            ^~~~~~~~~~~~~~~~~~~~
[107/177] Building C object zephyr/drivers/serial/CMakeFiles/drivers__serial.dir/uart_stm32.c.obj
[108/177] Building C object zephyr/drivers/gpio/CMakeFiles/drivers__gpio.dir/gpio_handlers.c.obj
ninja: build stopped: subcommand failed.

in Job #8fa7601e-30c8-4dce-9d9d-35339c864089

tests/drivers/adc/adc_api/drivers.adc in nucleo_h753zi:tests/drivers/adc/adc_api/drivers.adc
Including boilerplate (Zephyr base): /workdir/zephyr/cmake/app/boilerplate.cmake
-- Application: /workdir/zephyr/tests/drivers/adc/adc_api
-- Zephyr version: 2.6.99 (/workdir/zephyr), build: zephyr-v2.6.0-1617-g75e9fa827490
-- Found Python3: /usr/bin/python3.8 (found suitable exact version "3.8.10") found components: Interpreter
-- Found west (found suitable version "0.11.0", minimum required is "0.7.1")
-- Board: nucleo_h753zi
-- Cache files will be written to: /root/.cache/zephyr
-- Using toolchain: zephyr 0.13.0 (/opt/toolchains/zephyr-sdk-0.13.0-rc4)
-- Found dtc: /opt/toolchains/zephyr-sdk-0.13.0-rc4/sysroots/x86_64-pokysdk-linux/usr/bin/dtc (found suitable version "1.6.0", minimum required is "1.4.6")
-- Found BOARD.dts: /workdir/zephyr/boards/arm/nucleo_h753zi/nucleo_h753zi.dts
-- Generated zephyr.dts: /workdir/zephyr/twister-out/nucleo_h753zi/tests/drivers/adc/adc_api/drivers.adc/zephyr/zephyr.dts
-- Generated devicetree_unfixed.h: /workdir/zephyr/twister-out/nucleo_h753zi/tests/drivers/adc/adc_api/drivers.adc/zephyr/include/generated/devicetree_unfixed.h
-- Generated device_extern.h: /workdir/zephyr/twister-out/nucleo_h753zi/tests/drivers/adc/adc_api/drivers.adc/zephyr/include/generated/device_extern.h
Parsing /workdir/zephyr/Kconfig
Loaded configuration '/workdir/zephyr/boards/arm/nucleo_h753zi/nucleo_h753zi_defconfig'
Merged configuration '/workdir/zephyr/tests/drivers/adc/adc_api/prj.conf'
Configuration saved to '/workdir/zephyr/twister-out/nucleo_h753zi/tests/drivers/adc/adc_api/drivers.adc/zephyr/.config'
Kconfig header saved to '/workdir/zephyr/twister-out/nucleo_h753zi/tests/drivers/adc/adc_api/drivers.adc/zephyr/include/generated/autoconf.h'
-- The C compiler identification is GNU 10.3.0
-- The CXX compiler identification is GNU 10.3.0
-- The ASM compiler identification is GNU
-- Found assembler: /opt/toolchains/zephyr-sdk-0.13.0-rc4/arm-zephyr-eabi/bin/arm-zephyr-eabi-gcc
-- Configuring done
-- Generating done
-- Build files have been written to: /workdir/zephyr/twister-out/nucleo_h753zi/tests/drivers/adc/adc_api/drivers.adc
[1/177] Preparing syscall dependency handling

[2/177] Generating misc/generated/syscalls_subdirs.trigger
[3/177] Generating misc/generated/syscalls.json, misc/generated/struct_tags.json
[4/177] Generating include/generated/kobj-types-enum.h, include/generated/otype-to-str.h, include/generated/otype-to-size.h
[5/177] Generating include/generated/driver-validation.h
[6/177] Generating include/generated/syscall_dispatch.c, include/generated/syscall_list.h
[7/177] Building C object zephyr/CMakeFiles/offsets.dir/arch/arm/core/offsets/offsets.c.obj
[8/177] Generating include/generated/offsets.h
[9/177] Building C object zephyr/CMakeFiles/zephyr.dir/lib/os/cbprintf.c.obj
[10/177] Building C object zephyr/CMakeFiles/zephyr.dir/lib/os/cbprintf_packaged.c.obj
[11/177] Building C object zephyr/CMakeFiles/zephyr.dir/lib/os/crc32c_sw.c.obj
[12/177] Building C object zephyr/CMakeFiles/zephyr.dir/lib/os/crc32_sw.c.obj
[13/177] Building C object zephyr/CMakeFiles/zephyr.dir/lib/os/crc16_sw.c.obj
[14/177] Building C object zephyr/CMakeFiles/zephyr.dir/lib/os/crc8_sw.c.obj
[15/177] Building C object zephyr/CMakeFiles/zephyr.dir/lib/os/crc7_sw.c.obj
[16/177] Building C object CMakeFiles/app.dir/src/main.c.obj
[17/177] Building C object zephyr/CMakeFiles/zephyr.dir/lib/os/dec.c.obj
[18/177] Building C object zephyr/CMakeFiles/zephyr.dir/lib/os/hex.c.obj
[19/177] Building C object CMakeFiles/app.dir/src/test_adc.c.obj
[20/177] Linking C static library app/libapp.a
[21/177] Building C object zephyr/CMakeFiles/zephyr.dir/lib/os/fdtable.c.obj
[22/177] Building C object zephyr/CMakeFiles/zephyr.dir/lib/os/notify.c.obj
[23/177] Building C object zephyr/CMakeFiles/zephyr.dir/lib/os/printk.c.obj
[24/177] Building C object zephyr/CMakeFiles/zephyr.dir/lib/os/onoff.c.obj
[25/177] Building C object zephyr/CMakeFiles/zephyr.dir/lib/os/sem.c.obj
[26/177] Building C object zephyr/CMakeFiles/zephyr.dir/lib/os/rb.c.obj
[27/177] Building C object zephyr/CMakeFiles/zephyr.dir/lib/os/timeutil.c.obj
[28/177] Building C object zephyr/CMakeFiles/zephyr.dir/lib/os/thread_entry.c.obj
[29/177] Building C object zephyr/CMakeFiles/zephyr.dir/lib/os/heap-validate.c.obj
[30/177] Building C object zephyr/CMakeFiles/zephyr.dir/lib/os/heap.c.obj
[31/177] Building C object zephyr/CMakeFiles/zephyr.dir/lib/os/cbprintf_complete.c.obj
[32/177] Building C object zephyr/CMakeFiles/zephyr.dir/lib/os/bitarray.c.obj
[33/177] Building C object zephyr/CMakeFiles/zephyr.dir/lib/os/assert.c.obj
[34/177] Building C object zephyr/CMakeFiles/zephyr.dir/lib/os/mutex.c.obj
[35/177] Building C object zephyr/CMakeFiles/zephyr.dir/misc/generated/configs.c.obj
[36/177] Building C object zephyr/CMakeFiles/zephyr.dir/lib/os/user_work.c.obj
[37/177] Building C object zephyr/CMakeFiles/zephyr.dir/lib/os/mpsc_pbuf.c.obj
[38/177] Building C object zephyr/CMakeFiles/zephyr.dir/soc/arm/st_stm32/stm32h7/mpu_regions.c.obj
[39/177] Building C object zephyr/CMakeFiles/zephyr.dir/soc/arm/st_stm32/stm32h7/soc_m7.c.obj
[40/177] Building C object zephyr/CMakeFiles/zephyr.dir/subsys/logging/log_minimal.c.obj
[41/177] Building C object zephyr/CMakeFiles/zephyr.dir/soc/arm/st_stm32/common/stm32cube_hal.c.obj
[42/177] Building C object zephyr/CMakeFiles/zephyr.dir/soc/arm/st_stm32/common/soc_config.c.obj
[43/177] Building C object zephyr/CMakeFiles/zephyr.dir/subsys/tracing/tracing_none.c.obj
[44/177] Building C object zephyr/CMakeFiles/zephyr.dir/drivers/console/uart_console.c.obj
[45/177] Building C object zephyr/CMakeFiles/zephyr.dir/drivers/interrupt_controller/intc_exti_stm32.c.obj
[46/177] Building C object zephyr/CMakeFiles/zephyr.dir/drivers/clock_control/clock_stm32_ll_h7.c.obj
[47/177] Building C object zephyr/CMakeFiles/zephyr.dir/drivers/pinmux/pinmux_stm32.c.obj
[48/177] Building C object zephyr/CMakeFiles/zephyr.dir/drivers/timer/sys_clock_init.c.obj
[49/177] Building C object zephyr/arch/common/CMakeFiles/isr_tables.dir/isr_tables.c.obj
[50/177] Linking C static library zephyr/arch/common/libisr_tables.a
[51/177] Building ASM object zephyr/arch/arch/arm/core/aarch32/CMakeFiles/arch__arm__core__aarch32.dir/cpu_idle.S.obj
[52/177] Building C object zephyr/CMakeFiles/zephyr.dir/drivers/timer/cortex_m_systick.c.obj
[53/177] Linking C static library zephyr/libzephyr.a
[54/177] Building C object zephyr/arch/common/CMakeFiles/arch__common.dir/sw_isr_common.c.obj
[55/177] Linking C static library zephyr/arch/common/libarch__common.a
[56/177] Building C object zephyr/arch/arch/arm/core/aarch32/CMakeFiles/arch__arm__core__aarch32.dir/fatal.c.obj
[57/177] Building C object zephyr/arch/arch/arm/core/aarch32/CMakeFiles/arch__arm__core__aarch32.dir/irq_manage.c.obj
[58/177] Building ASM object zephyr/arch/arch/arm/core/aarch32/CMakeFiles/arch__arm__core__aarch32.dir/nmi_on_reset.S.obj
[59/177] Building C object zephyr/arch/arch/arm/core/aarch32/CMakeFiles/arch__arm__core__aarch32.dir/nmi.c.obj
[60/177] Building ASM object zephyr/arch/arch/arm/core/aarch32/CMakeFiles/arch__arm__core__aarch32.dir/swap_helper.S.obj
[61/177] Building C object zephyr/arch/arch/arm/core/aarch32/CMakeFiles/arch__arm__core__aarch32.dir/prep_c.c.obj
[62/177] Building C object zephyr/arch/arch/arm/core/aarch32/CMakeFiles/arch__arm__core__aarch32.dir/swap.c.obj
[63/177] Building ASM object zephyr/arch/arch/arm/core/aarch32/CMakeFiles/arch__arm__core__aarch32.dir/isr_wrapper.S.obj
[64/177] Building ASM object zephyr/arch/arch/arm/core/aarch32/CMakeFiles/arch__arm__core__aarch32.dir/userspace.S.obj
[65/177] Building C object zephyr/arch/arch/arm/core/aarch32/CMakeFiles/arch__arm__core__aarch32.dir/thread.c.obj
[66/177] Linking C static library zephyr/arch/arch/arm/core/aarch32/libarch__arm__core__aarch32.a
[67/177] Building ASM object zephyr/arch/arch/arm/core/aarch32/cortex_m/CMakeFiles/arch__arm__core__aarch32__cortex_m.dir/fault_s.S.obj
[68/177] Building ASM object zephyr/arch/arch/arm/core/aarch32/cortex_m/CMakeFiles/arch__arm__core__aarch32__cortex_m.dir/exc_exit.S.obj
[69/177] Building C object zephyr/arch/arch/arm/core/aarch32/cortex_m/CMakeFiles/arch__arm__core__aarch32__cortex_m.dir/fpu.c.obj
[70/177] Building C object zephyr/arch/arch/arm/core/aarch32/cortex_m/CMakeFiles/arch__arm__core__aarch32__cortex_m.dir/irq_init.c.obj
[71/177] Building ASM object zephyr/arch/arch/arm/core/aarch32/cortex_m/CMakeFiles/arch__arm__core__aarch32__cortex_m.dir/reset.S.obj
[72/177] Building C object zephyr/arch/arch/arm/core/aarch32/cortex_m/CMakeFiles/arch__arm__core__aarch32__cortex_m.dir/fault.c.obj
[73/177] Building ASM object zephyr/arch/arch/arm/core/aarch32/cortex_m/CMakeFiles/arch__arm__core__aarch32__cortex_m.dir/vector_table.S.obj
[74/177] Building C object zephyr/arch/arch/arm/core/aarch32/cortex_m/CMakeFiles/arch__arm__core__aarch32__cortex_m.dir/scb.c.obj
[75/177] Building C object zephyr/arch/arch/arm/core/aarch32/cortex_m/CMakeFiles/arch__arm__core__aarch32__cortex_m.dir/thread_abort.c.obj
[76/177] Building C object zephyr/arch/arch/arm/core/aarch32/cortex_m/CMakeFiles/arch__arm__core__aarch32__cortex_m.dir/thread.c.obj
[77/177] Linking C static library zephyr/arch/arch/arm/core/aarch32/cortex_m/libarch__arm__core__aarch32__cortex_m.a
[78/177] Building C object zephyr/arch/arch/arm/core/aarch32/mpu/CMakeFiles/arch__arm__core__aarch32__mpu.dir/arm_core_mpu.c.obj
[79/177] Building C object zephyr/lib/libc/minimal/CMakeFiles/lib__libc__minimal.dir/source/stdlib/atoi.c.obj
[80/177] Building C object zephyr/lib/libc/minimal/CMakeFiles/lib__libc__minimal.dir/source/stdlib/abort.c.obj
[81/177] Building C object zephyr/lib/libc/minimal/CMakeFiles/lib__libc__minimal.dir/source/stdlib/strtol.c.obj
[82/177] Building C object zephyr/lib/libc/minimal/CMakeFiles/lib__libc__minimal.dir/source/stdlib/strtoul.c.obj
[83/177] Building C object zephyr/lib/libc/minimal/CMakeFiles/lib__libc__minimal.dir/source/stdlib/bsearch.c.obj
[84/177] Building C object zephyr/arch/arch/arm/core/aarch32/mpu/CMakeFiles/arch__arm__core__aarch32__mpu.dir/arm_mpu.c.obj
[85/177] Linking C static library zephyr/arch/arch/arm/core/aarch32/mpu/libarch__arm__core__aarch32__mpu.a
[86/177] Building C object zephyr/lib/libc/minimal/CMakeFiles/lib__libc__minimal.dir/source/string/strncasecmp.c.obj
[87/177] Building C object zephyr/lib/libc/minimal/CMakeFiles/lib__libc__minimal.dir/source/string/strstr.c.obj
[88/177] Building C object zephyr/lib/libc/minimal/CMakeFiles/lib__libc__minimal.dir/source/string/string.c.obj
[89/177] Building C object zephyr/lib/libc/minimal/CMakeFiles/lib__libc__minimal.dir/source/string/strspn.c.obj
[90/177] Building C object zephyr/lib/libc/minimal/CMakeFiles/lib__libc__minimal.dir/source/stdlib/malloc.c.obj
[91/177] Building C object zephyr/lib/libc/minimal/CMakeFiles/lib__libc__minimal.dir/source/stdlib/exit.c.obj
[92/177] Building C object zephyr/lib/libc/minimal/CMakeFiles/lib__libc__minimal.dir/source/stdout/sprintf.c.obj
[93/177] Building C object zephyr/lib/libc/minimal/CMakeFiles/lib__libc__minimal.dir/source/stdout/fprintf.c.obj
[94/177] Building C object zephyr/lib/libc/minimal/CMakeFiles/lib__libc__minimal.dir/source/time/gmtime.c.obj
[95/177] Building C object zephyr/lib/libc/minimal/CMakeFiles/lib__libc__minimal.dir/source/stdout/stdout_console.c.obj
[96/177] Linking C static library zephyr/lib/libc/minimal/liblib__libc__minimal.a
[97/177] Building C object zephyr/lib/posix/CMakeFiles/lib__posix.dir/pthread_common.c.obj
[98/177] Building C object zephyr/lib/posix/CMakeFiles/lib__posix.dir/nanosleep.c.obj
[99/177] Linking C static library zephyr/lib/posix/liblib__posix.a
[100/177] Building C object zephyr/subsys/testsuite/ztest/CMakeFiles/subsys__testsuite__ztest.dir/src/ztest.c.obj
[101/177] Building C object zephyr/subsys/testsuite/ztest/CMakeFiles/subsys__testsuite__ztest.dir/src/ztest_error_hook.c.obj
[102/177] Linking C static library zephyr/subsys/testsuite/ztest/libsubsys__testsuite__ztest.a
[103/177] Building C object zephyr/drivers/adc/CMakeFiles/drivers__adc.dir/adc_common.c.obj
[104/177] Building C object zephyr/drivers/adc/CMakeFiles/drivers__adc.dir/adc_handlers.c.obj
[105/177] Building C object zephyr/drivers/gpio/CMakeFiles/drivers__gpio.dir/gpio_stm32.c.obj
[106/177] Building C object zephyr/drivers/adc/CMakeFiles/drivers__adc.dir/adc_stm32.c.obj
FAILED: zephyr/drivers/adc/CMakeFiles/drivers__adc.dir/adc_stm32.c.obj
ccache /opt/toolchains/zephyr-sdk-0.13.0-rc4/arm-zephyr-eabi/bin/arm-zephyr-eabi-gcc -DBUILD_VERSION=zephyr-v2.6.0-1617-g75e9fa827490 -DCORE_CM7 -DHSE_VALUE=8000000 -DKERNEL -DSTM32H753xx -DUSE_FULL_LL_DRIVER -DUSE_HAL_DRIVER -D_FORTIFY_SOURCE=2 -D__PROGRAM_START -D__ZEPHYR_SUPERVISOR__ -D__ZEPHYR__=1 -I../../../../../../../include -Izephyr/include/generated -I../../../../../../../soc/arm/st_stm32/stm32h7 -I../../../../../../../drivers -I../../../../../../../soc/arm/st_stm32/common -I../../../../../../../subsys/testsuite/include -I../../../../../../../subsys/testsuite/ztest/include -I/var/lib/buildkite-agent/zephyr-module-cache/modules/hal/cmsis/CMSIS/Core/Include -I/var/lib/buildkite-agent/zephyr-module-cache/modules/hal/stm32/stm32cube/stm32h7xx/soc -I/var/lib/buildkite-agent/zephyr-module-cache/modules/hal/stm32/stm32cube/stm32h7xx/drivers/include -I/var/lib/buildkite-agent/zephyr-module-cache/modules/hal/stm32/stm32cube/stm32h7xx/drivers/include/Legacy -I/var/lib/buildkite-agent/zephyr-module-cache/modules/hal/stm32/stm32cube/common_ll/include -isystem ../../../../../../../lib/libc/minimal/include -isystem /opt/toolchains/zephyr-sdk-0.13.0-rc4/arm-zephyr-eabi/bin/../lib/gcc/arm-zephyr-eabi/10.3.0/include -isystem /opt/toolchains/zephyr-sdk-0.13.0-rc4/arm-zephyr-eabi/bin/../lib/gcc/arm-zephyr-eabi/10.3.0/include-fixed -Os -imacros /workdir/zephyr/twister-out/nucleo_h753zi/tests/drivers/adc/adc_api/drivers.adc/zephyr/include/generated/autoconf.h -ffreestanding -fno-common -g -gdwarf-4 -fdiagnostics-color=always -mcpu=cortex-m7 -mthumb -mabi=aapcs -imacros /workdir/zephyr/include/toolchain/zephyr_stdint.h -Wall -Wformat -Wformat-security -Wno-format-zero-length -Wno-main -Wno-pointer-sign -Wpointer-arith -Wexpansion-to-defined -Wno-address-of-packed-member -Wno-unused-but-set-variable -Werror=implicit-int -Werror -fno-asynchronous-unwind-tables -fno-pie -fno-pic -fno-strict-overflow -fno-reorder-functions -fno-defer-pop -fmacro-prefix-map=/workdir/zephyr/tests/drivers/adc/adc_api=CMAKE_SOURCE_DIR -fmacro-prefix-map=/workdir/zephyr=ZEPHYR_BASE -fmacro-prefix-map=/workdir=WEST_TOPDIR -ffunction-sections -fdata-sections -std=c99 -nostdinc -MD -MT zephyr/drivers/adc/CMakeFiles/drivers__adc.dir/adc_stm32.c.obj -MF zephyr/drivers/adc/CMakeFiles/drivers__adc.dir/adc_stm32.c.obj.d -o zephyr/drivers/adc/CMakeFiles/drivers__adc.dir/adc_stm32.c.obj -c /workdir/zephyr/drivers/adc/adc_stm32.c
/workdir/zephyr/drivers/adc/adc_stm32.c: In function 'start_read':
/workdir/zephyr/drivers/adc/adc_stm32.c:444:44: error: 'LL_ADC_OVS_RATIO_2' undeclared (first use in this function); did you mean 'LL_ADC_INJ_RANK_2'?
  444 |   LL_ADC_ConfigOverSamplingRatioShift(adc, LL_ADC_OVS_RATIO_2,
      |                                            ^~~~~~~~~~~~~~~~~~
      |                                            LL_ADC_INJ_RANK_2
/workdir/zephyr/drivers/adc/adc_stm32.c:444:44: note: each undeclared identifier is reported only once for each function it appears in
/workdir/zephyr/drivers/adc/adc_stm32.c:449:44: error: 'LL_ADC_OVS_RATIO_4' undeclared (first use in this function); did you mean 'LL_ADC_INJ_RANK_4'?
  449 |   LL_ADC_ConfigOverSamplingRatioShift(adc, LL_ADC_OVS_RATIO_4,
      |                                            ^~~~~~~~~~~~~~~~~~
      |                                            LL_ADC_INJ_RANK_4
/workdir/zephyr/drivers/adc/adc_stm32.c:454:44: error: 'LL_ADC_OVS_RATIO_8' undeclared (first use in this function); did you mean 'LL_ADC_REG_RANK_8'?
  454 |   LL_ADC_ConfigOverSamplingRatioShift(adc, LL_ADC_OVS_RATIO_8,
      |                                            ^~~~~~~~~~~~~~~~~~
      |                                            LL_ADC_REG_RANK_8
/workdir/zephyr/drivers/adc/adc_stm32.c:459:44: error: 'LL_ADC_OVS_RATIO_16' undeclared (first use in this function); did you mean 'LL_ADC_REG_RANK_16'?
  459 |   LL_ADC_ConfigOverSamplingRatioShift(adc, LL_ADC_OVS_RATIO_16,
      |                                            ^~~~~~~~~~~~~~~~~~~
      |                                            LL_ADC_REG_RANK_16
/workdir/zephyr/drivers/adc/adc_stm32.c:464:44: error: 'LL_ADC_OVS_RATIO_32' undeclared (first use in this function)
  464 |   LL_ADC_ConfigOverSamplingRatioShift(adc, LL_ADC_OVS_RATIO_32,
      |                                            ^~~~~~~~~~~~~~~~~~~
/workdir/zephyr/drivers/adc/adc_stm32.c:469:44: error: 'LL_ADC_OVS_RATIO_64' undeclared (first use in this function); did you mean 'LL_ADC_INJ_RANK_4'?
  469 |   LL_ADC_ConfigOverSamplingRatioShift(adc, LL_ADC_OVS_RATIO_64,
      |                                            ^~~~~~~~~~~~~~~~~~~
      |                                            LL_ADC_INJ_RANK_4
/workdir/zephyr/drivers/adc/adc_stm32.c:474:44: error: 'LL_ADC_OVS_RATIO_128' undeclared (first use in this function); did you mean 'LL_ADC_REG_RANK_12'?
  474 |   LL_ADC_ConfigOverSamplingRatioShift(adc, LL_ADC_OVS_RATIO_128,
      |                                            ^~~~~~~~~~~~~~~~~~~~
      |                                            LL_ADC_REG_RANK_12
/workdir/zephyr/drivers/adc/adc_stm32.c:479:44: error: 'LL_ADC_OVS_RATIO_256' undeclared (first use in this function)
  479 |   LL_ADC_ConfigOverSamplingRatioShift(adc, LL_ADC_OVS_RATIO_256,
      |                                            ^~~~~~~~~~~~~~~~~~~~
[107/177] Building C object zephyr/drivers/serial/CMakeFiles/drivers__serial.dir/uart_stm32.c.obj
[108/177] Building C object zephyr/drivers/gpio/CMakeFiles/drivers__gpio.dir/gpio_handlers.c.obj
ninja: build stopped: subcommand failed.

in Job #8fdd1e37-6c02-44ee-9606-4a1423088fe7

tests/drivers/build_all/modem/drivers.modem.build in native_posix_64:tests/drivers/build_all/modem/drivers.modem
Including boilerplate (Zephyr base): /workdir/zephyr/cmake/app/boilerplate.cmake
-- Application: /workdir/zephyr/tests/drivers/build_all/modem
-- Zephyr version: 2.6.99 (/workdir/zephyr), build: zephyr-v2.6.0-1617-g75e9fa827490
-- Found Python3: /usr/bin/python3.8 (found suitable exact version "3.8.10") found components: Interpreter
-- Found west (found suitable version "0.11.0", minimum required is "0.7.1")
-- Board: native_posix_64
-- Cache files will be written to: /root/.cache/zephyr
-- Using toolchain: zephyr 0.13.0 (/opt/toolchains/zephyr-sdk-0.13.0-rc4)
-- Found dtc: /opt/toolchains/zephyr-sdk-0.13.0-rc4/sysroots/x86_64-pokysdk-linux/usr/bin/dtc (found suitable version "1.6.0", minimum required is "1.4.6")
-- Found toolchain: host (gcc/ld)
-- Found BOARD.dts: /workdir/zephyr/boards/posix/native_posix/native_posix_64.dts
-- Found devicetree overlay: /workdir/zephyr/tests/drivers/build_all/modem/app.overlay
-- Generated zephyr.dts: /workdir/zephyr/twister-out/native_posix_64/tests/drivers/build_all/modem/drivers.modem.build/zephyr/zephyr.dts
-- Generated devicetree_unfixed.h: /workdir/zephyr/twister-out/native_posix_64/tests/drivers/build_all/modem/drivers.modem.build/zephyr/include/generated/devicetree_unfixed.h
-- Generated device_extern.h: /workdir/zephyr/twister-out/native_posix_64/tests/drivers/build_all/modem/drivers.modem.build/zephyr/include/generated/device_extern.h
Parsing /workdir/zephyr/tests/drivers/build_all/modem/Kconfig
Loaded configuration '/workdir/zephyr/boards/posix/native_posix/native_posix_64_defconfig'
Merged configuration 'modem.conf'
Configuration saved to '/workdir/zephyr/twister-out/native_posix_64/tests/drivers/build_all/modem/drivers.modem.build/zephyr/.config'
Kconfig header saved to '/workdir/zephyr/twister-out/native_posix_64/tests/drivers/build_all/modem/drivers.modem.build/zephyr/include/generated/autoconf.h'

warning: TEST_RANDOM_GENERATOR (defined at subsys/random/Kconfig:8) was assigned the value 'y' but
got the value 'n'. Check these unsatisfied dependencies: (!ENTROPY_HAS_DRIVER) (=n). See
http://docs.zephyrproject.org/latest/reference/kconfig/CONFIG_TEST_RANDOM_GENERATOR.html and/or look
up TEST_RANDOM_GENERATOR in the menuconfig/guiconfig interface. The Application Development Primer,
Setting Configuration Values, and Kconfig - Tips and Best Practices sections of the manual might be
helpful too.

-- The C compiler identification is GNU 9.3.0
-- The CXX compiler identification is GNU 9.3.0
-- The ASM compiler identification is GNU
-- Found assembler: /usr/bin/gcc
CMake Warning at ../../../../CMakeLists.txt:718 (message):
  No SOURCES given to Zephyr library: drivers__gpio

  Excluding target from build.


-- Configuring done
-- Generating done
-- Build files have been written to: /workdir/zephyr/twister-out/native_posix_64/tests/drivers/build_all/modem/drivers.modem.build
[1/153] Preparing syscall dependency handling

[2/153] Generating misc/generated/syscalls_subdirs.trigger
[3/153] Generating misc/generated/syscalls.json, misc/generated/struct_tags.json
[4/153] Generating include/generated/driver-validation.h
[5/153] Generating include/generated/syscall_dispatch.c, include/generated/syscall_list.h
[6/153] Generating include/generated/kobj-types-enum.h, include/generated/otype-to-str.h, include/generated/otype-to-size.h
[7/153] Building C object zephyr/CMakeFiles/offsets.dir/arch/posix/core/offsets/offsets.c.obj
[8/153] Generating include/generated/offsets.h
[9/153] Building C object zephyr/CMakeFiles/zephyr.dir/lib/os/cbprintf.c.obj
[10/153] Building C object zephyr/CMakeFiles/zephyr.dir/lib/os/crc32c_sw.c.obj
[11/153] Building C object CMakeFiles/app.dir/src/main.c.obj
[12/153] Linking C static library app/libapp.a
[13/153] Building C object zephyr/CMakeFiles/zephyr.dir/lib/os/crc32_sw.c.obj
[14/153] Building C object zephyr/CMakeFiles/zephyr.dir/lib/os/cbprintf_packaged.c.obj
[15/153] Building C object zephyr/CMakeFiles/zephyr.dir/lib/os/crc16_sw.c.obj
[16/153] Building C object zephyr/CMakeFiles/zephyr.dir/lib/os/crc8_sw.c.obj
[17/153] Building C object zephyr/CMakeFiles/zephyr.dir/lib/os/crc7_sw.c.obj
[18/153] Building C object zephyr/CMakeFiles/zephyr.dir/lib/os/dec.c.obj
[19/153] Building C object zephyr/CMakeFiles/zephyr.dir/lib/os/hex.c.obj
[20/153] Building C object zephyr/CMakeFiles/zephyr.dir/lib/os/notify.c.obj
[21/153] Building C object zephyr/CMakeFiles/zephyr.dir/lib/os/fdtable.c.obj
[22/153] Building C object zephyr/CMakeFiles/zephyr.dir/lib/os/printk.c.obj
[23/153] Building C object zephyr/CMakeFiles/zephyr.dir/lib/os/sem.c.obj
[24/153] Building C object zephyr/CMakeFiles/zephyr.dir/lib/os/thread_entry.c.obj
[25/153] Building C object zephyr/CMakeFiles/zephyr.dir/lib/os/rb.c.obj
[26/153] Building C object zephyr/CMakeFiles/zephyr.dir/lib/os/onoff.c.obj
[27/153] Building C object zephyr/CMakeFiles/zephyr.dir/lib/os/timeutil.c.obj
[28/153] Building C object zephyr/CMakeFiles/zephyr.dir/lib/os/heap.c.obj
[29/153] Building C object zephyr/CMakeFiles/zephyr.dir/lib/os/heap-validate.c.obj
[30/153] Building C object zephyr/CMakeFiles/zephyr.dir/lib/os/bitarray.c.obj
[31/153] Building C object zephyr/CMakeFiles/zephyr.dir/lib/os/assert.c.obj
[32/153] Building C object zephyr/CMakeFiles/zephyr.dir/lib/os/ring_buffer.c.obj
[33/153] Building C object zephyr/CMakeFiles/zephyr.dir/misc/generated/configs.c.obj
[34/153] Building C object zephyr/CMakeFiles/zephyr.dir/lib/os/cbprintf_complete.c.obj
[35/153] Building C object zephyr/CMakeFiles/zephyr.dir/subsys/net/lib/utils/addr_utils.c.obj
[36/153] Building C object zephyr/CMakeFiles/zephyr.dir/subsys/logging/log_minimal.c.obj
[37/153] Building C object zephyr/CMakeFiles/zephyr.dir/subsys/tracing/tracing_none.c.obj
[38/153] Building C object zephyr/CMakeFiles/zephyr.dir/lib/os/mpsc_pbuf.c.obj
[39/153] Building C object zephyr/CMakeFiles/zephyr.dir/drivers/console/uart_console.c.obj
[40/153] Building C object zephyr/CMakeFiles/zephyr.dir/drivers/console/native_posix_console.c.obj
[41/153] Building C object zephyr/CMakeFiles/zephyr.dir/drivers/modem/modem_context.c.obj
[42/153] Building C object zephyr/CMakeFiles/zephyr.dir/drivers/modem/modem_receiver.c.obj
[43/153] Building C object zephyr/CMakeFiles/zephyr.dir/drivers/modem/modem_pin.c.obj
[44/153] Building C object zephyr/CMakeFiles/zephyr.dir/drivers/modem/modem_iface_uart.c.obj
[45/153] Building C object zephyr/CMakeFiles/zephyr.dir/drivers/modem/modem_cmd_handler.c.obj
FAILED: zephyr/CMakeFiles/zephyr.dir/drivers/modem/modem_cmd_handler.c.obj
ccache /usr/bin/gcc -DBUILD_VERSION=zephyr-v2.6.0-1617-g75e9fa827490 -DKERNEL -D_FORTIFY_SOURCE=2 -D_POSIX_C_SOURCE=200809 -D_XOPEN_SOURCE=600 -D_XOPEN_SOURCE_EXTENDED -D__ZEPHYR__=1 -I../../../../../../../kernel/include -I../../../../../../../arch/posix/include -I../../../../../../../subsys/net/ip -I../../../../../../../include -Izephyr/include/generated -I../../../../../../../soc/posix/inf_clock -I../../../../../../../boards/posix/native_posix -I../../../../../../../subsys/testsuite/include -I../../../../../../../subsys/net/l2 -Os -imacros /workdir/zephyr/twister-out/native_posix_64/tests/drivers/build_all/modem/drivers.modem.build/zephyr/include/generated/autoconf.h -ffreestanding -fno-common -g -gdwarf-4 -fdiagnostics-color=always -imacros /workdir/zephyr/include/toolchain/zephyr_stdint.h -Wall -Wformat -Wformat-security -Wno-format-zero-length -Wno-main -Wno-pointer-sign -Wpointer-arith -Wexpansion-to-defined -Wno-address-of-packed-member -Wno-unused-but-set-variable -Werror=implicit-int -Werror -fno-asynchronous-unwind-tables -fno-pie -fno-pic -fno-strict-overflow -fno-reorder-functions -fno-defer-pop -fmacro-prefix-map=/workdir/zephyr/tests/drivers/build_all/modem=CMAKE_SOURCE_DIR -fmacro-prefix-map=/workdir/zephyr=ZEPHYR_BASE -fmacro-prefix-map=/workdir=WEST_TOPDIR -ffunction-sections -fdata-sections -m64 -fPIC -include /workdir/zephyr/arch/posix/include/posix_cheats.h -fno-freestanding -std=c11 -MD -MT zephyr/CMakeFiles/zephyr.dir/drivers/modem/modem_cmd_handler.c.obj -MF zephyr/CMakeFiles/zephyr.dir/drivers/modem/modem_cmd_handler.c.obj.d -o zephyr/CMakeFiles/zephyr.dir/drivers/modem/modem_cmd_handler.c.obj -c /workdir/zephyr/drivers/modem/modem_cmd_handler.c
/workdir/zephyr/drivers/modem/modem_cmd_handler.c: In function modem_cmd_send_ext:
/workdir/zephyr/drivers/modem/modem_cmd_handler.c:545:9: error: ret may be used uninitialized in this function [-Werror=maybe-uninitialized]
  545 |  return ret;
      |         ^~~
cc1: all warnings being treated as errors
[46/153] Building C object zephyr/CMakeFiles/zephyr.dir/drivers/modem/gsm_ppp.c.obj
[47/153] Building C object zephyr/CMakeFiles/zephyr.dir/drivers/modem/wncm14a2a.c.obj
ninja: build stopped: subcommand failed.

in Job #e88849c4-e870-47e7-946c-95df456eb566

tests/drivers/build_all/modem/drivers.modem.quectel_bg9x.build in native_posix_64:tests/drivers/build_all/modem/drivers.modem
Including boilerplate (Zephyr base): /workdir/zephyr/cmake/app/boilerplate.cmake
-- Application: /workdir/zephyr/tests/drivers/build_all/modem
-- Zephyr version: 2.6.99 (/workdir/zephyr), build: zephyr-v2.6.0-1617-g75e9fa827490
-- Found Python3: /usr/bin/python3.8 (found suitable exact version "3.8.10") found components: Interpreter
-- Found west (found suitable version "0.11.0", minimum required is "0.7.1")
-- Board: native_posix_64
-- Cache files will be written to: /root/.cache/zephyr
-- Using toolchain: zephyr 0.13.0 (/opt/toolchains/zephyr-sdk-0.13.0-rc4)
-- Found dtc: /opt/toolchains/zephyr-sdk-0.13.0-rc4/sysroots/x86_64-pokysdk-linux/usr/bin/dtc (found suitable version "1.6.0", minimum required is "1.4.6")
-- Found toolchain: host (gcc/ld)
-- Found BOARD.dts: /workdir/zephyr/boards/posix/native_posix/native_posix_64.dts
-- Found devicetree overlay: /workdir/zephyr/tests/drivers/build_all/modem/app.overlay
-- Generated zephyr.dts: /workdir/zephyr/twister-out/native_posix_64/tests/drivers/build_all/modem/drivers.modem.quectel_bg9x.build/zephyr/zephyr.dts
-- Generated devicetree_unfixed.h: /workdir/zephyr/twister-out/native_posix_64/tests/drivers/build_all/modem/drivers.modem.quectel_bg9x.build/zephyr/include/generated/devicetree_unfixed.h
-- Generated device_extern.h: /workdir/zephyr/twister-out/native_posix_64/tests/drivers/build_all/modem/drivers.modem.quectel_bg9x.build/zephyr/include/generated/device_extern.h

warning: TEST_RANDOM_GENERATOR (defined at subsys/random/Kconfig:8) was assigned the value 'y' but
got the value 'n'. Check these unsatisfied dependencies: (!ENTROPY_HAS_DRIVER) (=n). See
http://docs.zephyrproject.org/latest/reference/kconfig/CONFIG_TEST_RANDOM_GENERATOR.html and/or look
up TEST_RANDOM_GENERATOR in the menuconfig/guiconfig interface. The Application Development Primer,
Setting Configuration Values, and Kconfig - Tips and Best Practices sections of the manual might be
helpful too.

Parsing /workdir/zephyr/tests/drivers/build_all/modem/Kconfig
Loaded configuration '/workdir/zephyr/boards/posix/native_posix/native_posix_64_defconfig'
Merged configuration 'modem_quectel_bg9x.conf'
Configuration saved to '/workdir/zephyr/twister-out/native_posix_64/tests/drivers/build_all/modem/drivers.modem.quectel_bg9x.build/zephyr/.config'
Kconfig header saved to '/workdir/zephyr/twister-out/native_posix_64/tests/drivers/build_all/modem/drivers.modem.quectel_bg9x.build/zephyr/include/generated/autoconf.h'
-- The C compiler identification is GNU 9.3.0
-- The CXX compiler identification is GNU 9.3.0
-- The ASM compiler identification is GNU
-- Found assembler: /usr/bin/gcc
CMake Warning at ../../../../CMakeLists.txt:718 (message):
  No SOURCES given to Zephyr library: drivers__gpio

  Excluding target from build.


-- Configuring done
-- Generating done
-- Build files have been written to: /workdir/zephyr/twister-out/native_posix_64/tests/drivers/build_all/modem/drivers.modem.quectel_bg9x.build
[1/138] Preparing syscall dependency handling

[2/138] Generating misc/generated/syscalls_subdirs.trigger
[3/138] Generating misc/generated/syscalls.json, misc/generated/struct_tags.json
[4/138] Generating include/generated/syscall_dispatch.c, include/generated/syscall_list.h
[5/138] Generating include/generated/driver-validation.h
[6/138] Generating include/generated/kobj-types-enum.h, include/generated/otype-to-str.h, include/generated/otype-to-size.h
[7/138] Building C object zephyr/CMakeFiles/offsets.dir/arch/posix/core/offsets/offsets.c.obj
[8/138] Generating include/generated/offsets.h
[9/138] Building C object zephyr/CMakeFiles/zephyr.dir/lib/os/cbprintf.c.obj
[10/138] Building C object zephyr/arch/arch/posix/core/CMakeFiles/arch__posix__core.dir/cpuhalt.c.obj
[11/138] Building C object CMakeFiles/app.dir/src/main.c.obj
[12/138] Linking C static library app/libapp.a
[13/138] Building C object zephyr/CMakeFiles/zephyr.dir/lib/os/crc32c_sw.c.obj
[14/138] Building C object zephyr/CMakeFiles/zephyr.dir/lib/os/crc32_sw.c.obj
[15/138] Building C object zephyr/CMakeFiles/zephyr.dir/lib/os/cbprintf_packaged.c.obj
[16/138] Building C object zephyr/CMakeFiles/zephyr.dir/lib/os/crc8_sw.c.obj
[17/138] Building C object zephyr/CMakeFiles/zephyr.dir/lib/os/crc16_sw.c.obj
[18/138] Building C object zephyr/CMakeFiles/zephyr.dir/lib/os/crc7_sw.c.obj
[19/138] Building C object zephyr/CMakeFiles/zephyr.dir/lib/os/dec.c.obj
[20/138] Building C object zephyr/CMakeFiles/zephyr.dir/lib/os/hex.c.obj
[21/138] Building C object zephyr/CMakeFiles/zephyr.dir/lib/os/notify.c.obj
[22/138] Building C object zephyr/CMakeFiles/zephyr.dir/lib/os/fdtable.c.obj
[23/138] Building C object zephyr/CMakeFiles/zephyr.dir/lib/os/printk.c.obj
[24/138] Building C object zephyr/CMakeFiles/zephyr.dir/lib/os/sem.c.obj
[25/138] Building C object zephyr/CMakeFiles/zephyr.dir/lib/os/thread_entry.c.obj
[26/138] Building C object zephyr/CMakeFiles/zephyr.dir/lib/os/rb.c.obj
[27/138] Building C object zephyr/CMakeFiles/zephyr.dir/lib/os/onoff.c.obj
[28/138] Building C object zephyr/CMakeFiles/zephyr.dir/lib/os/timeutil.c.obj
[29/138] Building C object zephyr/CMakeFiles/zephyr.dir/lib/os/heap-validate.c.obj
[30/138] Building C object zephyr/CMakeFiles/zephyr.dir/lib/os/heap.c.obj
[31/138] Building C object zephyr/CMakeFiles/zephyr.dir/lib/os/bitarray.c.obj
[32/138] Building C object zephyr/CMakeFiles/zephyr.dir/lib/os/assert.c.obj
[33/138] Building C object zephyr/CMakeFiles/zephyr.dir/lib/os/ring_buffer.c.obj
[34/138] Building C object zephyr/CMakeFiles/zephyr.dir/lib/os/cbprintf_complete.c.obj
[35/138] Building C object zephyr/CMakeFiles/zephyr.dir/misc/generated/configs.c.obj
[36/138] Building C object zephyr/CMakeFiles/zephyr.dir/subsys/logging/log_minimal.c.obj
[37/138] Building C object zephyr/CMakeFiles/zephyr.dir/lib/os/mpsc_pbuf.c.obj
[38/138] Building C object zephyr/CMakeFiles/zephyr.dir/subsys/net/lib/utils/addr_utils.c.obj
[39/138] Building C object zephyr/CMakeFiles/zephyr.dir/subsys/net/lib/sockets/getaddrinfo.c.obj
[40/138] Building C object zephyr/CMakeFiles/zephyr.dir/subsys/net/lib/sockets/sockets_select.c.obj
[41/138] Building C object zephyr/CMakeFiles/zephyr.dir/subsys/net/lib/sockets/socket_offload.c.obj
[42/138] Building C object zephyr/CMakeFiles/zephyr.dir/subsys/tracing/tracing_none.c.obj
[43/138] Building C object zephyr/CMakeFiles/zephyr.dir/drivers/console/uart_console.c.obj
[44/138] Building C object zephyr/CMakeFiles/zephyr.dir/drivers/console/native_posix_console.c.obj
[45/138] Building C object zephyr/CMakeFiles/zephyr.dir/drivers/modem/modem_context.c.obj
[46/138] Building C object zephyr/CMakeFiles/zephyr.dir/drivers/modem/modem_pin.c.obj
[47/138] Building C object zephyr/CMakeFiles/zephyr.dir/drivers/modem/modem_iface_uart.c.obj
[48/138] Building C object zephyr/CMakeFiles/zephyr.dir/subsys/net/lib/sockets/sockets.c.obj
[49/138] Building C object zephyr/CMakeFiles/zephyr.dir/drivers/modem/modem_cmd_handler.c.obj
FAILED: zephyr/CMakeFiles/zephyr.dir/drivers/modem/modem_cmd_handler.c.obj
ccache /usr/bin/gcc -DBUILD_VERSION=zephyr-v2.6.0-1617-g75e9fa827490 -DKERNEL -D_FORTIFY_SOURCE=2 -D_POSIX_C_SOURCE=200809 -D_XOPEN_SOURCE=600 -D_XOPEN_SOURCE_EXTENDED -D__ZEPHYR__=1 -I../../../../../../../kernel/include -I../../../../../../../arch/posix/include -I../../../../../../../subsys/net/ip -I../../../../../../../include -Izephyr/include/generated -I../../../../../../../soc/posix/inf_clock -I../../../../../../../boards/posix/native_posix -I../../../../../../../subsys/net/lib/sockets/. -I../../../../../../../subsys/testsuite/include -I../../../../../../../subsys/net/l2 -Os -imacros /workdir/zephyr/twister-out/native_posix_64/tests/drivers/build_all/modem/drivers.modem.quectel_bg9x.build/zephyr/include/generated/autoconf.h -ffreestanding -fno-common -g -gdwarf-4 -fdiagnostics-color=always -imacros /workdir/zephyr/include/toolchain/zephyr_stdint.h -Wall -Wformat -Wformat-security -Wno-format-zero-length -Wno-main -Wno-pointer-sign -Wpointer-arith -Wexpansion-to-defined -Wno-address-of-packed-member -Wno-unused-but-set-variable -Werror=implicit-int -Werror -fno-asynchronous-unwind-tables -fno-pie -fno-pic -fno-strict-overflow -fno-reorder-functions -fno-defer-pop -fmacro-prefix-map=/workdir/zephyr/tests/drivers/build_all/modem=CMAKE_SOURCE_DIR -fmacro-prefix-map=/workdir/zephyr=ZEPHYR_BASE -fmacro-prefix-map=/workdir=WEST_TOPDIR -ffunction-sections -fdata-sections -m64 -fPIC -include /workdir/zephyr/arch/posix/include/posix_cheats.h -fno-freestanding -std=c11 -MD -MT zephyr/CMakeFiles/zephyr.dir/drivers/modem/modem_cmd_handler.c.obj -MF zephyr/CMakeFiles/zephyr.dir/drivers/modem/modem_cmd_handler.c.obj.d -o zephyr/CMakeFiles/zephyr.dir/drivers/modem/modem_cmd_handler.c.obj -c /workdir/zephyr/drivers/modem/modem_cmd_handler.c
/workdir/zephyr/drivers/modem/modem_cmd_handler.c: In function modem_cmd_send_ext:
/workdir/zephyr/drivers/modem/modem_cmd_handler.c:545:9: error: ret may be used uninitialized in this function [-Werror=maybe-uninitialized]
  545 |  return ret;
      |         ^~~
cc1: all warnings being treated as errors
[50/138] Building C object zephyr/CMakeFiles/zephyr.dir/drivers/modem/modem_socket.c.obj
[51/138] Building C object zephyr/CMakeFiles/zephyr.dir/drivers/modem/quectel-bg9x.c.obj
ninja: build stopped: subcommand failed.

in Job #e88849c4-e870-47e7-946c-95df456eb566

tests/drivers/build_all/modem/drivers.modem.ublox_sara.build in native_posix_64:tests/drivers/build_all/modem/drivers.modem
Including boilerplate (Zephyr base): /workdir/zephyr/cmake/app/boilerplate.cmake
-- Application: /workdir/zephyr/tests/drivers/build_all/modem
-- Zephyr version: 2.6.99 (/workdir/zephyr), build: zephyr-v2.6.0-1617-g75e9fa827490
-- Found Python3: /usr/bin/python3.8 (found suitable exact version "3.8.10") found components: Interpreter
-- Found west (found suitable version "0.11.0", minimum required is "0.7.1")
-- Board: native_posix_64
-- Cache files will be written to: /root/.cache/zephyr
-- Using toolchain: zephyr 0.13.0 (/opt/toolchains/zephyr-sdk-0.13.0-rc4)
-- Found dtc: /opt/toolchains/zephyr-sdk-0.13.0-rc4/sysroots/x86_64-pokysdk-linux/usr/bin/dtc (found suitable version "1.6.0", minimum required is "1.4.6")
-- Found toolchain: host (gcc/ld)
-- Found BOARD.dts: /workdir/zephyr/boards/posix/native_posix/native_posix_64.dts
-- Found devicetree overlay: /workdir/zephyr/tests/drivers/build_all/modem/app.overlay
-- Generated zephyr.dts: /workdir/zephyr/twister-out/native_posix_64/tests/drivers/build_all/modem/drivers.modem.ublox_sara.build/zephyr/zephyr.dts
-- Generated devicetree_unfixed.h: /workdir/zephyr/twister-out/native_posix_64/tests/drivers/build_all/modem/drivers.modem.ublox_sara.build/zephyr/include/generated/devicetree_unfixed.h
-- Generated device_extern.h: /workdir/zephyr/twister-out/native_posix_64/tests/drivers/build_all/modem/drivers.modem.ublox_sara.build/zephyr/include/generated/device_extern.h

warning: TEST_RANDOM_GENERATOR (defined at subsys/random/Kconfig:8) was assigned the value 'y' but
got the value 'n'. Check these unsatisfied dependencies: (!ENTROPY_HAS_DRIVER) (=n). See
http://docs.zephyrproject.org/latest/reference/kconfig/CONFIG_TEST_RANDOM_GENERATOR.html and/or look
up TEST_RANDOM_GENERATOR in the menuconfig/guiconfig interface. The Application Development Primer,
Setting Configuration Values, and Kconfig - Tips and Best Practices sections of the manual might be
helpful too.

Parsing /workdir/zephyr/tests/drivers/build_all/modem/Kconfig
Loaded configuration '/workdir/zephyr/boards/posix/native_posix/native_posix_64_defconfig'
Merged configuration 'modem_ublox_sara.conf'
Configuration saved to '/workdir/zephyr/twister-out/native_posix_64/tests/drivers/build_all/modem/drivers.modem.ublox_sara.build/zephyr/.config'
Kconfig header saved to '/workdir/zephyr/twister-out/native_posix_64/tests/drivers/build_all/modem/drivers.modem.ublox_sara.build/zephyr/include/generated/autoconf.h'
-- The C compiler identification is GNU 9.3.0
-- The CXX compiler identification is GNU 9.3.0
-- The ASM compiler identification is GNU
-- Found assembler: /usr/bin/gcc
CMake Warning at ../../../../CMakeLists.txt:718 (message):
  No SOURCES given to Zephyr library: drivers__gpio

  Excluding target from build.


-- Configuring done
-- Generating done
-- Build files have been written to: /workdir/zephyr/twister-out/native_posix_64/tests/drivers/build_all/modem/drivers.modem.ublox_sara.build
[1/138] Preparing syscall dependency handling

[2/138] Generating misc/generated/syscalls_subdirs.trigger
[3/138] Generating misc/generated/syscalls.json, misc/generated/struct_tags.json
[4/138] Generating include/generated/driver-validation.h
[5/138] Generating include/generated/kobj-types-enum.h, include/generated/otype-to-str.h, include/generated/otype-to-size.h
[6/138] Generating include/generated/syscall_dispatch.c, include/generated/syscall_list.h
[7/138] Building C object zephyr/CMakeFiles/offsets.dir/arch/posix/core/offsets/offsets.c.obj
[8/138] Generating include/generated/offsets.h
[9/138] Building C object zephyr/CMakeFiles/zephyr.dir/lib/os/cbprintf.c.obj
[10/138] Building C object CMakeFiles/app.dir/src/main.c.obj
[11/138] Linking C static library app/libapp.a
[12/138] Building C object zephyr/CMakeFiles/zephyr.dir/lib/os/crc32c_sw.c.obj
[13/138] Building C object zephyr/CMakeFiles/zephyr.dir/lib/os/cbprintf_packaged.c.obj
[14/138] Building C object zephyr/CMakeFiles/zephyr.dir/lib/os/crc32_sw.c.obj
[15/138] Building C object zephyr/CMakeFiles/zephyr.dir/lib/os/crc16_sw.c.obj
[16/138] Building C object zephyr/CMakeFiles/zephyr.dir/lib/os/crc8_sw.c.obj
[17/138] Building C object zephyr/CMakeFiles/zephyr.dir/lib/os/crc7_sw.c.obj
[18/138] Building C object zephyr/CMakeFiles/zephyr.dir/lib/os/dec.c.obj
[19/138] Building C object zephyr/CMakeFiles/zephyr.dir/lib/os/hex.c.obj
[20/138] Building C object zephyr/CMakeFiles/zephyr.dir/lib/os/notify.c.obj
[21/138] Building C object zephyr/CMakeFiles/zephyr.dir/lib/os/fdtable.c.obj
[22/138] Building C object zephyr/CMakeFiles/zephyr.dir/lib/os/printk.c.obj
[23/138] Building C object zephyr/CMakeFiles/zephyr.dir/lib/os/sem.c.obj
[24/138] Building C object zephyr/CMakeFiles/zephyr.dir/lib/os/onoff.c.obj
[25/138] Building C object zephyr/CMakeFiles/zephyr.dir/lib/os/thread_entry.c.obj
[26/138] Building C object zephyr/CMakeFiles/zephyr.dir/lib/os/rb.c.obj
[27/138] Building C object zephyr/CMakeFiles/zephyr.dir/lib/os/timeutil.c.obj
[28/138] Building C object zephyr/CMakeFiles/zephyr.dir/lib/os/heap.c.obj
[29/138] Building C object zephyr/CMakeFiles/zephyr.dir/lib/os/heap-validate.c.obj
[30/138] Building C object zephyr/CMakeFiles/zephyr.dir/lib/os/bitarray.c.obj
[31/138] Building C object zephyr/CMakeFiles/zephyr.dir/lib/os/assert.c.obj
[32/138] Building C object zephyr/CMakeFiles/zephyr.dir/lib/os/ring_buffer.c.obj
[33/138] Building C object zephyr/CMakeFiles/zephyr.dir/misc/generated/configs.c.obj
[34/138] Building C object zephyr/CMakeFiles/zephyr.dir/lib/os/cbprintf_complete.c.obj
[35/138] Building C object zephyr/CMakeFiles/zephyr.dir/subsys/logging/log_minimal.c.obj
[36/138] Building C object zephyr/CMakeFiles/zephyr.dir/lib/os/mpsc_pbuf.c.obj
[37/138] Building C object zephyr/CMakeFiles/zephyr.dir/subsys/net/lib/utils/addr_utils.c.obj
[38/138] Building C object zephyr/CMakeFiles/zephyr.dir/subsys/net/lib/sockets/getaddrinfo.c.obj
[39/138] Building C object zephyr/CMakeFiles/zephyr.dir/subsys/net/lib/sockets/socket_offload.c.obj
[40/138] Building C object zephyr/CMakeFiles/zephyr.dir/subsys/net/lib/sockets/sockets_select.c.obj
[41/138] Building C object zephyr/CMakeFiles/zephyr.dir/subsys/tracing/tracing_none.c.obj
[42/138] Building C object zephyr/CMakeFiles/zephyr.dir/drivers/console/uart_console.c.obj
[43/138] Building C object zephyr/CMakeFiles/zephyr.dir/drivers/console/native_posix_console.c.obj
[44/138] Building C object zephyr/CMakeFiles/zephyr.dir/drivers/modem/modem_context.c.obj
[45/138] Building C object zephyr/CMakeFiles/zephyr.dir/drivers/modem/modem_pin.c.obj
[46/138] Building C object zephyr/CMakeFiles/zephyr.dir/drivers/modem/modem_iface_uart.c.obj
[47/138] Building C object zephyr/CMakeFiles/zephyr.dir/subsys/net/lib/sockets/sockets.c.obj
[48/138] Building C object zephyr/CMakeFiles/zephyr.dir/drivers/modem/modem_socket.c.obj
[49/138] Building C object zephyr/CMakeFiles/zephyr.dir/drivers/modem/modem_cmd_handler.c.obj
FAILED: zephyr/CMakeFiles/zephyr.dir/drivers/modem/modem_cmd_handler.c.obj
ccache /usr/bin/gcc -DBUILD_VERSION=zephyr-v2.6.0-1617-g75e9fa827490 -DKERNEL -D_FORTIFY_SOURCE=2 -D_POSIX_C_SOURCE=200809 -D_XOPEN_SOURCE=600 -D_XOPEN_SOURCE_EXTENDED -D__ZEPHYR__=1 -I../../../../../../../kernel/include -I../../../../../../../arch/posix/include -I../../../../../../../subsys/net/ip -I../../../../../../../include -Izephyr/include/generated -I../../../../../../../soc/posix/inf_clock -I../../../../../../../boards/posix/native_posix -I../../../../../../../subsys/net/lib/sockets/. -I../../../../../../../subsys/testsuite/include -I../../../../../../../subsys/net/l2 -Os -imacros /workdir/zephyr/twister-out/native_posix_64/tests/drivers/build_all/modem/drivers.modem.ublox_sara.build/zephyr/include/generated/autoconf.h -ffreestanding -fno-common -g -gdwarf-4 -fdiagnostics-color=always -imacros /workdir/zephyr/include/toolchain/zephyr_stdint.h -Wall -Wformat -Wformat-security -Wno-format-zero-length -Wno-main -Wno-pointer-sign -Wpointer-arith -Wexpansion-to-defined -Wno-address-of-packed-member -Wno-unused-but-set-variable -Werror=implicit-int -Werror -fno-asynchronous-unwind-tables -fno-pie -fno-pic -fno-strict-overflow -fno-reorder-functions -fno-defer-pop -fmacro-prefix-map=/workdir/zephyr/tests/drivers/build_all/modem=CMAKE_SOURCE_DIR -fmacro-prefix-map=/workdir/zephyr=ZEPHYR_BASE -fmacro-prefix-map=/workdir=WEST_TOPDIR -ffunction-sections -fdata-sections -m64 -fPIC -include /workdir/zephyr/arch/posix/include/posix_cheats.h -fno-freestanding -std=c11 -MD -MT zephyr/CMakeFiles/zephyr.dir/drivers/modem/modem_cmd_handler.c.obj -MF zephyr/CMakeFiles/zephyr.dir/drivers/modem/modem_cmd_handler.c.obj.d -o zephyr/CMakeFiles/zephyr.dir/drivers/modem/modem_cmd_handler.c.obj -c /workdir/zephyr/drivers/modem/modem_cmd_handler.c
/workdir/zephyr/drivers/modem/modem_cmd_handler.c: In function modem_cmd_send_ext:
/workdir/zephyr/drivers/modem/modem_cmd_handler.c:545:9: error: ret may be used uninitialized in this function [-Werror=maybe-uninitialized]
  545 |  return ret;
      |         ^~~
cc1: all warnings being treated as errors
[50/138] Building C object zephyr/CMakeFiles/zephyr.dir/drivers/timer/sys_clock_init.c.obj
[51/138] Building C object zephyr/CMakeFiles/zephyr.dir/drivers/modem/ublox-sara-r4.c.obj
ninja: build stopped: subcommand failed.

in Job #e88849c4-e870-47e7-946c-95df456eb566


[Still Failing] Zephyr / zephyr-daily #410 (main) #builds

Buildkite <notifications@...>
 

Scheduled build Duration: 6 hours, 56 minutes, 55 seconds
Build #410 | main | c6ef58c
View Build →
ℹ︎

Read the JUnit test report


[Still Failing] Zephyr / zephyr-daily #409 (main) #builds

Buildkite <notifications@...>
 

Scheduled build Duration: 6 hours, 43 minutes, 3 seconds
Build #409 | main | 718c77a
View Build →
ℹ︎

Read the JUnit test report


[Still Failing] Zephyr / zephyr-daily #408 (main) #builds

Buildkite <notifications@...>
 

Scheduled build Duration: 6 hours, 43 minutes, 33 seconds
Build #408 | main | 17d2e9d
View Build →
ℹ︎

Read the JUnit test report


[Still Failing] Zephyr / zephyr-daily #407 (main) #builds

Buildkite <notifications@...>
 

Scheduled build Duration: 6 hours, 33 minutes, 23 seconds
Build #407 | main | c51a4ec
View Build →
ℹ︎

Read the JUnit test report


[Still Failing] Zephyr / zephyr-daily #406 (main) #builds

Buildkite <notifications@...>
 

Scheduled build Duration: 6 hours, 37 minutes, 10 seconds
Build #406 | main | 7d07a94
View Build →
ℹ︎

Read the JUnit test report


[Still Failing] Zephyr / zephyr-daily #405 (main) #builds

Buildkite <notifications@...>
 

Scheduled build Duration: 6 hours, 34 minutes, 11 seconds
Build #405 | main | 21f0f95
View Build →
ℹ︎

Read the JUnit test report


[Still Failing] Zephyr / zephyr-daily #404 (main) #builds

Buildkite <notifications@...>
 

Scheduled build Duration: 6 hours, 34 minutes, 55 seconds
Build #404 | main | eadca02
View Build →
ℹ︎

Read the JUnit test report


[Still Failing] Zephyr / zephyr-daily #403 (main) #builds

Buildkite <notifications@...>
 

Scheduled build Duration: 6 hours, 51 minutes, 57 seconds
Build #403 | main | f72b32f
View Build →
ℹ︎

Read the JUnit test report


[Still Failing] Zephyr / zephyr-daily #402 (main) #builds

Buildkite <notifications@...>
 

Scheduled build Duration: 4 hours, 53 minutes, 49 seconds
Build #402 | main | 28e214b
View Build →
ℹ︎

Read the JUnit test report


[Still Failing] Zephyr / zephyr-daily #402 (main) #builds

Buildkite <notifications@...>
 

Scheduled build Duration: 2 hours, 54 minutes, 22 seconds
Build #402 | main | 28e214b
View Build →
ℹ︎

Read the JUnit test report


[Still Failing] Zephyr / zephyr-daily #401 (main) #builds

Buildkite <notifications@...>
 

Scheduled build Duration: 6 hours, 43 minutes, 22 seconds
Build #401 | main | 7872cde
View Build →
ℹ︎

Read the JUnit test report


[Still Failing] Zephyr / zephyr-daily #400 (main) #builds

Buildkite <notifications@...>
 

Scheduled build Duration: 7 hours, 2 minutes, 8 seconds
Build #400 | main | 6ee70bd
View Build →
ℹ︎

Read the JUnit test report


[Still Failing] Zephyr / zephyr-daily #399 (main) #builds

Buildkite <notifications@...>
 

Scheduled build Duration: 6 hours, 30 minutes, 4 seconds
Build #399 | main | 378a1e0
View Build →
ℹ︎

Read the JUnit test report


[Still Failing] Zephyr / zephyr-daily #398 (main) #builds

Buildkite <notifications@...>
 

Scheduled build Duration: 6 hours, 26 minutes, 9 seconds
Build #398 | main | 378a1e0
View Build →
ℹ︎

Read the JUnit test report


[Still Failing] Zephyr / zephyr-daily #397 (main) #builds

Buildkite <notifications@...>
 

Scheduled build Duration: 6 hours, 25 minutes, 54 seconds
Build #397 | main | 8a4e489
View Build →
ℹ︎

Read the JUnit test report


[Still Failing] Zephyr / zephyr-daily #396 (main) #builds

Buildkite <notifications@...>
 

Scheduled build Duration: 6 hours, 30 minutes, 18 seconds
Build #396 | main | 2e60836
View Build →
ℹ︎

Read the JUnit test report


[Still Failing] Zephyr / zephyr-daily #395 (main) #builds

Buildkite <notifications@...>
 

Scheduled build Duration: 6 hours, 33 minutes, 16 seconds
Build #395 | main | 84c5a46
View Build →
ℹ︎

Read the JUnit test report


[Still Failing] Zephyr / zephyr-daily #394 (main) #builds

Buildkite <notifications@...>
 

Scheduled build Duration: 6 hours, 6 minutes, 40 seconds
Build #394 | main | e6000e6
View Build →
ℹ︎

Read the JUnit test report

1 - 20 of 2863