Date   

[ master ] Build TIMEOUT for zephyrproject-rtos/ci-test ( bump matrix to 35 See if 35 builders will get this to not timeout. Signed-off-by: Kumar Gala <kumar.gala@linaro.org> ) on Shippable.com #builds

Shippable.com <noreply@...>
 

SHIPPABLE BUILD REPORT

3478
ci-test
Branch : master Sha : fce6c2868f
Builder : Kumar Gala Triggered By : Kumar Gala
Custom Environment Variables:
JOB_TRIGGERED_BY_NAME="daily-verify"
JOB_TRIGGERED_BY_ID="23790"
# Runtime Status Tests Branch Coverage Sequence Coverage Triggered at Duration
3478.1 none succeeded 1245/1505 N/A N/A Tue May 05 2020 02:05:15 GMT+0000 (UTC) 01:81:71
3478.2 none succeeded 976/1505 N/A N/A Tue May 05 2020 02:05:15 GMT+0000 (UTC) 01:75:91
3478.3 none timeout 0/0 N/A N/A Tue May 05 2020 02:05:15 GMT+0000 (UTC) 02:22:10
3478.4 none timeout 0/0 N/A N/A Tue May 05 2020 02:05:15 GMT+0000 (UTC) 02:22:10
3478.5 none succeeded 1499/1505 N/A N/A Tue May 05 2020 02:05:15 GMT+0000 (UTC) 02:90:25
3478.6 none succeeded 1502/1505 N/A N/A Tue May 05 2020 02:05:15 GMT+0000 (UTC) 02:02:96
3478.7 none succeeded 1213/1505 N/A N/A Tue May 05 2020 02:05:15 GMT+0000 (UTC) 02:03:64
3478.8 none succeeded 637/1505 N/A N/A Tue May 05 2020 02:05:15 GMT+0000 (UTC) 01:57:07
3478.9 none succeeded 1267/1505 N/A N/A Tue May 05 2020 02:05:16 GMT+0000 (UTC) 01:89:52
3478.10 none succeeded 1386/1505 N/A N/A Tue May 05 2020 02:05:16 GMT+0000 (UTC) 02:99:61
3478.11 none succeeded 1314/1505 N/A N/A Tue May 05 2020 02:05:16 GMT+0000 (UTC) 02:96:76
3478.12 none succeeded 1373/1505 N/A N/A Tue May 05 2020 02:05:16 GMT+0000 (UTC) 02:08:74
3478.13 none succeeded 1428/1505 N/A N/A Tue May 05 2020 02:05:16 GMT+0000 (UTC) 02:96:62
3478.14 none succeeded 1104/1505 N/A N/A Tue May 05 2020 02:05:16 GMT+0000 (UTC) 02:92:93
3478.15 none succeeded 1139/1505 N/A N/A Tue May 05 2020 02:05:16 GMT+0000 (UTC) 02:95:02
3478.16 none succeeded 1271/1505 N/A N/A Tue May 05 2020 02:05:16 GMT+0000 (UTC) 02:97:93
3478.17 none succeeded 992/1505 N/A N/A Tue May 05 2020 02:05:16 GMT+0000 (UTC) 01:77:16
3478.18 none succeeded 1443/1505 N/A N/A Tue May 05 2020 02:05:16 GMT+0000 (UTC) 02:95:93
3478.19 none succeeded 1078/1505 N/A N/A Tue May 05 2020 02:05:16 GMT+0000 (UTC) 01:77:01
3478.20 none succeeded 1505/1505 N/A N/A Tue May 05 2020 02:05:16 GMT+0000 (UTC) 02:95:29
3478.21 none succeeded 1374/1505 N/A N/A Tue May 05 2020 02:05:16 GMT+0000 (UTC) 02:96:40
3478.22 none succeeded 1093/1504 N/A N/A Tue May 05 2020 02:05:16 GMT+0000 (UTC) 01:84:57
3478.23 none succeeded 1181/1504 N/A N/A Tue May 05 2020 02:05:16 GMT+0000 (UTC) 01:81:72
3478.24 none succeeded 1188/1504 N/A N/A Tue May 05 2020 02:05:16 GMT+0000 (UTC) 01:86:90
3478.25 none succeeded 1499/1504 N/A N/A Tue May 05 2020 02:05:16 GMT+0000 (UTC) 02:09:69
3478.26 none succeeded 1485/1504 N/A N/A Tue May 05 2020 02:05:16 GMT+0000 (UTC) 02:09:69
3478.27 none succeeded 924/1504 N/A N/A Tue May 05 2020 02:05:17 GMT+0000 (UTC) 01:75:85
3478.28 none succeeded 1280/1504 N/A N/A Tue May 05 2020 02:05:17 GMT+0000 (UTC) 02:94:53
3478.29 none succeeded 1230/1504 N/A N/A Tue May 05 2020 02:05:17 GMT+0000 (UTC) 01:85:07
3478.30 none succeeded 1496/1504 N/A N/A Tue May 05 2020 02:05:17 GMT+0000 (UTC) 02:03:71
3478.31 none succeeded 1492/1504 N/A N/A Tue May 05 2020 02:05:17 GMT+0000 (UTC) 02:97:00
3478.32 none timeout 0/0 N/A N/A Tue May 05 2020 02:05:17 GMT+0000 (UTC) 02:22:15
3478.33 none succeeded 1498/1504 N/A N/A Tue May 05 2020 02:05:17 GMT+0000 (UTC) 02:23:79
3478.34 none succeeded 1493/1504 N/A N/A Tue May 05 2020 02:05:17 GMT+0000 (UTC) 02:97:18
3478.35 none succeeded 1504/1504 N/A N/A Tue May 05 2020 02:05:17 GMT+0000 (UTC) 02:91:68


Need help with Shippable? File an Issue


[ master ] Build FAILED for zephyrproject-rtos/test_results ( action: upload report to S3 ) on Shippable.com #builds

Shippable.com <noreply@...>
 

SHIPPABLE BUILD REPORT

48
test_results
Branch : master Sha : d3aff7f2bf
Builder : Anas Nashif Triggered By : Anas Nashif
Custom Environment Variables:
JOB_TRIGGERED_BY_NAME="create_test_commit"
JOB_TRIGGERED_BY_ID="125148"
# Runtime Status Tests Branch Coverage Sequence Coverage Triggered at Duration
48.1 none succeeded 823/890 N/A N/A Tue May 05 2020 04:05:53 GMT+0000 (UTC) 01:31:35
48.2 none succeeded 1591/1775 N/A N/A Tue May 05 2020 04:05:54 GMT+0000 (UTC) 00:25:72
48.3 none succeeded 2688/2974 N/A N/A Tue May 05 2020 04:05:54 GMT+0000 (UTC) 00:26:64
48.4 none succeeded 5406/5741 N/A N/A Tue May 05 2020 04:05:54 GMT+0000 (UTC) 01:32:42
48.5 none failed 3511/3553 N/A N/A Tue May 05 2020 04:05:54 GMT+0000 (UTC) 01:45:86


Need help with Shippable? File an Issue


[ master ] Build TIMEOUT for zephyrproject-rtos/ci-test ( bump matrix to 35 See if 35 builders will get this to not timeout. Signed-off-by: Kumar Gala <kumar.gala@linaro.org> ) on Shippable.com #builds

Shippable.com <noreply@...>
 

SHIPPABLE BUILD REPORT

3477
ci-test
Branch : master Sha : fce6c2868f
Builder : Kumar Gala Triggered By : Kumar Gala
Custom Environment Variables:
JOB_TRIGGERED_BY_NAME="daily-verify"
JOB_TRIGGERED_BY_ID="23790"
# Runtime Status Tests Branch Coverage Sequence Coverage Triggered at Duration
3477.1 none succeeded 1245/1505 N/A N/A Mon May 04 2020 02:06:04 GMT+0000 (UTC) 01:77:42
3477.2 none succeeded 976/1505 N/A N/A Mon May 04 2020 02:06:05 GMT+0000 (UTC) 01:71:60
3477.3 none timeout 0/0 N/A N/A Mon May 04 2020 02:06:05 GMT+0000 (UTC) 02:21:38
3477.4 none timeout 0/0 N/A N/A Mon May 04 2020 02:06:05 GMT+0000 (UTC) 02:21:37
3477.5 none succeeded 1499/1505 N/A N/A Mon May 04 2020 02:06:05 GMT+0000 (UTC) 01:90:96
3477.6 none succeeded 1502/1505 N/A N/A Mon May 04 2020 02:06:05 GMT+0000 (UTC) 02:97:39
3477.7 none succeeded 1213/1505 N/A N/A Mon May 04 2020 02:06:05 GMT+0000 (UTC) 02:96:64
3477.8 none succeeded 637/1505 N/A N/A Mon May 04 2020 02:06:05 GMT+0000 (UTC) 01:54:65
3477.9 none succeeded 1266/1505 N/A N/A Mon May 04 2020 02:06:05 GMT+0000 (UTC) 01:89:36
3477.10 none succeeded 1386/1505 N/A N/A Mon May 04 2020 02:06:05 GMT+0000 (UTC) 02:99:20
3477.11 none succeeded 1313/1505 N/A N/A Mon May 04 2020 02:06:05 GMT+0000 (UTC) 02:97:12
3477.12 none succeeded 1373/1505 N/A N/A Mon May 04 2020 02:06:05 GMT+0000 (UTC) 02:05:99
3477.13 none succeeded 1428/1505 N/A N/A Mon May 04 2020 02:06:05 GMT+0000 (UTC) 02:96:33
3477.14 none succeeded 1103/1505 N/A N/A Mon May 04 2020 02:06:05 GMT+0000 (UTC) 02:92:37
3477.15 none succeeded 1027/1505 N/A N/A Mon May 04 2020 02:06:05 GMT+0000 (UTC) 01:87:43
3477.16 none succeeded 1271/1505 N/A N/A Mon May 04 2020 02:06:05 GMT+0000 (UTC) 02:97:92
3477.17 none succeeded 989/1505 N/A N/A Mon May 04 2020 02:06:05 GMT+0000 (UTC) 01:77:35
3477.18 none succeeded 1443/1505 N/A N/A Mon May 04 2020 02:06:05 GMT+0000 (UTC) 02:96:56
3477.19 none succeeded 1078/1505 N/A N/A Mon May 04 2020 02:06:05 GMT+0000 (UTC) 01:75:93
3477.20 none succeeded 1504/1504 N/A N/A Mon May 04 2020 02:06:05 GMT+0000 (UTC) 02:99:34
3477.21 none succeeded 1372/1504 N/A N/A Mon May 04 2020 02:06:06 GMT+0000 (UTC) 02:98:81
3477.22 none succeeded 1090/1504 N/A N/A Mon May 04 2020 02:06:06 GMT+0000 (UTC) 01:86:32
3477.23 none succeeded 1179/1504 N/A N/A Mon May 04 2020 02:06:06 GMT+0000 (UTC) 01:85:77
3477.24 none succeeded 1187/1504 N/A N/A Mon May 04 2020 02:06:06 GMT+0000 (UTC) 01:84:44
3477.25 none succeeded 1499/1504 N/A N/A Mon May 04 2020 02:06:06 GMT+0000 (UTC) 02:13:04
3477.26 none succeeded 1485/1504 N/A N/A Mon May 04 2020 02:06:06 GMT+0000 (UTC) 02:02:95
3477.27 none succeeded 923/1504 N/A N/A Mon May 04 2020 02:06:06 GMT+0000 (UTC) 01:75:82
3477.28 none succeeded 1280/1504 N/A N/A Mon May 04 2020 02:06:06 GMT+0000 (UTC) 01:89:69
3477.29 none succeeded 1230/1504 N/A N/A Mon May 04 2020 02:06:06 GMT+0000 (UTC) 01:88:93
3477.30 none succeeded 1496/1504 N/A N/A Mon May 04 2020 02:06:06 GMT+0000 (UTC) 02:00:21
3477.31 none succeeded 1492/1504 N/A N/A Mon May 04 2020 02:06:06 GMT+0000 (UTC) 02:94:28
3477.32 none timeout 0/0 N/A N/A Mon May 04 2020 02:06:06 GMT+0000 (UTC) 02:24:50
3477.33 none succeeded 1498/1504 N/A N/A Mon May 04 2020 02:06:06 GMT+0000 (UTC) 02:19:67
3477.34 none succeeded 1493/1504 N/A N/A Mon May 04 2020 02:06:06 GMT+0000 (UTC) 02:98:55
3477.35 none succeeded 1504/1504 N/A N/A Mon May 04 2020 02:06:06 GMT+0000 (UTC) 02:92:91


Need help with Shippable? File an Issue


[ master ] Build FAILED for zephyrproject-rtos/test_results ( actions: create versioned artifact Signed-off-by: Anas Nashif <anas.nashif@intel.com> ) on Shippable.com #builds

Shippable.com <noreply@...>
 

SHIPPABLE BUILD REPORT

47
test_results
Branch : master Sha : 0ff546d411
Builder : Anas Nashif Triggered By : Anas Nashif
Custom Environment Variables:
JOB_TRIGGERED_BY_NAME="create_test_commit"
JOB_TRIGGERED_BY_ID="125148"
# Runtime Status Tests Branch Coverage Sequence Coverage Triggered at Duration
47.1 none succeeded 823/890 N/A N/A Mon May 04 2020 04:06:32 GMT+0000 (UTC) 00:29:13
47.2 none succeeded 1591/1775 N/A N/A Mon May 04 2020 04:06:32 GMT+0000 (UTC) 00:25:06
47.3 none succeeded 2682/2968 N/A N/A Mon May 04 2020 04:06:32 GMT+0000 (UTC) 00:24:48
47.4 none succeeded 5404/5738 N/A N/A Mon May 04 2020 04:06:32 GMT+0000 (UTC) 01:33:85
47.5 none failed 3517/3560 N/A N/A Mon May 04 2020 04:06:32 GMT+0000 (UTC) 01:40:87


Need help with Shippable? File an Issue


[ master ] Build CANCELED for zephyrproject-rtos/test_results ( add merge_junit.py script ) on Shippable.com #builds

Shippable.com <noreply@...>
 

SHIPPABLE BUILD REPORT

46
test_results
Branch : master Sha : 359b8db060
Builder : Anas Nashif Triggered By : Anas Nashif
# Runtime Status Tests Branch Coverage Sequence Coverage Triggered at Duration
46.1 none canceled 0/0 N/A N/A Mon May 04 2020 00:08:49 GMT+0000 (UTC) 00:01:33
46.2 none canceled 0/0 N/A N/A Mon May 04 2020 00:08:49 GMT+0000 (UTC) 00:01:32
46.3 none canceled 0/0 N/A N/A Mon May 04 2020 00:08:49 GMT+0000 (UTC) 00:01:32
46.4 none canceled 0/0 N/A N/A Mon May 04 2020 00:08:49 GMT+0000 (UTC) 00:01:31
46.5 none canceled 0/0 N/A N/A Mon May 04 2020 00:08:49 GMT+0000 (UTC) 00:01:30


Need help with Shippable? File an Issue


[ master ] Build TIMEOUT for zephyrproject-rtos/ci-test ( bump matrix to 35 See if 35 builders will get this to not timeout. Signed-off-by: Kumar Gala <kumar.gala@linaro.org> ) on Shippable.com #builds

Shippable.com <noreply@...>
 

SHIPPABLE BUILD REPORT

3476
ci-test
Branch : master Sha : fce6c2868f
Builder : Kumar Gala Triggered By : Kumar Gala
Custom Environment Variables:
JOB_TRIGGERED_BY_NAME="daily-verify"
JOB_TRIGGERED_BY_ID="23790"
# Runtime Status Tests Branch Coverage Sequence Coverage Triggered at Duration
3476.1 none succeeded 1245/1505 N/A N/A Sun May 03 2020 02:05:51 GMT+0000 (UTC) 01:81:32
3476.2 none succeeded 976/1505 N/A N/A Sun May 03 2020 02:05:51 GMT+0000 (UTC) 01:77:38
3476.3 none timeout 0/0 N/A N/A Sun May 03 2020 02:05:51 GMT+0000 (UTC) 02:25:86
3476.4 none timeout 0/0 N/A N/A Sun May 03 2020 02:05:51 GMT+0000 (UTC) 02:25:85
3476.5 none failed 0/0 N/A N/A Sun May 03 2020 02:05:52 GMT+0000 (UTC) 00:06:82
3476.6 none succeeded 1502/1505 N/A N/A Sun May 03 2020 02:05:52 GMT+0000 (UTC) 02:98:89
3476.7 none succeeded 1213/1505 N/A N/A Sun May 03 2020 02:05:52 GMT+0000 (UTC) 02:98:78
3476.8 none succeeded 637/1505 N/A N/A Sun May 03 2020 02:05:52 GMT+0000 (UTC) 01:55:06
3476.9 none succeeded 1266/1505 N/A N/A Sun May 03 2020 02:05:52 GMT+0000 (UTC) 01:89:41
3476.10 none succeeded 1386/1505 N/A N/A Sun May 03 2020 02:05:52 GMT+0000 (UTC) 02:98:63
3476.11 none succeeded 1313/1505 N/A N/A Sun May 03 2020 02:05:52 GMT+0000 (UTC) 02:97:28
3476.12 none succeeded 1373/1505 N/A N/A Sun May 03 2020 02:05:52 GMT+0000 (UTC) 02:05:07
3476.13 none succeeded 1428/1505 N/A N/A Sun May 03 2020 02:05:52 GMT+0000 (UTC) 02:96:45
3476.14 none succeeded 1103/1505 N/A N/A Sun May 03 2020 02:05:52 GMT+0000 (UTC) 02:93:79
3476.15 none succeeded 1027/1505 N/A N/A Sun May 03 2020 02:05:52 GMT+0000 (UTC) 01:86:31
3476.16 none succeeded 1271/1505 N/A N/A Sun May 03 2020 02:05:52 GMT+0000 (UTC) 02:96:37
3476.17 none succeeded 989/1505 N/A N/A Sun May 03 2020 02:05:52 GMT+0000 (UTC) 01:83:68
3476.18 none succeeded 1443/1505 N/A N/A Sun May 03 2020 02:05:52 GMT+0000 (UTC) 02:97:00
3476.19 none succeeded 1078/1505 N/A N/A Sun May 03 2020 02:05:52 GMT+0000 (UTC) 01:76:35
3476.20 none succeeded 1504/1504 N/A N/A Sun May 03 2020 02:05:52 GMT+0000 (UTC) 02:95:11
3476.21 none succeeded 1372/1504 N/A N/A Sun May 03 2020 02:05:52 GMT+0000 (UTC) 02:99:15
3476.22 none succeeded 1090/1504 N/A N/A Sun May 03 2020 02:05:52 GMT+0000 (UTC) 01:89:26
3476.23 none succeeded 1179/1504 N/A N/A Sun May 03 2020 02:05:52 GMT+0000 (UTC) 01:89:15
3476.24 none succeeded 1187/1504 N/A N/A Sun May 03 2020 02:05:53 GMT+0000 (UTC) 01:89:18
3476.25 none succeeded 1499/1504 N/A N/A Sun May 03 2020 02:05:53 GMT+0000 (UTC) 02:14:28
3476.26 none succeeded 1485/1504 N/A N/A Sun May 03 2020 02:05:53 GMT+0000 (UTC) 02:14:63
3476.27 none succeeded 923/1504 N/A N/A Sun May 03 2020 02:05:53 GMT+0000 (UTC) 01:86:89
3476.28 none succeeded 1280/1504 N/A N/A Sun May 03 2020 02:05:53 GMT+0000 (UTC) 02:95:73
3476.29 none succeeded 1230/1504 N/A N/A Sun May 03 2020 02:05:53 GMT+0000 (UTC) 01:89:52
3476.30 none succeeded 1496/1504 N/A N/A Sun May 03 2020 02:05:53 GMT+0000 (UTC) 02:02:34
3476.31 none succeeded 1492/1504 N/A N/A Sun May 03 2020 02:05:53 GMT+0000 (UTC) 02:91:65
3476.32 none timeout 0/0 N/A N/A Sun May 03 2020 02:05:53 GMT+0000 (UTC) 02:25:77
3476.33 none succeeded 1498/1504 N/A N/A Sun May 03 2020 02:05:53 GMT+0000 (UTC) 02:21:61
3476.34 none succeeded 1493/1504 N/A N/A Sun May 03 2020 02:05:53 GMT+0000 (UTC) 02:97:49
3476.35 none succeeded 1504/1504 N/A N/A Sun May 03 2020 02:05:53 GMT+0000 (UTC) 01:89:63


Need help with Shippable? File an Issue


[ master ] Build FAILED for zephyrproject-rtos/test_results ( add m2gl025_miv platform ) on Shippable.com #builds

Shippable.com <noreply@...>
 

SHIPPABLE BUILD REPORT

45
test_results
Branch : master Sha : b7e17b63fc
Builder : Anas Nashif Triggered By : Anas Nashif
Custom Environment Variables:
JOB_TRIGGERED_BY_NAME="create_test_commit"
JOB_TRIGGERED_BY_ID="125148"
# Runtime Status Tests Branch Coverage Sequence Coverage Triggered at Duration
45.1 none succeeded 823/890 N/A N/A Sun May 03 2020 04:07:36 GMT+0000 (UTC) 00:29:38
45.2 none succeeded 1591/1775 N/A N/A Sun May 03 2020 04:07:36 GMT+0000 (UTC) 00:29:26
45.3 none succeeded 2682/2968 N/A N/A Sun May 03 2020 04:07:36 GMT+0000 (UTC) 00:28:75
45.4 none succeeded 5405/5739 N/A N/A Sun May 03 2020 04:07:36 GMT+0000 (UTC) 01:37:10
45.5 none failed 3517/3560 N/A N/A Sun May 03 2020 04:07:36 GMT+0000 (UTC) 01:43:71


Need help with Shippable? File an Issue


[ master ] Build TIMEOUT for zephyrproject-rtos/ci-test ( bump matrix to 35 See if 35 builders will get this to not timeout. Signed-off-by: Kumar Gala <kumar.gala@linaro.org> ) on Shippable.com #builds

Shippable.com <noreply@...>
 

SHIPPABLE BUILD REPORT

3475
ci-test
Branch : master Sha : fce6c2868f
Builder : Kumar Gala Triggered By : Kumar Gala
Custom Environment Variables:
JOB_TRIGGERED_BY_NAME="daily-verify"
JOB_TRIGGERED_BY_ID="23790"
# Runtime Status Tests Branch Coverage Sequence Coverage Triggered at Duration
3475.1 none succeeded 1245/1505 N/A N/A Sat May 02 2020 02:05:29 GMT+0000 (UTC) 01:82:05
3475.2 none succeeded 976/1505 N/A N/A Sat May 02 2020 02:05:29 GMT+0000 (UTC) 01:76:89
3475.3 none timeout 0/0 N/A N/A Sat May 02 2020 02:05:29 GMT+0000 (UTC) 02:21:33
3475.4 none timeout 0/0 N/A N/A Sat May 02 2020 02:05:29 GMT+0000 (UTC) 02:21:33
3475.5 none succeeded 1499/1505 N/A N/A Sat May 02 2020 02:05:29 GMT+0000 (UTC) 01:79:48
3475.6 none succeeded 1502/1505 N/A N/A Sat May 02 2020 02:05:29 GMT+0000 (UTC) 02:98:68
3475.7 none succeeded 1213/1505 N/A N/A Sat May 02 2020 02:05:30 GMT+0000 (UTC) 02:96:67
3475.8 none succeeded 637/1505 N/A N/A Sat May 02 2020 02:05:30 GMT+0000 (UTC) 01:49:48
3475.9 none succeeded 1266/1505 N/A N/A Sat May 02 2020 02:05:30 GMT+0000 (UTC) 01:89:62
3475.10 none succeeded 1386/1505 N/A N/A Sat May 02 2020 02:05:30 GMT+0000 (UTC) 02:99:55
3475.11 none failed 0/0 N/A N/A Sat May 02 2020 02:05:30 GMT+0000 (UTC) 00:06:60
3475.12 none succeeded 1373/1505 N/A N/A Sat May 02 2020 02:05:30 GMT+0000 (UTC) 02:04:34
3475.13 none succeeded 1428/1505 N/A N/A Sat May 02 2020 02:05:30 GMT+0000 (UTC) 02:97:11
3475.14 none succeeded 1103/1505 N/A N/A Sat May 02 2020 02:05:30 GMT+0000 (UTC) 02:92:02
3475.15 none succeeded 1027/1505 N/A N/A Sat May 02 2020 02:05:30 GMT+0000 (UTC) 02:91:87
3475.16 none succeeded 1271/1505 N/A N/A Sat May 02 2020 02:05:30 GMT+0000 (UTC) 02:98:83
3475.17 none succeeded 989/1505 N/A N/A Sat May 02 2020 02:05:30 GMT+0000 (UTC) 01:78:52
3475.18 none succeeded 1443/1505 N/A N/A Sat May 02 2020 02:05:30 GMT+0000 (UTC) 02:03:91
3475.19 none succeeded 1078/1505 N/A N/A Sat May 02 2020 02:05:30 GMT+0000 (UTC) 01:77:20
3475.20 none succeeded 1504/1504 N/A N/A Sat May 02 2020 02:05:30 GMT+0000 (UTC) 02:99:44
3475.21 none succeeded 1372/1504 N/A N/A Sat May 02 2020 02:05:30 GMT+0000 (UTC) 02:94:19
3475.22 none succeeded 1090/1504 N/A N/A Sat May 02 2020 02:05:30 GMT+0000 (UTC) 01:71:43
3475.23 none succeeded 1179/1504 N/A N/A Sat May 02 2020 02:05:31 GMT+0000 (UTC) 01:80:74
3475.24 none succeeded 1187/1504 N/A N/A Sat May 02 2020 02:05:31 GMT+0000 (UTC) 01:85:85
3475.25 none succeeded 1499/1504 N/A N/A Sat May 02 2020 02:05:31 GMT+0000 (UTC) 02:08:76
3475.26 none succeeded 1485/1504 N/A N/A Sat May 02 2020 02:05:31 GMT+0000 (UTC) 02:09:63
3475.27 none succeeded 923/1504 N/A N/A Sat May 02 2020 02:05:31 GMT+0000 (UTC) 01:75:06
3475.28 none succeeded 1280/1504 N/A N/A Sat May 02 2020 02:05:31 GMT+0000 (UTC) 02:93:97
3475.29 none succeeded 1230/1504 N/A N/A Sat May 02 2020 02:05:31 GMT+0000 (UTC) 01:84:42
3475.30 none succeeded 1496/1504 N/A N/A Sat May 02 2020 02:05:31 GMT+0000 (UTC) 02:01:71
3475.31 none succeeded 1492/1504 N/A N/A Sat May 02 2020 02:05:31 GMT+0000 (UTC) 02:95:02
3475.32 none timeout 0/0 N/A N/A Sat May 02 2020 02:05:31 GMT+0000 (UTC) 02:21:82
3475.33 none succeeded 1498/1504 N/A N/A Sat May 02 2020 02:05:31 GMT+0000 (UTC) 02:20:97
3475.34 none succeeded 1493/1504 N/A N/A Sat May 02 2020 02:05:31 GMT+0000 (UTC) 02:00:72
3475.35 none succeeded 1504/1504 N/A N/A Sat May 02 2020 02:05:31 GMT+0000 (UTC) 02:92:07


Need help with Shippable? File an Issue


[ master ] Build FAILED for zephyrproject-rtos/test_results ( add m2gl025_miv platform ) on Shippable.com #builds

Shippable.com <noreply@...>
 

SHIPPABLE BUILD REPORT

43
test_results
Branch : master Sha : b7e17b63fc
Builder : Anas Nashif Triggered By : Anas Nashif
Custom Environment Variables:
JOB_TRIGGERED_BY_NAME="create_test_commit"
JOB_TRIGGERED_BY_ID="125148"
# Runtime Status Tests Branch Coverage Sequence Coverage Triggered at Duration
43.1 none succeeded 823/890 N/A N/A Fri May 01 2020 14:17:43 GMT+0000 (UTC) 00:30:75
43.2 none succeeded 1591/1775 N/A N/A Fri May 01 2020 14:17:43 GMT+0000 (UTC) 00:25:17
43.3 none succeeded 2682/2968 N/A N/A Fri May 01 2020 14:17:43 GMT+0000 (UTC) 00:25:89
43.4 none succeeded 5405/5739 N/A N/A Fri May 01 2020 14:17:43 GMT+0000 (UTC) 01:32:40
43.5 none failed 3517/3560 N/A N/A Fri May 01 2020 14:17:43 GMT+0000 (UTC) 01:38:74


Need help with Shippable? File an Issue


[ master ] Build TIMEOUT for zephyrproject-rtos/ci-test ( ci: bump to docker image v0.11.6 Signed-off-by: Kumar Gala <kumar.gala@linaro.org> ) on Shippable.com #builds

Shippable.com <noreply@...>
 

SHIPPABLE BUILD REPORT

3474
ci-test
Branch : master Sha : 5f112ddcb9
Builder : Kumar Gala Triggered By : Kumar Gala
Custom Environment Variables:
JOB_TRIGGERED_BY_NAME="daily-verify"
JOB_TRIGGERED_BY_ID="23790"
# Runtime Status Tests Branch Coverage Sequence Coverage Triggered at Duration
3474.1 none succeeded 1488/1748 N/A N/A Fri May 01 2020 02:05:36 GMT+0000 (UTC) 02:97:24
3474.2 none succeeded 1060/1748 N/A N/A Fri May 01 2020 02:05:36 GMT+0000 (UTC) 01:80:74
3474.3 none timeout 0/0 N/A N/A Fri May 01 2020 02:05:36 GMT+0000 (UTC) 02:25:87
3474.4 none timeout 0/0 N/A N/A Fri May 01 2020 02:05:36 GMT+0000 (UTC) 02:25:87
3474.5 none succeeded 1743/1748 N/A N/A Fri May 01 2020 02:05:36 GMT+0000 (UTC) 02:10:29
3474.6 none succeeded 1459/1748 N/A N/A Fri May 01 2020 02:05:36 GMT+0000 (UTC) 02:19:68
3474.7 none succeeded 855/1748 N/A N/A Fri May 01 2020 02:05:36 GMT+0000 (UTC) 01:68:53
3474.8 none succeeded 1459/1748 N/A N/A Fri May 01 2020 02:05:36 GMT+0000 (UTC) 02:06:68
3474.9 none succeeded 1513/1748 N/A N/A Fri May 01 2020 02:05:36 GMT+0000 (UTC) 02:96:57
3474.10 none succeeded 1727/1748 N/A N/A Fri May 01 2020 02:05:36 GMT+0000 (UTC) 02:10:25
3474.11 none succeeded 1565/1748 N/A N/A Fri May 01 2020 02:05:37 GMT+0000 (UTC) 02:15:72
3474.12 none succeeded 1340/1748 N/A N/A Fri May 01 2020 02:05:37 GMT+0000 (UTC) 02:04:36
3474.13 none succeeded 1111/1748 N/A N/A Fri May 01 2020 02:05:37 GMT+0000 (UTC) 02:93:51
3474.14 none succeeded 1632/1748 N/A N/A Fri May 01 2020 02:05:37 GMT+0000 (UTC) 02:16:85
3474.15 none succeeded 1277/1748 N/A N/A Fri May 01 2020 02:05:37 GMT+0000 (UTC) 02:02:13
3474.16 none succeeded 1260/1748 N/A N/A Fri May 01 2020 02:05:37 GMT+0000 (UTC) 01:90:87
3474.17 none succeeded 1748/1748 N/A N/A Fri May 01 2020 02:05:37 GMT+0000 (UTC) 02:09:40
3474.18 none succeeded 1619/1748 N/A N/A Fri May 01 2020 02:05:37 GMT+0000 (UTC) 02:19:66
3474.19 none succeeded 1248/1748 N/A N/A Fri May 01 2020 02:05:37 GMT+0000 (UTC) 02:00:06
3474.20 none succeeded 1273/1748 N/A N/A Fri May 01 2020 02:05:37 GMT+0000 (UTC) 02:91:81
3474.21 none succeeded 1661/1748 N/A N/A Fri May 01 2020 02:05:37 GMT+0000 (UTC) 02:23:87
3474.22 none succeeded 1733/1748 N/A N/A Fri May 01 2020 02:05:37 GMT+0000 (UTC) 02:24:43
3474.23 none succeeded 1231/1748 N/A N/A Fri May 01 2020 02:05:37 GMT+0000 (UTC) 02:00:04
3474.24 none succeeded 1462/1748 N/A N/A Fri May 01 2020 02:05:37 GMT+0000 (UTC) 02:14:28
3474.25 none succeeded 1472/1748 N/A N/A Fri May 01 2020 02:05:37 GMT+0000 (UTC) 02:04:39
3474.26 none succeeded 1737/1748 N/A N/A Fri May 01 2020 02:05:37 GMT+0000 (UTC) 02:16:73
3474.27 none timeout 0/0 N/A N/A Fri May 01 2020 02:05:38 GMT+0000 (UTC) 02:23:96
3474.28 none timeout 0/0 N/A N/A Fri May 01 2020 02:05:38 GMT+0000 (UTC) 02:21:62
3474.29 none succeeded 1737/1748 N/A N/A Fri May 01 2020 02:05:38 GMT+0000 (UTC) 02:19:51
3474.30 none succeeded 1748/1748 N/A N/A Fri May 01 2020 02:05:38 GMT+0000 (UTC) 02:08:95


Need help with Shippable? File an Issue


[ master ] Build TIMEOUT for zephyrproject-rtos/ci-test ( ci: bump to docker image v0.11.6 Signed-off-by: Kumar Gala <kumar.gala@linaro.org> ) on Shippable.com #builds

Shippable.com <noreply@...>
 

SHIPPABLE BUILD REPORT

3473
ci-test
Branch : master Sha : 5f112ddcb9
Builder : Kumar Gala Triggered By : Kumar Gala
Custom Environment Variables:
JOB_TRIGGERED_BY_NAME="daily-verify"
JOB_TRIGGERED_BY_ID="23790"
# Runtime Status Tests Branch Coverage Sequence Coverage Triggered at Duration
3473.1 none succeeded 1499/1754 N/A N/A Thu Apr 30 2020 02:05:35 GMT+0000 (UTC) 02:00:08
3473.2 none succeeded 1059/1754 N/A N/A Thu Apr 30 2020 02:05:35 GMT+0000 (UTC) 01:79:36
3473.3 none timeout 0/0 N/A N/A Thu Apr 30 2020 02:05:35 GMT+0000 (UTC) 02:24:62
3473.4 none timeout 0/0 N/A N/A Thu Apr 30 2020 02:05:35 GMT+0000 (UTC) 02:24:62
3473.5 none succeeded 1749/1754 N/A N/A Thu Apr 30 2020 02:05:35 GMT+0000 (UTC) 02:13:87
3473.6 none succeeded 1560/1754 N/A N/A Thu Apr 30 2020 02:05:35 GMT+0000 (UTC) 02:15:96
3473.7 none succeeded 782/1754 N/A N/A Thu Apr 30 2020 02:05:35 GMT+0000 (UTC) 01:64:13
3473.8 none succeeded 1484/1754 N/A N/A Thu Apr 30 2020 02:05:35 GMT+0000 (UTC) 02:98:07
3473.9 none succeeded 1481/1754 N/A N/A Thu Apr 30 2020 02:05:35 GMT+0000 (UTC) 02:10:80
3473.10 none succeeded 1733/1754 N/A N/A Thu Apr 30 2020 02:05:35 GMT+0000 (UTC) 02:22:45
3473.11 none succeeded 1571/1754 N/A N/A Thu Apr 30 2020 02:05:36 GMT+0000 (UTC) 02:12:03
3473.12 none succeeded 1345/1754 N/A N/A Thu Apr 30 2020 02:05:36 GMT+0000 (UTC) 02:11:39
3473.13 none succeeded 1095/1754 N/A N/A Thu Apr 30 2020 02:05:36 GMT+0000 (UTC) 01:87:35
3473.14 none succeeded 1598/1754 N/A N/A Thu Apr 30 2020 02:05:36 GMT+0000 (UTC) 02:14:68
3473.15 none succeeded 1347/1754 N/A N/A Thu Apr 30 2020 02:05:36 GMT+0000 (UTC) 02:93:96
3473.16 none succeeded 1266/1754 N/A N/A Thu Apr 30 2020 02:05:36 GMT+0000 (UTC) 01:90:80
3473.17 none succeeded 1754/1754 N/A N/A Thu Apr 30 2020 02:05:36 GMT+0000 (UTC) 02:10:74
3473.18 none succeeded 1499/1754 N/A N/A Thu Apr 30 2020 02:05:36 GMT+0000 (UTC) 02:05:71
3473.19 none succeeded 1308/1754 N/A N/A Thu Apr 30 2020 02:05:36 GMT+0000 (UTC) 02:98:01
3473.20 none succeeded 1347/1753 N/A N/A Thu Apr 30 2020 02:05:36 GMT+0000 (UTC) 02:92:22
3473.21 none succeeded 1665/1753 N/A N/A Thu Apr 30 2020 02:05:36 GMT+0000 (UTC) 02:20:95
3473.22 none timeout 1738/1753 N/A N/A Thu Apr 30 2020 02:05:36 GMT+0000 (UTC) 02:22:97
3473.23 none succeeded 1172/1753 N/A N/A Thu Apr 30 2020 02:05:36 GMT+0000 (UTC) 02:96:84
3473.24 none succeeded 1530/1753 N/A N/A Thu Apr 30 2020 02:05:36 GMT+0000 (UTC) 02:09:45
3473.25 none succeeded 1477/1753 N/A N/A Thu Apr 30 2020 02:05:36 GMT+0000 (UTC) 02:98:58
3473.26 none succeeded 1740/1753 N/A N/A Thu Apr 30 2020 02:05:37 GMT+0000 (UTC) 02:14:57
3473.27 none timeout 0/0 N/A N/A Thu Apr 30 2020 02:05:37 GMT+0000 (UTC) 02:21:32
3473.28 none timeout 0/0 N/A N/A Thu Apr 30 2020 02:05:37 GMT+0000 (UTC) 02:20:04
3473.29 none succeeded 1743/1753 N/A N/A Thu Apr 30 2020 02:05:37 GMT+0000 (UTC) 02:15:73
3473.30 none succeeded 1753/1753 N/A N/A Thu Apr 30 2020 02:05:37 GMT+0000 (UTC) 02:06:76


Need help with Shippable? File an Issue


[ master ] Build TIMEOUT for zephyrproject-rtos/ci-test ( ci: bump to docker image v0.11.6 Signed-off-by: Kumar Gala <kumar.gala@linaro.org> ) on Shippable.com #builds

Shippable.com <noreply@...>
 

SHIPPABLE BUILD REPORT

3472
ci-test
Branch : master Sha : 5f112ddcb9
Builder : Kumar Gala Triggered By : Kumar Gala
Custom Environment Variables:
JOB_TRIGGERED_BY_NAME="daily-verify"
JOB_TRIGGERED_BY_ID="23790"
# Runtime Status Tests Branch Coverage Sequence Coverage Triggered at Duration
3472.1 none succeeded 1494/1749 N/A N/A Wed Apr 29 2020 02:05:51 GMT+0000 (UTC) 02:97:49
3472.2 none succeeded 1060/1749 N/A N/A Wed Apr 29 2020 02:05:51 GMT+0000 (UTC) 01:76:82
3472.3 none timeout 0/0 N/A N/A Wed Apr 29 2020 02:05:51 GMT+0000 (UTC) 02:24:20
3472.4 none timeout 0/0 N/A N/A Wed Apr 29 2020 02:05:51 GMT+0000 (UTC) 02:24:20
3472.5 none succeeded 1744/1749 N/A N/A Wed Apr 29 2020 02:05:51 GMT+0000 (UTC) 02:06:82
3472.6 none succeeded 1482/1749 N/A N/A Wed Apr 29 2020 02:05:52 GMT+0000 (UTC) 02:03:06
3472.7 none failed 837/1749 N/A N/A Wed Apr 29 2020 02:05:52 GMT+0000 (UTC) 01:70:17
3472.8 none succeeded 1459/1749 N/A N/A Wed Apr 29 2020 02:05:52 GMT+0000 (UTC) 02:05:72
3472.9 none succeeded 1509/1749 N/A N/A Wed Apr 29 2020 02:05:52 GMT+0000 (UTC) 02:10:26
3472.10 none succeeded 1717/1749 N/A N/A Wed Apr 29 2020 02:05:52 GMT+0000 (UTC) 02:23:09
3472.11 none succeeded 1577/1749 N/A N/A Wed Apr 29 2020 02:05:52 GMT+0000 (UTC) 02:10:00
3472.12 none succeeded 1341/1749 N/A N/A Wed Apr 29 2020 02:05:52 GMT+0000 (UTC) 02:17:97
3472.13 none succeeded 1085/1749 N/A N/A Wed Apr 29 2020 02:05:52 GMT+0000 (UTC) 01:80:89
3472.14 none succeeded 1534/1749 N/A N/A Wed Apr 29 2020 02:05:52 GMT+0000 (UTC) 02:14:51
3472.15 none succeeded 1406/1749 N/A N/A Wed Apr 29 2020 02:05:52 GMT+0000 (UTC) 02:95:91
3472.16 none succeeded 1261/1749 N/A N/A Wed Apr 29 2020 02:05:52 GMT+0000 (UTC) 01:89:38
3472.17 none succeeded 1748/1748 N/A N/A Wed Apr 29 2020 02:05:52 GMT+0000 (UTC) 02:08:02
3472.18 none succeeded 1440/1748 N/A N/A Wed Apr 29 2020 02:05:52 GMT+0000 (UTC) 02:04:61
3472.19 none succeeded 1340/1748 N/A N/A Wed Apr 29 2020 02:05:53 GMT+0000 (UTC) 02:05:29
3472.20 none succeeded 1357/1748 N/A N/A Wed Apr 29 2020 02:05:53 GMT+0000 (UTC) 02:93:61
3472.21 none succeeded 1660/1748 N/A N/A Wed Apr 29 2020 02:05:53 GMT+0000 (UTC) 02:18:01
3472.22 none succeeded 1733/1748 N/A N/A Wed Apr 29 2020 02:05:53 GMT+0000 (UTC) 02:23:73
3472.23 none failed 1166/1748 N/A N/A Wed Apr 29 2020 02:05:53 GMT+0000 (UTC) 02:00:85
3472.24 none succeeded 1525/1748 N/A N/A Wed Apr 29 2020 02:05:53 GMT+0000 (UTC) 02:10:70
3472.25 none succeeded 1472/1748 N/A N/A Wed Apr 29 2020 02:05:53 GMT+0000 (UTC) 02:97:47
3472.26 none succeeded 1735/1748 N/A N/A Wed Apr 29 2020 02:05:53 GMT+0000 (UTC) 02:16:46
3472.27 none timeout 0/0 N/A N/A Wed Apr 29 2020 02:05:53 GMT+0000 (UTC) 02:21:68
3472.28 none timeout 0/0 N/A N/A Wed Apr 29 2020 02:05:53 GMT+0000 (UTC) 02:20:04
3472.29 none succeeded 1738/1748 N/A N/A Wed Apr 29 2020 02:05:53 GMT+0000 (UTC) 02:16:38
3472.30 none succeeded 1748/1748 N/A N/A Wed Apr 29 2020 02:05:53 GMT+0000 (UTC) 02:05:29


Need help with Shippable? File an Issue


[ master ] Build FAILED for zephyrproject-rtos/test_results ( add m2gl025_miv platform ) on Shippable.com #builds

Shippable.com <noreply@...>
 

SHIPPABLE BUILD REPORT

42
test_results
Branch : master Sha : b7e17b63fc
Builder : Anas Nashif Triggered By : Anas Nashif
Custom Environment Variables:
JOB_TRIGGERED_BY_NAME="create_test_commit"
JOB_TRIGGERED_BY_ID="125148"
# Runtime Status Tests Branch Coverage Sequence Coverage Triggered at Duration
42.1 none succeeded 831/897 N/A N/A Tue Apr 28 2020 17:01:41 GMT+0000 (UTC) 01:30:07
42.2 none succeeded 1577/1769 N/A N/A Tue Apr 28 2020 17:01:41 GMT+0000 (UTC) 00:25:03
42.3 none succeeded 2728/3011 N/A N/A Tue Apr 28 2020 17:01:41 GMT+0000 (UTC) 00:25:00
42.4 none succeeded 5430/5767 N/A N/A Tue Apr 28 2020 17:01:41 GMT+0000 (UTC) 01:33:03
42.5 none failed 3455/3490 N/A N/A Tue Apr 28 2020 17:01:42 GMT+0000 (UTC) 01:38:78


Need help with Shippable? File an Issue


[ master ] Build CANCELED for zephyrproject-rtos/test_results ( add m2gl025_miv platform ) on Shippable.com #builds

Shippable.com <noreply@...>
 

SHIPPABLE BUILD REPORT

41
test_results
Branch : master Sha : b7e17b63fc
Builder : Anas Nashif Triggered By : Anas Nashif
# Runtime Status Tests Branch Coverage Sequence Coverage Triggered at Duration
41.1 none succeeded 827/893 N/A N/A Tue Apr 28 2020 16:04:51 GMT+0000 (UTC) 00:28:81
41.2 none succeeded 1577/1767 N/A N/A Tue Apr 28 2020 16:04:51 GMT+0000 (UTC) 00:25:87
41.3 none succeeded 2724/3005 N/A N/A Tue Apr 28 2020 16:04:51 GMT+0000 (UTC) 00:25:15
41.4 none succeeded 5370/5711 N/A N/A Tue Apr 28 2020 16:04:51 GMT+0000 (UTC) 01:32:33
41.5 none canceled 0/0 N/A N/A Tue Apr 28 2020 16:04:51 GMT+0000 (UTC) 01:42:90


Need help with Shippable? File an Issue


[ master ] Build TIMEOUT for zephyrproject-rtos/ci-test ( ci: bump to docker image v0.11.6 Signed-off-by: Kumar Gala <kumar.gala@linaro.org> ) on Shippable.com #builds

Shippable.com <noreply@...>
 

SHIPPABLE BUILD REPORT

3471
ci-test
Branch : master Sha : 5f112ddcb9
Builder : Kumar Gala Triggered By : Kumar Gala
Custom Environment Variables:
JOB_TRIGGERED_BY_NAME="daily-verify"
JOB_TRIGGERED_BY_ID="23790"
# Runtime Status Tests Branch Coverage Sequence Coverage Triggered at Duration
3471.1 none succeeded 1487/1742 N/A N/A Tue Apr 28 2020 02:05:58 GMT+0000 (UTC) 02:99:28
3471.2 none succeeded 1058/1742 N/A N/A Tue Apr 28 2020 02:05:58 GMT+0000 (UTC) 01:78:88
3471.3 none timeout 0/0 N/A N/A Tue Apr 28 2020 02:05:58 GMT+0000 (UTC) 02:23:60
3471.4 none timeout 0/0 N/A N/A Tue Apr 28 2020 02:05:58 GMT+0000 (UTC) 02:23:60
3471.5 none succeeded 1737/1742 N/A N/A Tue Apr 28 2020 02:05:59 GMT+0000 (UTC) 02:08:04
3471.6 none succeeded 1517/1742 N/A N/A Tue Apr 28 2020 02:05:59 GMT+0000 (UTC) 02:06:70
3471.7 none failed 799/1742 N/A N/A Tue Apr 28 2020 02:05:59 GMT+0000 (UTC) 01:61:47
3471.8 none succeeded 1447/1742 N/A N/A Tue Apr 28 2020 02:05:59 GMT+0000 (UTC) 02:03:85
3471.9 none succeeded 1496/1742 N/A N/A Tue Apr 28 2020 02:05:59 GMT+0000 (UTC) 02:10:06
3471.10 none timeout 1722/1742 N/A N/A Tue Apr 28 2020 02:05:59 GMT+0000 (UTC) 02:23:56
3471.11 none succeeded 1559/1742 N/A N/A Tue Apr 28 2020 02:05:59 GMT+0000 (UTC) 02:10:81
3471.12 none succeeded 1333/1742 N/A N/A Tue Apr 28 2020 02:05:59 GMT+0000 (UTC) 02:11:35
3471.13 none succeeded 1083/1742 N/A N/A Tue Apr 28 2020 02:05:59 GMT+0000 (UTC) 01:85:75
3471.14 none succeeded 1596/1742 N/A N/A Tue Apr 28 2020 02:05:59 GMT+0000 (UTC) 02:16:81
3471.15 none succeeded 1325/1742 N/A N/A Tue Apr 28 2020 02:05:59 GMT+0000 (UTC) 02:93:61
3471.16 none succeeded 1254/1742 N/A N/A Tue Apr 28 2020 02:05:59 GMT+0000 (UTC) 01:88:85
3471.17 none succeeded 1742/1742 N/A N/A Tue Apr 28 2020 02:05:59 GMT+0000 (UTC) 02:08:55
3471.18 none succeeded 1546/1742 N/A N/A Tue Apr 28 2020 02:05:59 GMT+0000 (UTC) 02:11:80
3471.19 none succeeded 1261/1742 N/A N/A Tue Apr 28 2020 02:05:59 GMT+0000 (UTC) 02:00:86
3471.20 none succeeded 1312/1742 N/A N/A Tue Apr 28 2020 02:05:59 GMT+0000 (UTC) 02:06:62
3471.21 none succeeded 1654/1742 N/A N/A Tue Apr 28 2020 02:06:00 GMT+0000 (UTC) 02:17:07
3471.22 none succeeded 1727/1742 N/A N/A Tue Apr 28 2020 02:06:00 GMT+0000 (UTC) 02:21:84
3471.23 none failed 1184/1742 N/A N/A Tue Apr 28 2020 02:06:00 GMT+0000 (UTC) 02:03:80
3471.24 none succeeded 1496/1742 N/A N/A Tue Apr 28 2020 02:06:00 GMT+0000 (UTC) 02:07:01
3471.25 none succeeded 1465/1741 N/A N/A Tue Apr 28 2020 02:06:00 GMT+0000 (UTC) 02:97:41
3471.26 none succeeded 1729/1741 N/A N/A Tue Apr 28 2020 02:06:00 GMT+0000 (UTC) 02:15:06
3471.27 none failed 0/0 N/A N/A Tue Apr 28 2020 02:06:00 GMT+0000 (UTC) 00:01:86
3471.28 none timeout 0/0 N/A N/A Tue Apr 28 2020 02:06:00 GMT+0000 (UTC) 02:24:52
3471.29 none succeeded 1731/1741 N/A N/A Tue Apr 28 2020 02:06:00 GMT+0000 (UTC) 02:18:92
3471.30 none succeeded 1741/1741 N/A N/A Tue Apr 28 2020 02:06:00 GMT+0000 (UTC) 02:06:58


Need help with Shippable? File an Issue


[ master ] Build TIMEOUT for zephyrproject-rtos/ci-test ( ci: bump to docker image v0.11.6 Signed-off-by: Kumar Gala <kumar.gala@linaro.org> ) on Shippable.com #builds

Shippable.com <noreply@...>
 

SHIPPABLE BUILD REPORT

3470
ci-test
Branch : master Sha : 5f112ddcb9
Builder : Kumar Gala Triggered By : Kumar Gala
Custom Environment Variables:
JOB_TRIGGERED_BY_NAME="daily-verify"
JOB_TRIGGERED_BY_ID="23790"
# Runtime Status Tests Branch Coverage Sequence Coverage Triggered at Duration
3470.1 none succeeded 1487/1742 N/A N/A Mon Apr 27 2020 02:05:40 GMT+0000 (UTC) 02:98:96
3470.2 none succeeded 1058/1742 N/A N/A Mon Apr 27 2020 02:05:40 GMT+0000 (UTC) 01:80:09
3470.3 none timeout 0/0 N/A N/A Mon Apr 27 2020 02:05:40 GMT+0000 (UTC) 02:23:80
3470.4 none timeout 0/0 N/A N/A Mon Apr 27 2020 02:05:40 GMT+0000 (UTC) 02:23:80
3470.5 none succeeded 1737/1742 N/A N/A Mon Apr 27 2020 02:05:40 GMT+0000 (UTC) 02:09:70
3470.6 none succeeded 1517/1742 N/A N/A Mon Apr 27 2020 02:05:40 GMT+0000 (UTC) 02:06:76
3470.7 none failed 799/1742 N/A N/A Mon Apr 27 2020 02:05:41 GMT+0000 (UTC) 01:68:62
3470.8 none succeeded 1447/1742 N/A N/A Mon Apr 27 2020 02:05:41 GMT+0000 (UTC) 02:06:41
3470.9 none succeeded 1496/1742 N/A N/A Mon Apr 27 2020 02:05:41 GMT+0000 (UTC) 02:10:14
3470.10 none timeout 0/0 N/A N/A Mon Apr 27 2020 02:05:41 GMT+0000 (UTC) 02:23:77
3470.11 none succeeded 1559/1742 N/A N/A Mon Apr 27 2020 02:05:41 GMT+0000 (UTC) 02:09:38
3470.12 none succeeded 1333/1742 N/A N/A Mon Apr 27 2020 02:05:41 GMT+0000 (UTC) 02:11:83
3470.13 none succeeded 1083/1742 N/A N/A Mon Apr 27 2020 02:05:41 GMT+0000 (UTC) 01:86:42
3470.14 none succeeded 1596/1742 N/A N/A Mon Apr 27 2020 02:05:41 GMT+0000 (UTC) 02:17:20
3470.15 none succeeded 1325/1742 N/A N/A Mon Apr 27 2020 02:05:41 GMT+0000 (UTC) 02:93:72
3470.16 none succeeded 1254/1742 N/A N/A Mon Apr 27 2020 02:05:41 GMT+0000 (UTC) 01:88:85
3470.17 none succeeded 1742/1742 N/A N/A Mon Apr 27 2020 02:05:41 GMT+0000 (UTC) 02:07:35
3470.18 none succeeded 1546/1742 N/A N/A Mon Apr 27 2020 02:05:41 GMT+0000 (UTC) 02:11:69
3470.19 none succeeded 1261/1742 N/A N/A Mon Apr 27 2020 02:05:41 GMT+0000 (UTC) 02:99:64
3470.20 none succeeded 1312/1742 N/A N/A Mon Apr 27 2020 02:05:41 GMT+0000 (UTC) 02:98:96
3470.21 none succeeded 1654/1742 N/A N/A Mon Apr 27 2020 02:05:41 GMT+0000 (UTC) 02:19:15
3470.22 none timeout 1727/1742 N/A N/A Mon Apr 27 2020 02:05:41 GMT+0000 (UTC) 02:23:70
3470.23 none failed 1184/1742 N/A N/A Mon Apr 27 2020 02:05:41 GMT+0000 (UTC) 02:06:55
3470.24 none succeeded 1496/1742 N/A N/A Mon Apr 27 2020 02:05:41 GMT+0000 (UTC) 02:08:73
3470.25 none succeeded 1465/1741 N/A N/A Mon Apr 27 2020 02:05:41 GMT+0000 (UTC) 02:00:02
3470.26 none succeeded 1729/1741 N/A N/A Mon Apr 27 2020 02:05:42 GMT+0000 (UTC) 02:17:48
3470.27 none timeout 0/0 N/A N/A Mon Apr 27 2020 02:05:42 GMT+0000 (UTC) 02:23:67
3470.28 none timeout 0/0 N/A N/A Mon Apr 27 2020 02:05:42 GMT+0000 (UTC) 02:23:67
3470.29 none succeeded 1731/1741 N/A N/A Mon Apr 27 2020 02:05:42 GMT+0000 (UTC) 02:16:78
3470.30 none succeeded 1741/1741 N/A N/A Mon Apr 27 2020 02:05:42 GMT+0000 (UTC) 02:03:80


Need help with Shippable? File an Issue


[ master ] Build SUCCEEDED for zephyrproject-rtos/test_results ( ci: get testcommit from CI prep job Signed-off-by: Anas Nashif <anas.nashif@intel.com> ) on Shippable.com #builds

Shippable.com <noreply@...>
 

SHIPPABLE BUILD REPORT

40
test_results
Branch : master Sha : 6005a66869
Builder : Anas Nashif Triggered By : Anas Nashif
Custom Environment Variables:
JOB_TRIGGERED_BY_NAME="create_test_commit"
JOB_TRIGGERED_BY_ID="125148"
# Runtime Status Tests Branch Coverage Sequence Coverage Triggered at Duration
40.1 none succeeded 774/833 N/A N/A Mon Apr 27 2020 02:58:13 GMT+0000 (UTC) 00:27:17
40.2 none succeeded 1475/1653 N/A N/A Mon Apr 27 2020 02:58:13 GMT+0000 (UTC) 00:23:97
40.3 none succeeded 2563/2823 N/A N/A Mon Apr 27 2020 02:58:13 GMT+0000 (UTC) 00:22:42
40.4 none succeeded 5093/5400 N/A N/A Mon Apr 27 2020 02:58:13 GMT+0000 (UTC) 01:31:37
40.5 none succeeded 3225/3254 N/A N/A Mon Apr 27 2020 02:58:13 GMT+0000 (UTC) 01:32:40


Need help with Shippable? File an Issue


[ master ] Build CANCELED for zephyrproject-rtos/test_results ( ci: get testcommit from CI prep job Signed-off-by: Anas Nashif <anas.nashif@intel.com> ) on Shippable.com #builds

Shippable.com <noreply@...>
 

SHIPPABLE BUILD REPORT

39
test_results
Branch : master Sha : 6005a66869
Builder : Anas Nashif Triggered By : Anas Nashif
# Runtime Status Tests Branch Coverage Sequence Coverage Triggered at Duration
39.1 none canceled 0/0 N/A N/A Mon Apr 27 2020 02:56:23 GMT+0000 (UTC) 00:00:00
39.2 none canceled 0/0 N/A N/A Mon Apr 27 2020 02:56:23 GMT+0000 (UTC) 00:00:00
39.3 none canceled 0/0 N/A N/A Mon Apr 27 2020 02:56:23 GMT+0000 (UTC) 00:00:00
39.4 none canceled 0/0 N/A N/A Mon Apr 27 2020 02:56:23 GMT+0000 (UTC) 00:00:00
39.5 none canceled 0/0 N/A N/A Mon Apr 27 2020 02:56:23 GMT+0000 (UTC) 00:00:00


Need help with Shippable? File an Issue


[ master ] Build CANCELED for zephyrproject-rtos/test_results ( ci: get testcommit from CI prep job Signed-off-by: Anas Nashif <anas.nashif@intel.com> ) on Shippable.com #builds

Shippable.com <noreply@...>
 

SHIPPABLE BUILD REPORT

38
test_results
Branch : master Sha : bf23c28d13
Builder : Anas Nashif Triggered By : Anas Nashif
Custom Environment Variables:
JOB_TRIGGERED_BY_NAME="create_test_commit"
JOB_TRIGGERED_BY_ID="125148"
# Runtime Status Tests Branch Coverage Sequence Coverage Triggered at Duration
38.1 none succeeded 827/893 N/A N/A Mon Apr 27 2020 00:31:58 GMT+0000 (UTC) 00:28:07
38.2 none succeeded 1577/1767 N/A N/A Mon Apr 27 2020 00:31:58 GMT+0000 (UTC) 00:27:25
38.3 none succeeded 2724/3005 N/A N/A Mon Apr 27 2020 00:31:59 GMT+0000 (UTC) 00:28:94
38.4 none succeeded 5370/5711 N/A N/A Mon Apr 27 2020 00:31:59 GMT+0000 (UTC) 01:36:84
38.5 none canceled 0/0 N/A N/A Mon Apr 27 2020 00:31:59 GMT+0000 (UTC) 02:44:70


Need help with Shippable? File an Issue


[ master ] Build CANCELED for zephyrproject-rtos/test_results ( ci: get testcommit from CI prep job Signed-off-by: Anas Nashif <anas.nashif@intel.com> ) on Shippable.com #builds

Shippable.com <noreply@...>
 

SHIPPABLE BUILD REPORT

37
test_results
Branch : master Sha : bf23c28d13
Builder : Anas Nashif Triggered By : Anas Nashif
# Runtime Status Tests Branch Coverage Sequence Coverage Triggered at Duration
37.1 none succeeded 827/893 N/A N/A Sun Apr 26 2020 22:37:43 GMT+0000 (UTC) 00:28:74
37.2 none succeeded 1577/1767 N/A N/A Sun Apr 26 2020 22:37:43 GMT+0000 (UTC) 00:23:07
37.3 none succeeded 2724/3005 N/A N/A Sun Apr 26 2020 22:37:43 GMT+0000 (UTC) 00:24:53
37.4 none succeeded 5370/5711 N/A N/A Sun Apr 26 2020 22:37:43 GMT+0000 (UTC) 01:32:06
37.5 none canceled 0/0 N/A N/A Sun Apr 26 2020 22:37:43 GMT+0000 (UTC) 02:12:32


Need help with Shippable? File an Issue