Date   
[ master ] Build FAILED for zephyrproject-rtos/test_results ( zephyr-v2.3.0-437-gb5764f9902: Intel Master Daily Test Report Intel Zephyr Daily Test Report for the master branch Signed-off-by: Maksim Masalski <maksim.masalski@intel.com> ) on Shippable.com #builds

Shippable.com <noreply@...>
 

SHIPPABLE BUILD REPORT

111
test_results
Branch : master Sha : 1fd961dad1
Builder : Maksim Masalski Triggered By : Anas Nashif
Custom Environment Variables:
JOB_TRIGGERED_BY_NAME="create_test_commit"
JOB_TRIGGERED_BY_ID="125148"
# Runtime Status Tests Branch Coverage Sequence Coverage Triggered at Duration
111.1 none succeeded 0/0 N/A N/A Thu Jul 02 2020 04:07:27 GMT+0000 (UTC) 00:22:28
111.2 none succeeded 0/0 N/A N/A Thu Jul 02 2020 04:07:27 GMT+0000 (UTC) 00:18:92
111.3 none succeeded 0/0 N/A N/A Thu Jul 02 2020 04:07:27 GMT+0000 (UTC) 00:21:80
111.4 none succeeded 0/0 N/A N/A Thu Jul 02 2020 04:07:27 GMT+0000 (UTC) 00:24:14
111.5 none succeeded 0/0 N/A N/A Thu Jul 02 2020 04:07:27 GMT+0000 (UTC) 00:23:82
111.6 none succeeded 0/0 N/A N/A Thu Jul 02 2020 04:07:28 GMT+0000 (UTC) 00:22:03
111.7 none failed 0/0 N/A N/A Thu Jul 02 2020 04:07:28 GMT+0000 (UTC) 00:30:95
111.8 none succeeded 0/0 N/A N/A Thu Jul 02 2020 04:07:28 GMT+0000 (UTC) 00:27:91
111.9 none succeeded 0/0 N/A N/A Thu Jul 02 2020 04:07:28 GMT+0000 (UTC) 01:34:51
111.10 none succeeded 0/0 N/A N/A Thu Jul 02 2020 04:07:28 GMT+0000 (UTC) 01:32:46


Need help with Shippable? File an Issue

[Failed] Zephyr / zephyr-daily #12 (master) #builds

Buildkite <notifications@...>
 

Scheduled build Duration: 3 hours, 4 minutes, 8 seconds
Build #12 | master | b466e57
View Build →

[ master ] Build TIMEOUT for zephyrproject-rtos/ci-test ( ci: Update sdk to 0.11.3 Update sdk to 0.11.3 release and update docker image to get that SDK version. Signed-off-by: Kumar Gala <kumar.gala@linaro.org> ) on Shippable.com #builds

Shippable.com <noreply@...>
 

SHIPPABLE BUILD REPORT

3536
ci-test
Branch : master Sha : 5f9e0cfc3c
Builder : Kumar Gala Triggered By : Kumar Gala
Custom Environment Variables:
JOB_TRIGGERED_BY_NAME="daily-verify"
JOB_TRIGGERED_BY_ID="23790"
# Runtime Status Tests Branch Coverage Sequence Coverage Triggered at Duration
3536.1 none succeeded 1483/1709 N/A N/A Wed Jul 01 2020 02:06:00 GMT+0000 (UTC) 02:05:04
3536.2 none failed 847/1709 N/A N/A Wed Jul 01 2020 02:06:01 GMT+0000 (UTC) 01:79:14
3536.3 none timeout 0/0 N/A N/A Wed Jul 01 2020 02:06:01 GMT+0000 (UTC) 02:22:25
3536.4 none timeout 0/0 N/A N/A Wed Jul 01 2020 02:06:01 GMT+0000 (UTC) 02:22:24
3536.5 none succeeded 1701/1708 N/A N/A Wed Jul 01 2020 02:06:01 GMT+0000 (UTC) 02:09:51
3536.6 none timeout 0/0 N/A N/A Wed Jul 01 2020 02:06:01 GMT+0000 (UTC) 02:22:23
3536.7 none succeeded 1196/1708 N/A N/A Wed Jul 01 2020 02:06:01 GMT+0000 (UTC) 02:18:90
3536.8 none failed 924/1708 N/A N/A Wed Jul 01 2020 02:06:01 GMT+0000 (UTC) 01:84:19
3536.9 none failed 1475/1708 N/A N/A Wed Jul 01 2020 02:06:01 GMT+0000 (UTC) 02:19:64
3536.10 none timeout 1452/1708 N/A N/A Wed Jul 01 2020 02:06:01 GMT+0000 (UTC) 02:22:21
3536.11 none timeout 0/0 N/A N/A Wed Jul 01 2020 02:06:01 GMT+0000 (UTC) 02:22:20
3536.12 none timeout 0/0 N/A N/A Wed Jul 01 2020 02:06:01 GMT+0000 (UTC) 02:22:20
3536.13 none succeeded 1375/1708 N/A N/A Wed Jul 01 2020 02:06:01 GMT+0000 (UTC) 02:18:07
3536.14 none succeeded 1304/1708 N/A N/A Wed Jul 01 2020 02:06:01 GMT+0000 (UTC) 02:15:89
3536.15 none succeeded 1125/1708 N/A N/A Wed Jul 01 2020 02:06:01 GMT+0000 (UTC) 02:91:78
3536.16 none failed 1427/1708 N/A N/A Wed Jul 01 2020 02:06:01 GMT+0000 (UTC) 02:19:48
3536.17 none succeeded 1207/1708 N/A N/A Wed Jul 01 2020 02:06:01 GMT+0000 (UTC) 02:09:40
3536.18 none succeeded 1683/1708 N/A N/A Wed Jul 01 2020 02:06:01 GMT+0000 (UTC) 02:17:91
3536.19 none succeeded 1181/1708 N/A N/A Wed Jul 01 2020 02:06:01 GMT+0000 (UTC) 02:95:94
3536.20 none succeeded 1677/1708 N/A N/A Wed Jul 01 2020 02:06:01 GMT+0000 (UTC) 02:16:42
3536.21 none timeout 0/0 N/A N/A Wed Jul 01 2020 02:06:01 GMT+0000 (UTC) 02:22:15
3536.22 none succeeded 1282/1708 N/A N/A Wed Jul 01 2020 02:06:01 GMT+0000 (UTC) 02:22:94
3536.23 none succeeded 1275/1708 N/A N/A Wed Jul 01 2020 02:06:01 GMT+0000 (UTC) 02:07:18
3536.24 none succeeded 1337/1708 N/A N/A Wed Jul 01 2020 02:06:02 GMT+0000 (UTC) 02:16:45
3536.25 none timeout 0/0 N/A N/A Wed Jul 01 2020 02:06:02 GMT+0000 (UTC) 02:22:13
3536.26 none timeout 0/0 N/A N/A Wed Jul 01 2020 02:06:02 GMT+0000 (UTC) 02:22:12
3536.27 none succeeded 1101/1708 N/A N/A Wed Jul 01 2020 02:06:02 GMT+0000 (UTC) 02:10:17
3536.28 none timeout 0/0 N/A N/A Wed Jul 01 2020 02:06:02 GMT+0000 (UTC) 02:22:11
3536.29 none succeeded 1411/1708 N/A N/A Wed Jul 01 2020 02:06:02 GMT+0000 (UTC) 02:13:96
3536.30 none timeout 0/0 N/A N/A Wed Jul 01 2020 02:06:02 GMT+0000 (UTC) 02:22:10
3536.31 none timeout 0/0 N/A N/A Wed Jul 01 2020 02:06:02 GMT+0000 (UTC) 02:23:08
3536.32 none timeout 0/0 N/A N/A Wed Jul 01 2020 02:06:02 GMT+0000 (UTC) 02:23:00
3536.33 none timeout 0/0 N/A N/A Wed Jul 01 2020 02:06:02 GMT+0000 (UTC) 02:21:34
3536.34 none succeeded 1698/1708 N/A N/A Wed Jul 01 2020 02:06:02 GMT+0000 (UTC) 02:20:10
3536.35 none failed 1707/1708 N/A N/A Wed Jul 01 2020 02:06:02 GMT+0000 (UTC) 02:15:17


Need help with Shippable? File an Issue

[ master ] Build FAILED for zephyrproject-rtos/test_results ( zephyr-v2.3.0-361-gcf72fe8fe9: arc em_starterkit_em9d results em_starterkit_em9d: 142 tests passed, 1 failed, 29 skipped 143 tests executed on platforms, 29 tests were only build samples/posix/eventfd/sample.posix.eventfd failed timeout Signed-off-by: Jingru Wang <jingru@synopsys.com> ) on Shippable.com #builds

Shippable.com <noreply@...>
 

SHIPPABLE BUILD REPORT

110
test_results
Branch : master Sha : 9f5377e91d
Builder : wangnuannuan Triggered By : Anas Nashif
Custom Environment Variables:
JOB_TRIGGERED_BY_NAME="create_test_commit"
JOB_TRIGGERED_BY_ID="125148"
# Runtime Status Tests Branch Coverage Sequence Coverage Triggered at Duration
110.1 none succeeded 0/0 N/A N/A Wed Jul 01 2020 04:07:54 GMT+0000 (UTC) 00:23:65
110.2 none succeeded 0/0 N/A N/A Wed Jul 01 2020 04:07:54 GMT+0000 (UTC) 00:18:81
110.3 none succeeded 0/0 N/A N/A Wed Jul 01 2020 04:07:54 GMT+0000 (UTC) 00:18:60
110.4 none succeeded 0/0 N/A N/A Wed Jul 01 2020 04:07:54 GMT+0000 (UTC) 00:19:63
110.5 none succeeded 0/0 N/A N/A Wed Jul 01 2020 04:07:55 GMT+0000 (UTC) 00:18:99
110.6 none succeeded 0/0 N/A N/A Wed Jul 01 2020 04:07:55 GMT+0000 (UTC) 00:19:36
110.7 none failed 0/0 N/A N/A Wed Jul 01 2020 04:07:55 GMT+0000 (UTC) 00:26:80
110.8 none succeeded 0/0 N/A N/A Wed Jul 01 2020 04:07:55 GMT+0000 (UTC) 00:23:09
110.9 none succeeded 0/0 N/A N/A Wed Jul 01 2020 04:07:55 GMT+0000 (UTC) 01:30:04
110.10 none succeeded 0/0 N/A N/A Wed Jul 01 2020 04:07:55 GMT+0000 (UTC) 00:28:93


Need help with Shippable? File an Issue

[Canceled] Zephyr / zephyr-daily #8 (master) #builds

Buildkite <notifications@...>
 

Scheduled build Duration: 19 minutes, 50 seconds
Build #8 | master | 83f7f81
View Build →

[ master ] Build TIMEOUT for zephyrproject-rtos/ci-test ( ci: Update sdk to 0.11.3 Update sdk to 0.11.3 release and update docker image to get that SDK version. Signed-off-by: Kumar Gala <kumar.gala@linaro.org> ) on Shippable.com #builds

Shippable.com <noreply@...>
 

SHIPPABLE BUILD REPORT

3535
ci-test
Branch : master Sha : 5f9e0cfc3c
Builder : Kumar Gala Triggered By : Kumar Gala
Custom Environment Variables:
JOB_TRIGGERED_BY_NAME="daily-verify"
JOB_TRIGGERED_BY_ID="23790"
# Runtime Status Tests Branch Coverage Sequence Coverage Triggered at Duration
3535.1 none succeeded 1483/1709 N/A N/A Tue Jun 30 2020 02:05:50 GMT+0000 (UTC) 02:03:04
3535.2 none failed 843/1709 N/A N/A Tue Jun 30 2020 02:05:50 GMT+0000 (UTC) 01:79:22
3535.3 none timeout 0/0 N/A N/A Tue Jun 30 2020 02:05:50 GMT+0000 (UTC) 02:21:56
3535.4 none timeout 0/0 N/A N/A Tue Jun 30 2020 02:05:50 GMT+0000 (UTC) 02:21:56
3535.5 none succeeded 1701/1708 N/A N/A Tue Jun 30 2020 02:05:50 GMT+0000 (UTC) 02:11:47
3535.6 none timeout 0/0 N/A N/A Tue Jun 30 2020 02:05:50 GMT+0000 (UTC) 02:21:55
3535.7 none succeeded 1196/1708 N/A N/A Tue Jun 30 2020 02:05:50 GMT+0000 (UTC) 02:20:78
3535.8 none failed 924/1708 N/A N/A Tue Jun 30 2020 02:05:50 GMT+0000 (UTC) 01:82:06
3535.9 none failed 1475/1708 N/A N/A Tue Jun 30 2020 02:05:50 GMT+0000 (UTC) 02:21:40
3535.10 none timeout 0/0 N/A N/A Tue Jun 30 2020 02:05:50 GMT+0000 (UTC) 02:21:52
3535.11 none timeout 0/0 N/A N/A Tue Jun 30 2020 02:05:50 GMT+0000 (UTC) 02:21:52
3535.12 none timeout 0/0 N/A N/A Tue Jun 30 2020 02:05:51 GMT+0000 (UTC) 02:21:51
3535.13 none succeeded 1375/1708 N/A N/A Tue Jun 30 2020 02:05:51 GMT+0000 (UTC) 02:17:18
3535.14 none succeeded 1304/1708 N/A N/A Tue Jun 30 2020 02:05:51 GMT+0000 (UTC) 02:13:76
3535.15 none succeeded 1125/1708 N/A N/A Tue Jun 30 2020 02:05:51 GMT+0000 (UTC) 02:92:49
3535.16 none failed 1427/1708 N/A N/A Tue Jun 30 2020 02:05:51 GMT+0000 (UTC) 02:18:89
3535.17 none succeeded 1207/1708 N/A N/A Tue Jun 30 2020 02:05:51 GMT+0000 (UTC) 02:11:61
3535.18 none succeeded 1683/1708 N/A N/A Tue Jun 30 2020 02:05:51 GMT+0000 (UTC) 02:17:96
3535.19 none succeeded 1181/1708 N/A N/A Tue Jun 30 2020 02:05:51 GMT+0000 (UTC) 02:96:87
3535.20 none succeeded 1677/1708 N/A N/A Tue Jun 30 2020 02:05:51 GMT+0000 (UTC) 02:16:51
3535.21 none timeout 0/0 N/A N/A Tue Jun 30 2020 02:05:51 GMT+0000 (UTC) 02:21:46
3535.22 none succeeded 1282/1708 N/A N/A Tue Jun 30 2020 02:05:51 GMT+0000 (UTC) 02:17:03
3535.23 none succeeded 1275/1708 N/A N/A Tue Jun 30 2020 02:05:51 GMT+0000 (UTC) 02:10:82
3535.24 none succeeded 1337/1708 N/A N/A Tue Jun 30 2020 02:05:51 GMT+0000 (UTC) 02:18:61
3535.25 none timeout 0/0 N/A N/A Tue Jun 30 2020 02:05:51 GMT+0000 (UTC) 02:21:44
3535.26 none timeout 0/0 N/A N/A Tue Jun 30 2020 02:05:51 GMT+0000 (UTC) 02:21:44
3535.27 none succeeded 1101/1708 N/A N/A Tue Jun 30 2020 02:05:51 GMT+0000 (UTC) 02:08:57
3535.28 none timeout 0/0 N/A N/A Tue Jun 30 2020 02:05:51 GMT+0000 (UTC) 02:21:43
3535.29 none succeeded 1411/1708 N/A N/A Tue Jun 30 2020 02:05:51 GMT+0000 (UTC) 02:13:76
3535.30 none timeout 0/0 N/A N/A Tue Jun 30 2020 02:05:52 GMT+0000 (UTC) 02:21:41
3535.31 none timeout 0/0 N/A N/A Tue Jun 30 2020 02:05:52 GMT+0000 (UTC) 02:22:35
3535.32 none timeout 0/0 N/A N/A Tue Jun 30 2020 02:05:52 GMT+0000 (UTC) 02:24:39
3535.33 none timeout 0/0 N/A N/A Tue Jun 30 2020 02:05:52 GMT+0000 (UTC) 02:23:74
3535.34 none succeeded 1698/1708 N/A N/A Tue Jun 30 2020 02:05:52 GMT+0000 (UTC) 02:22:25
3535.35 none failed 1707/1708 N/A N/A Tue Jun 30 2020 02:05:52 GMT+0000 (UTC) 02:16:32


Need help with Shippable? File an Issue

[ master ] Build SUCCEEDED for zephyrproject-rtos/test_results ( zephyr-v2.3.0-641-gb5fb9497b6: stm32 results Non reg result analysis on last run: (verdicts: T/p: Passed, F/f: Failed, t:timeout) tests/kernel/fpu_sharing/float_disable/kernel.fpu_sharing.float_disable.arm, nucleo_l4r5zi (instable: pfpfppppppppppppp) tests/kernel/mem_protect/userspace/kernel.memory_protection.userspace, disco_l475_iot1 (instable: pppppppttpppppppp) Total: 19 test(s) failed out of 1802 tests run 0 regression(s) on stable test Signed-off-by: Erwan Gouriou <erwan.gouriou@linaro.org> ) on Shippable.com #builds

Shippable.com <noreply@...>
 

SHIPPABLE BUILD REPORT

109
test_results
Branch : master Sha : 9910bd763a
Builder : Erwan Gouriou Triggered By : Anas Nashif
Custom Environment Variables:
JOB_TRIGGERED_BY_NAME="create_test_commit"
JOB_TRIGGERED_BY_ID="125148"
# Runtime Status Tests Branch Coverage Sequence Coverage Triggered at Duration
109.1 none succeeded 0/0 N/A N/A Tue Jun 30 2020 04:08:08 GMT+0000 (UTC) 00:22:39
109.2 none succeeded 0/0 N/A N/A Tue Jun 30 2020 04:08:08 GMT+0000 (UTC) 00:17:30
109.3 none succeeded 0/0 N/A N/A Tue Jun 30 2020 04:08:08 GMT+0000 (UTC) 00:17:10
109.4 none succeeded 0/0 N/A N/A Tue Jun 30 2020 04:08:08 GMT+0000 (UTC) 00:17:28
109.5 none succeeded 0/0 N/A N/A Tue Jun 30 2020 04:08:08 GMT+0000 (UTC) 00:17:25
109.6 none succeeded 0/0 N/A N/A Tue Jun 30 2020 04:08:08 GMT+0000 (UTC) 00:20:18
109.7 none succeeded 0/0 N/A N/A Tue Jun 30 2020 04:08:08 GMT+0000 (UTC) 00:22:02
109.8 none succeeded 0/0 N/A N/A Tue Jun 30 2020 04:08:08 GMT+0000 (UTC) 00:23:99
109.9 none succeeded 0/0 N/A N/A Tue Jun 30 2020 04:08:08 GMT+0000 (UTC) 01:30:14
109.10 none succeeded 0/0 N/A N/A Tue Jun 30 2020 04:08:08 GMT+0000 (UTC) 00:26:42


Need help with Shippable? File an Issue

[ master ] Build TIMEOUT for zephyrproject-rtos/ci-test ( ci: Update sdk to 0.11.3 Update sdk to 0.11.3 release and update docker image to get that SDK version. Signed-off-by: Kumar Gala <kumar.gala@linaro.org> ) on Shippable.com #builds

Shippable.com <noreply@...>
 

SHIPPABLE BUILD REPORT

3534
ci-test
Branch : master Sha : 5f9e0cfc3c
Builder : Kumar Gala Triggered By : Kumar Gala
Custom Environment Variables:
JOB_TRIGGERED_BY_NAME="daily-verify"
JOB_TRIGGERED_BY_ID="23790"
# Runtime Status Tests Branch Coverage Sequence Coverage Triggered at Duration
3534.1 none succeeded 1483/1709 N/A N/A Mon Jun 29 2020 02:05:32 GMT+0000 (UTC) 02:04:35
3534.2 none failed 843/1709 N/A N/A Mon Jun 29 2020 02:05:33 GMT+0000 (UTC) 01:78:09
3534.3 none timeout 0/0 N/A N/A Mon Jun 29 2020 02:05:33 GMT+0000 (UTC) 02:21:72
3534.4 none timeout 0/0 N/A N/A Mon Jun 29 2020 02:05:33 GMT+0000 (UTC) 02:21:71
3534.5 none succeeded 1701/1708 N/A N/A Mon Jun 29 2020 02:05:33 GMT+0000 (UTC) 02:12:27
3534.6 none timeout 0/0 N/A N/A Mon Jun 29 2020 02:05:33 GMT+0000 (UTC) 02:21:70
3534.7 none succeeded 1196/1708 N/A N/A Mon Jun 29 2020 02:05:33 GMT+0000 (UTC) 02:08:92
3534.8 none failed 924/1708 N/A N/A Mon Jun 29 2020 02:05:33 GMT+0000 (UTC) 01:83:58
3534.9 none failed 1475/1708 N/A N/A Mon Jun 29 2020 02:05:33 GMT+0000 (UTC) 02:20:18
3534.10 none timeout 1452/1708 N/A N/A Mon Jun 29 2020 02:05:33 GMT+0000 (UTC) 02:21:68
3534.11 none timeout 0/0 N/A N/A Mon Jun 29 2020 02:05:33 GMT+0000 (UTC) 02:21:68
3534.12 none timeout 0/0 N/A N/A Mon Jun 29 2020 02:05:33 GMT+0000 (UTC) 02:21:67
3534.13 none succeeded 1375/1708 N/A N/A Mon Jun 29 2020 02:05:33 GMT+0000 (UTC) 02:17:19
3534.14 none succeeded 1304/1708 N/A N/A Mon Jun 29 2020 02:05:33 GMT+0000 (UTC) 02:12:49
3534.15 none succeeded 1125/1708 N/A N/A Mon Jun 29 2020 02:05:33 GMT+0000 (UTC) 02:91:40
3534.16 none failed 1427/1708 N/A N/A Mon Jun 29 2020 02:05:33 GMT+0000 (UTC) 02:15:92
3534.17 none succeeded 1207/1708 N/A N/A Mon Jun 29 2020 02:05:33 GMT+0000 (UTC) 02:07:99
3534.18 none succeeded 1683/1708 N/A N/A Mon Jun 29 2020 02:05:34 GMT+0000 (UTC) 02:15:21
3534.19 none succeeded 1181/1708 N/A N/A Mon Jun 29 2020 02:05:34 GMT+0000 (UTC) 02:92:35
3534.20 none succeeded 1677/1708 N/A N/A Mon Jun 29 2020 02:05:34 GMT+0000 (UTC) 02:15:79
3534.21 none timeout 0/0 N/A N/A Mon Jun 29 2020 02:05:34 GMT+0000 (UTC) 02:24:23
3534.22 none succeeded 1282/1708 N/A N/A Mon Jun 29 2020 02:05:34 GMT+0000 (UTC) 02:14:51
3534.23 none succeeded 1275/1708 N/A N/A Mon Jun 29 2020 02:05:34 GMT+0000 (UTC) 02:06:57
3534.24 none succeeded 1337/1708 N/A N/A Mon Jun 29 2020 02:05:34 GMT+0000 (UTC) 02:17:04
3534.25 none timeout 0/0 N/A N/A Mon Jun 29 2020 02:05:34 GMT+0000 (UTC) 02:23:65
3534.26 none timeout 0/0 N/A N/A Mon Jun 29 2020 02:05:34 GMT+0000 (UTC) 02:20:28
3534.27 none succeeded 1101/1708 N/A N/A Mon Jun 29 2020 02:05:34 GMT+0000 (UTC) 02:06:86
3534.28 none timeout 0/0 N/A N/A Mon Jun 29 2020 02:05:34 GMT+0000 (UTC) 02:20:06
3534.29 none succeeded 1411/1708 N/A N/A Mon Jun 29 2020 02:05:34 GMT+0000 (UTC) 02:01:40
3534.30 none timeout 0/0 N/A N/A Mon Jun 29 2020 02:05:34 GMT+0000 (UTC) 02:23:01
3534.31 none timeout 0/0 N/A N/A Mon Jun 29 2020 02:05:34 GMT+0000 (UTC) 02:22:41
3534.32 none timeout 0/0 N/A N/A Mon Jun 29 2020 02:05:34 GMT+0000 (UTC) 02:20:22
3534.33 none timeout 0/0 N/A N/A Mon Jun 29 2020 02:05:34 GMT+0000 (UTC) 02:24:62
3534.34 none succeeded 1698/1708 N/A N/A Mon Jun 29 2020 02:05:35 GMT+0000 (UTC) 02:19:20
3534.35 none failed 1707/1708 N/A N/A Mon Jun 29 2020 02:05:35 GMT+0000 (UTC) 02:05:11


Need help with Shippable? File an Issue

[ master ] Build FAILED for zephyrproject-rtos/test_results ( zephyr-v2.3.0-618-ga53c813ac5: stm32 results Non reg result analysis on last run: (verdicts: T/p: Passed, F/f: Failed, t:timeout) samples/subsys/nvs/sample.nvs.basic, disco_l475_iot1 (instable: pttpttptttpttpttt) tests/kernel/mem_protect/userspace/kernel.memory_protection.userspace, nucleo_l4r5zi tests/kernel/timer/timer_api/kernel.timer, nucleo_f103rb tests/net/utils/net.util, nucleo_f429zi tests/net/utils/net.util, nucleo_f746zg tests/posix/common/portability.posix.common.newlib, nucleo_wb55rg Total: 18 test(s) failed out of 1799 tests run 5 regression(s) on stable test Signed-off-by: Erwan Gouriou <erwan.gouriou@linaro.org> ) on Shippable.com #builds

Shippable.com <noreply@...>
 

SHIPPABLE BUILD REPORT

108
test_results
Branch : master Sha : e88bee4aa8
Builder : Erwan Gouriou Triggered By : Anas Nashif
Custom Environment Variables:
JOB_TRIGGERED_BY_NAME="create_test_commit"
JOB_TRIGGERED_BY_ID="125148"
# Runtime Status Tests Branch Coverage Sequence Coverage Triggered at Duration
108.1 none succeeded 0/0 N/A N/A Mon Jun 29 2020 04:06:23 GMT+0000 (UTC) 00:22:33
108.2 none succeeded 0/0 N/A N/A Mon Jun 29 2020 04:06:23 GMT+0000 (UTC) 00:18:70
108.3 none succeeded 0/0 N/A N/A Mon Jun 29 2020 04:06:23 GMT+0000 (UTC) 00:22:37
108.4 none succeeded 0/0 N/A N/A Mon Jun 29 2020 04:06:23 GMT+0000 (UTC) 00:23:02
108.5 none succeeded 0/0 N/A N/A Mon Jun 29 2020 04:06:23 GMT+0000 (UTC) 00:25:79
108.6 none succeeded 0/0 N/A N/A Mon Jun 29 2020 04:06:23 GMT+0000 (UTC) 00:20:09
108.7 none failed 0/0 N/A N/A Mon Jun 29 2020 04:06:23 GMT+0000 (UTC) 00:27:47
108.8 none succeeded 0/0 N/A N/A Mon Jun 29 2020 04:06:23 GMT+0000 (UTC) 00:23:98
108.9 none succeeded 0/0 N/A N/A Mon Jun 29 2020 04:06:23 GMT+0000 (UTC) 01:31:51
108.10 none succeeded 0/0 N/A N/A Mon Jun 29 2020 04:06:23 GMT+0000 (UTC) 00:28:65


Need help with Shippable? File an Issue

[ master ] Build TIMEOUT for zephyrproject-rtos/ci-test ( ci: Update sdk to 0.11.3 Update sdk to 0.11.3 release and update docker image to get that SDK version. Signed-off-by: Kumar Gala <kumar.gala@linaro.org> ) on Shippable.com #builds

Shippable.com <noreply@...>
 

SHIPPABLE BUILD REPORT

3533
ci-test
Branch : master Sha : 5f9e0cfc3c
Builder : Kumar Gala Triggered By : Kumar Gala
Custom Environment Variables:
JOB_TRIGGERED_BY_NAME="daily-verify"
JOB_TRIGGERED_BY_ID="23790"
# Runtime Status Tests Branch Coverage Sequence Coverage Triggered at Duration
3533.1 none succeeded 1483/1709 N/A N/A Sun Jun 28 2020 02:06:00 GMT+0000 (UTC) 02:04:25
3533.2 none failed 843/1709 N/A N/A Sun Jun 28 2020 02:06:00 GMT+0000 (UTC) 01:72:46
3533.3 none timeout 0/0 N/A N/A Sun Jun 28 2020 02:06:00 GMT+0000 (UTC) 02:25:97
3533.4 none timeout 0/0 N/A N/A Sun Jun 28 2020 02:06:00 GMT+0000 (UTC) 02:25:96
3533.5 none succeeded 1701/1708 N/A N/A Sun Jun 28 2020 02:06:00 GMT+0000 (UTC) 02:09:62
3533.6 none succeeded 1706/1708 N/A N/A Sun Jun 28 2020 02:06:00 GMT+0000 (UTC) 02:23:61
3533.7 none succeeded 1196/1708 N/A N/A Sun Jun 28 2020 02:06:00 GMT+0000 (UTC) 02:18:89
3533.8 none failed 924/1708 N/A N/A Sun Jun 28 2020 02:06:00 GMT+0000 (UTC) 01:83:55
3533.9 none failed 1475/1708 N/A N/A Sun Jun 28 2020 02:06:00 GMT+0000 (UTC) 02:20:23
3533.10 none timeout 1452/1708 N/A N/A Sun Jun 28 2020 02:06:00 GMT+0000 (UTC) 02:25:93
3533.11 none timeout 0/0 N/A N/A Sun Jun 28 2020 02:06:01 GMT+0000 (UTC) 02:25:92
3533.12 none timeout 0/0 N/A N/A Sun Jun 28 2020 02:06:01 GMT+0000 (UTC) 02:25:92
3533.13 none succeeded 1375/1708 N/A N/A Sun Jun 28 2020 02:06:01 GMT+0000 (UTC) 02:21:54
3533.14 none succeeded 1304/1708 N/A N/A Sun Jun 28 2020 02:06:01 GMT+0000 (UTC) 02:16:44
3533.15 none succeeded 1125/1708 N/A N/A Sun Jun 28 2020 02:06:01 GMT+0000 (UTC) 02:99:42
3533.16 none timeout 0/0 N/A N/A Sun Jun 28 2020 02:06:01 GMT+0000 (UTC) 02:25:90
3533.17 none succeeded 1207/1708 N/A N/A Sun Jun 28 2020 02:06:01 GMT+0000 (UTC) 02:14:32
3533.18 none succeeded 1683/1708 N/A N/A Sun Jun 28 2020 02:06:01 GMT+0000 (UTC) 02:19:14
3533.19 none succeeded 1181/1708 N/A N/A Sun Jun 28 2020 02:06:01 GMT+0000 (UTC) 02:96:58
3533.20 none succeeded 1677/1708 N/A N/A Sun Jun 28 2020 02:06:01 GMT+0000 (UTC) 02:18:79
3533.21 none timeout 0/0 N/A N/A Sun Jun 28 2020 02:06:01 GMT+0000 (UTC) 02:25:87
3533.22 none succeeded 1282/1708 N/A N/A Sun Jun 28 2020 02:06:01 GMT+0000 (UTC) 02:14:63
3533.23 none succeeded 1275/1708 N/A N/A Sun Jun 28 2020 02:06:01 GMT+0000 (UTC) 02:09:35
3533.24 none succeeded 1337/1708 N/A N/A Sun Jun 28 2020 02:06:01 GMT+0000 (UTC) 02:23:83
3533.25 none timeout 0/0 N/A N/A Sun Jun 28 2020 02:06:01 GMT+0000 (UTC) 02:25:85
3533.26 none timeout 0/0 N/A N/A Sun Jun 28 2020 02:06:01 GMT+0000 (UTC) 02:25:84
3533.27 none succeeded 1101/1708 N/A N/A Sun Jun 28 2020 02:06:01 GMT+0000 (UTC) 02:09:46
3533.28 none timeout 0/0 N/A N/A Sun Jun 28 2020 02:06:01 GMT+0000 (UTC) 02:25:83
3533.29 none succeeded 1411/1708 N/A N/A Sun Jun 28 2020 02:06:01 GMT+0000 (UTC) 02:14:20
3533.30 none timeout 0/0 N/A N/A Sun Jun 28 2020 02:06:02 GMT+0000 (UTC) 02:25:82
3533.31 none timeout 0/0 N/A N/A Sun Jun 28 2020 02:06:02 GMT+0000 (UTC) 02:23:52
3533.32 none timeout 0/0 N/A N/A Sun Jun 28 2020 02:06:02 GMT+0000 (UTC) 02:22:36
3533.33 none timeout 0/0 N/A N/A Sun Jun 28 2020 02:06:02 GMT+0000 (UTC) 02:24:31
3533.34 none timeout 0/0 N/A N/A Sun Jun 28 2020 02:06:02 GMT+0000 (UTC) 02:21:50
3533.35 none failed 1707/1708 N/A N/A Sun Jun 28 2020 02:06:02 GMT+0000 (UTC) 02:16:56


Need help with Shippable? File an Issue

[ master ] Build SUCCEEDED for zephyrproject-rtos/test_results ( zephyr-v2.3.0-618-ga53c813ac5: stm32 results Non reg result analysis on last run: (verdicts: T/p: Passed, F/f: Failed, t:timeout) samples/subsys/nvs/sample.nvs.basic, disco_l475_iot1 (instable: pttpttptttpttpttt) tests/kernel/mem_protect/userspace/kernel.memory_protection.userspace, nucleo_l4r5zi tests/kernel/timer/timer_api/kernel.timer, nucleo_f103rb tests/net/utils/net.util, nucleo_f429zi tests/net/utils/net.util, nucleo_f746zg tests/posix/common/portability.posix.common.newlib, nucleo_wb55rg Total: 18 test(s) failed out of 1799 tests run 5 regression(s) on stable test Signed-off-by: Erwan Gouriou <erwan.gouriou@linaro.org> ) on Shippable.com #builds

Shippable.com <noreply@...>
 

SHIPPABLE BUILD REPORT

107
test_results
Branch : master Sha : e88bee4aa8
Builder : Erwan Gouriou Triggered By : Anas Nashif
Custom Environment Variables:
JOB_TRIGGERED_BY_NAME="create_test_commit"
JOB_TRIGGERED_BY_ID="125148"
# Runtime Status Tests Branch Coverage Sequence Coverage Triggered at Duration
107.1 none succeeded 0/0 N/A N/A Sun Jun 28 2020 04:07:34 GMT+0000 (UTC) 00:23:57
107.2 none succeeded 0/0 N/A N/A Sun Jun 28 2020 04:07:34 GMT+0000 (UTC) 00:18:58
107.3 none succeeded 0/0 N/A N/A Sun Jun 28 2020 04:07:34 GMT+0000 (UTC) 00:20:02
107.4 none succeeded 0/0 N/A N/A Sun Jun 28 2020 04:07:34 GMT+0000 (UTC) 00:22:17
107.5 none succeeded 0/0 N/A N/A Sun Jun 28 2020 04:07:34 GMT+0000 (UTC) 00:23:83
107.6 none succeeded 0/0 N/A N/A Sun Jun 28 2020 04:07:34 GMT+0000 (UTC) 00:23:90
107.7 none succeeded 0/0 N/A N/A Sun Jun 28 2020 04:07:34 GMT+0000 (UTC) 00:28:91
107.8 none succeeded 0/0 N/A N/A Sun Jun 28 2020 04:07:34 GMT+0000 (UTC) 00:26:62
107.9 none succeeded 0/0 N/A N/A Sun Jun 28 2020 04:07:34 GMT+0000 (UTC) 01:34:56
107.10 none succeeded 0/0 N/A N/A Sun Jun 28 2020 04:07:35 GMT+0000 (UTC) 01:31:45


Need help with Shippable? File an Issue

[ master ] Build TIMEOUT for zephyrproject-rtos/ci-test ( ci: Update sdk to 0.11.3 Update sdk to 0.11.3 release and update docker image to get that SDK version. Signed-off-by: Kumar Gala <kumar.gala@linaro.org> ) on Shippable.com #builds

Shippable.com <noreply@...>
 

SHIPPABLE BUILD REPORT

3532
ci-test
Branch : master Sha : 5f9e0cfc3c
Builder : Kumar Gala Triggered By : Kumar Gala
Custom Environment Variables:
JOB_TRIGGERED_BY_NAME="daily-verify"
JOB_TRIGGERED_BY_ID="23790"
# Runtime Status Tests Branch Coverage Sequence Coverage Triggered at Duration
3532.1 none succeeded 1483/1709 N/A N/A Sat Jun 27 2020 02:05:15 GMT+0000 (UTC) 02:05:00
3532.2 none failed 843/1709 N/A N/A Sat Jun 27 2020 02:05:15 GMT+0000 (UTC) 01:79:44
3532.3 none timeout 0/0 N/A N/A Sat Jun 27 2020 02:05:15 GMT+0000 (UTC) 02:21:42
3532.4 none timeout 0/0 N/A N/A Sat Jun 27 2020 02:05:15 GMT+0000 (UTC) 02:21:42
3532.5 none succeeded 1701/1708 N/A N/A Sat Jun 27 2020 02:05:15 GMT+0000 (UTC) 02:09:37
3532.6 none timeout 1706/1708 N/A N/A Sat Jun 27 2020 02:05:15 GMT+0000 (UTC) 02:21:41
3532.7 none succeeded 1196/1708 N/A N/A Sat Jun 27 2020 02:05:15 GMT+0000 (UTC) 02:19:29
3532.8 none failed 924/1708 N/A N/A Sat Jun 27 2020 02:05:15 GMT+0000 (UTC) 01:83:60
3532.9 none failed 1475/1708 N/A N/A Sat Jun 27 2020 02:05:15 GMT+0000 (UTC) 02:20:13
3532.10 none timeout 0/0 N/A N/A Sat Jun 27 2020 02:05:15 GMT+0000 (UTC) 02:21:39
3532.11 none timeout 0/0 N/A N/A Sat Jun 27 2020 02:05:15 GMT+0000 (UTC) 02:21:38
3532.12 none timeout 0/0 N/A N/A Sat Jun 27 2020 02:05:15 GMT+0000 (UTC) 02:21:38
3532.13 none succeeded 1375/1708 N/A N/A Sat Jun 27 2020 02:05:15 GMT+0000 (UTC) 02:16:68
3532.14 none succeeded 1304/1708 N/A N/A Sat Jun 27 2020 02:05:16 GMT+0000 (UTC) 02:15:06
3532.15 none succeeded 1125/1708 N/A N/A Sat Jun 27 2020 02:05:16 GMT+0000 (UTC) 02:90:01
3532.16 none timeout 1427/1708 N/A N/A Sat Jun 27 2020 02:05:16 GMT+0000 (UTC) 02:21:35
3532.17 none succeeded 1207/1708 N/A N/A Sat Jun 27 2020 02:05:16 GMT+0000 (UTC) 02:10:96
3532.18 none succeeded 1683/1708 N/A N/A Sat Jun 27 2020 02:05:16 GMT+0000 (UTC) 02:19:58
3532.19 none succeeded 1181/1708 N/A N/A Sat Jun 27 2020 02:05:16 GMT+0000 (UTC) 02:03:64
3532.20 none succeeded 1677/1708 N/A N/A Sat Jun 27 2020 02:05:16 GMT+0000 (UTC) 02:21:32
3532.21 none timeout 0/0 N/A N/A Sat Jun 27 2020 02:05:16 GMT+0000 (UTC) 02:21:33
3532.22 none succeeded 1282/1708 N/A N/A Sat Jun 27 2020 02:05:16 GMT+0000 (UTC) 02:16:41
3532.23 none succeeded 1275/1708 N/A N/A Sat Jun 27 2020 02:05:16 GMT+0000 (UTC) 02:14:22
3532.24 none succeeded 1337/1708 N/A N/A Sat Jun 27 2020 02:05:16 GMT+0000 (UTC) 02:17:23
3532.25 none timeout 0/0 N/A N/A Sat Jun 27 2020 02:05:16 GMT+0000 (UTC) 02:21:31
3532.26 none timeout 0/0 N/A N/A Sat Jun 27 2020 02:05:16 GMT+0000 (UTC) 02:21:30
3532.27 none succeeded 1101/1708 N/A N/A Sat Jun 27 2020 02:05:16 GMT+0000 (UTC) 02:09:25
3532.28 none timeout 0/0 N/A N/A Sat Jun 27 2020 02:05:16 GMT+0000 (UTC) 02:20:29
3532.29 none succeeded 1411/1708 N/A N/A Sat Jun 27 2020 02:05:17 GMT+0000 (UTC) 02:07:97
3532.30 none timeout 0/0 N/A N/A Sat Jun 27 2020 02:05:17 GMT+0000 (UTC) 02:20:28
3532.31 none timeout 0/0 N/A N/A Sat Jun 27 2020 02:05:17 GMT+0000 (UTC) 02:22:97
3532.32 none timeout 0/0 N/A N/A Sat Jun 27 2020 02:05:17 GMT+0000 (UTC) 02:23:79
3532.33 none timeout 0/0 N/A N/A Sat Jun 27 2020 02:05:17 GMT+0000 (UTC) 02:21:36
3532.34 none timeout 0/0 N/A N/A Sat Jun 27 2020 02:05:17 GMT+0000 (UTC) 02:23:71
3532.35 none failed 1707/1708 N/A N/A Sat Jun 27 2020 02:05:17 GMT+0000 (UTC) 02:18:50


Need help with Shippable? File an Issue

[ master ] Build FAILED for zephyrproject-rtos/test_results ( zephyr-v2.3.0-618-ga53c813ac5: stm32 results Non reg result analysis on last run: (verdicts: T/p: Passed, F/f: Failed, t:timeout) samples/subsys/nvs/sample.nvs.basic, disco_l475_iot1 (instable: pttpttptttpttpttt) tests/kernel/mem_protect/userspace/kernel.memory_protection.userspace, nucleo_l4r5zi tests/kernel/timer/timer_api/kernel.timer, nucleo_f103rb tests/net/utils/net.util, nucleo_f429zi tests/net/utils/net.util, nucleo_f746zg tests/posix/common/portability.posix.common.newlib, nucleo_wb55rg Total: 18 test(s) failed out of 1799 tests run 5 regression(s) on stable test Signed-off-by: Erwan Gouriou <erwan.gouriou@linaro.org> ) on Shippable.com #builds

Shippable.com <noreply@...>
 

SHIPPABLE BUILD REPORT

106
test_results
Branch : master Sha : e88bee4aa8
Builder : Erwan Gouriou Triggered By : Anas Nashif
Custom Environment Variables:
JOB_TRIGGERED_BY_NAME="create_test_commit"
JOB_TRIGGERED_BY_ID="125148"
# Runtime Status Tests Branch Coverage Sequence Coverage Triggered at Duration
106.1 none succeeded 0/0 N/A N/A Sat Jun 27 2020 04:06:50 GMT+0000 (UTC) 00:22:37
106.2 none succeeded 0/0 N/A N/A Sat Jun 27 2020 04:06:50 GMT+0000 (UTC) 00:19:18
106.3 none succeeded 0/0 N/A N/A Sat Jun 27 2020 04:06:50 GMT+0000 (UTC) 00:17:26
106.4 none succeeded 0/0 N/A N/A Sat Jun 27 2020 04:06:50 GMT+0000 (UTC) 00:19:13
106.5 none succeeded 0/0 N/A N/A Sat Jun 27 2020 04:06:50 GMT+0000 (UTC) 00:18:75
106.6 none succeeded 0/0 N/A N/A Sat Jun 27 2020 04:06:50 GMT+0000 (UTC) 00:17:08
106.7 none failed 0/0 N/A N/A Sat Jun 27 2020 04:06:50 GMT+0000 (UTC) 00:25:84
106.8 none succeeded 0/0 N/A N/A Sat Jun 27 2020 04:06:50 GMT+0000 (UTC) 00:21:72
106.9 none succeeded 0/0 N/A N/A Sat Jun 27 2020 04:06:50 GMT+0000 (UTC) 00:28:94
106.10 none succeeded 0/0 N/A N/A Sat Jun 27 2020 04:06:50 GMT+0000 (UTC) 00:24:64


Need help with Shippable? File an Issue

test #builds

Brett Preston <bpreston@...>
 

testing - please disregard

--
Brett Preston
The Linux Foundation
+1 (971) 303-9030
bpreston@...

Google Talk: bpreston@...
Skype: bprestoncf

[ master ] Build TIMEOUT for zephyrproject-rtos/ci-test ( ci: Update sdk to 0.11.3 Update sdk to 0.11.3 release and update docker image to get that SDK version. Signed-off-by: Kumar Gala <kumar.gala@linaro.org> ) on Shippable.com #builds

Shippable.com <noreply@...>
 

SHIPPABLE BUILD REPORT

3531
ci-test
Branch : master Sha : 5f9e0cfc3c
Builder : Kumar Gala Triggered By : Kumar Gala
Custom Environment Variables:
JOB_TRIGGERED_BY_NAME="daily-verify"
JOB_TRIGGERED_BY_ID="23790"
# Runtime Status Tests Branch Coverage Sequence Coverage Triggered at Duration
3531.1 none succeeded 1483/1709 N/A N/A Fri Jun 26 2020 02:05:17 GMT+0000 (UTC) 02:06:45
3531.2 none failed 843/1709 N/A N/A Fri Jun 26 2020 02:05:17 GMT+0000 (UTC) 01:79:35
3531.3 none timeout 0/0 N/A N/A Fri Jun 26 2020 02:05:18 GMT+0000 (UTC) 02:20:02
3531.4 none timeout 0/0 N/A N/A Fri Jun 26 2020 02:05:18 GMT+0000 (UTC) 02:20:01
3531.5 none succeeded 1701/1708 N/A N/A Fri Jun 26 2020 02:05:18 GMT+0000 (UTC) 02:16:46
3531.6 none succeeded 1706/1708 N/A N/A Fri Jun 26 2020 02:05:18 GMT+0000 (UTC) 02:08:02
3531.7 none succeeded 1196/1708 N/A N/A Fri Jun 26 2020 02:05:18 GMT+0000 (UTC) 02:18:61
3531.8 none failed 924/1708 N/A N/A Fri Jun 26 2020 02:05:18 GMT+0000 (UTC) 01:82:17
3531.9 none failed 1475/1708 N/A N/A Fri Jun 26 2020 02:05:18 GMT+0000 (UTC) 02:20:18
3531.10 none succeeded 1452/1708 N/A N/A Fri Jun 26 2020 02:05:18 GMT+0000 (UTC) 02:23:07
3531.11 none timeout 0/0 N/A N/A Fri Jun 26 2020 02:05:18 GMT+0000 (UTC) 02:25:91
3531.12 none timeout 0/0 N/A N/A Fri Jun 26 2020 02:05:18 GMT+0000 (UTC) 02:25:90
3531.13 none succeeded 1375/1708 N/A N/A Fri Jun 26 2020 02:05:18 GMT+0000 (UTC) 02:16:37
3531.14 none succeeded 1304/1708 N/A N/A Fri Jun 26 2020 02:05:19 GMT+0000 (UTC) 02:14:52
3531.15 none succeeded 1125/1708 N/A N/A Fri Jun 26 2020 02:05:19 GMT+0000 (UTC) 01:89:45
3531.16 none failed 1427/1708 N/A N/A Fri Jun 26 2020 02:05:19 GMT+0000 (UTC) 02:16:42
3531.17 none succeeded 1207/1708 N/A N/A Fri Jun 26 2020 02:05:19 GMT+0000 (UTC) 02:08:98
3531.18 none timeout 0/0 N/A N/A Fri Jun 26 2020 02:05:19 GMT+0000 (UTC) 02:25:87
3531.19 none succeeded 1181/1708 N/A N/A Fri Jun 26 2020 02:05:19 GMT+0000 (UTC) 02:93:58
3531.20 none succeeded 1677/1708 N/A N/A Fri Jun 26 2020 02:05:19 GMT+0000 (UTC) 02:14:60
3531.21 none timeout 1510/1708 N/A N/A Fri Jun 26 2020 02:05:19 GMT+0000 (UTC) 02:25:85
3531.22 none succeeded 1282/1708 N/A N/A Fri Jun 26 2020 02:05:19 GMT+0000 (UTC) 02:15:93
3531.23 none succeeded 1275/1708 N/A N/A Fri Jun 26 2020 02:05:19 GMT+0000 (UTC) 02:08:77
3531.24 none succeeded 1337/1708 N/A N/A Fri Jun 26 2020 02:05:19 GMT+0000 (UTC) 02:16:65
3531.25 none timeout 0/0 N/A N/A Fri Jun 26 2020 02:05:19 GMT+0000 (UTC) 02:25:83
3531.26 none timeout 0/0 N/A N/A Fri Jun 26 2020 02:05:19 GMT+0000 (UTC) 02:25:83
3531.27 none succeeded 1101/1708 N/A N/A Fri Jun 26 2020 02:05:19 GMT+0000 (UTC) 02:95:12
3531.28 none timeout 0/0 N/A N/A Fri Jun 26 2020 02:05:19 GMT+0000 (UTC) 02:25:81
3531.29 none succeeded 1411/1708 N/A N/A Fri Jun 26 2020 02:05:19 GMT+0000 (UTC) 02:04:48
3531.30 none succeeded 1595/1708 N/A N/A Fri Jun 26 2020 02:05:20 GMT+0000 (UTC) 02:18:56
3531.31 none timeout 0/0 N/A N/A Fri Jun 26 2020 02:05:20 GMT+0000 (UTC) 02:21:68
3531.32 none timeout 0/0 N/A N/A Fri Jun 26 2020 02:05:20 GMT+0000 (UTC) 02:23:76
3531.33 none timeout 0/0 N/A N/A Fri Jun 26 2020 02:05:20 GMT+0000 (UTC) 02:21:36
3531.34 none succeeded 1698/1708 N/A N/A Fri Jun 26 2020 02:05:20 GMT+0000 (UTC) 02:17:41
3531.35 none failed 1707/1708 N/A N/A Fri Jun 26 2020 02:05:20 GMT+0000 (UTC) 02:06:31


Need help with Shippable? File an Issue

[ master ] Build SUCCEEDED for zephyrproject-rtos/test_results ( zephyr-v2.3.0-590-g3f8bdf16f9: stm32 results Non reg result analysis on last run: (verdicts: T/p: Passed, F/f: Failed, t:timeout) tests/subsys/logging/log_immediate/logging.log_immediate.clean_output, disco_l475_iot1 tests/subsys/logging/log_immediate/logging.log_immediate.clean_output, nucleo_f207zg tests/subsys/logging/log_immediate/logging.log_immediate.clean_output, nucleo_f429zi Total: 15 test(s) failed out of 1799 tests run 3 regression(s) on stable test Signed-off-by: Erwan Gouriou <erwan.gouriou@linaro.org> ) on Shippable.com #builds

Shippable.com <noreply@...>
 

SHIPPABLE BUILD REPORT

105
test_results
Branch : master Sha : bf73bfd12a
Builder : Erwan Gouriou Triggered By : Anas Nashif
Custom Environment Variables:
JOB_TRIGGERED_BY_NAME="create_test_commit"
JOB_TRIGGERED_BY_ID="125148"
# Runtime Status Tests Branch Coverage Sequence Coverage Triggered at Duration
105.1 none succeeded 0/0 N/A N/A Fri Jun 26 2020 04:06:00 GMT+0000 (UTC) 00:22:45
105.2 none succeeded 0/0 N/A N/A Fri Jun 26 2020 04:06:00 GMT+0000 (UTC) 00:19:37
105.3 none succeeded 0/0 N/A N/A Fri Jun 26 2020 04:06:00 GMT+0000 (UTC) 00:16:78
105.4 none succeeded 0/0 N/A N/A Fri Jun 26 2020 04:06:00 GMT+0000 (UTC) 00:22:06
105.5 none succeeded 0/0 N/A N/A Fri Jun 26 2020 04:06:00 GMT+0000 (UTC) 00:23:92
105.6 none succeeded 0/0 N/A N/A Fri Jun 26 2020 04:06:00 GMT+0000 (UTC) 00:20:15
105.7 none succeeded 0/0 N/A N/A Fri Jun 26 2020 04:06:00 GMT+0000 (UTC) 00:24:15
105.8 none succeeded 0/0 N/A N/A Fri Jun 26 2020 04:06:01 GMT+0000 (UTC) 00:26:37
105.9 none succeeded 0/0 N/A N/A Fri Jun 26 2020 04:06:01 GMT+0000 (UTC) 01:34:44
105.10 none succeeded 0/0 N/A N/A Fri Jun 26 2020 04:06:01 GMT+0000 (UTC) 00:28:00


Need help with Shippable? File an Issue

[ master ] Build TIMEOUT for zephyrproject-rtos/ci-test ( ci: Update sdk to 0.11.3 Update sdk to 0.11.3 release and update docker image to get that SDK version. Signed-off-by: Kumar Gala <kumar.gala@linaro.org> ) on Shippable.com #builds

Shippable.com <noreply@...>
 

SHIPPABLE BUILD REPORT

3530
ci-test
Branch : master Sha : 5f9e0cfc3c
Builder : Kumar Gala Triggered By : Kumar Gala
Custom Environment Variables:
JOB_TRIGGERED_BY_NAME="daily-verify"
JOB_TRIGGERED_BY_ID="23790"
# Runtime Status Tests Branch Coverage Sequence Coverage Triggered at Duration
3530.1 none succeeded 1477/1703 N/A N/A Thu Jun 25 2020 02:05:13 GMT+0000 (UTC) 02:04:48
3530.2 none failed 941/1703 N/A N/A Thu Jun 25 2020 02:05:13 GMT+0000 (UTC) 01:83:81
3530.3 none timeout 0/0 N/A N/A Thu Jun 25 2020 02:05:13 GMT+0000 (UTC) 02:25:79
3530.4 none timeout 0/0 N/A N/A Thu Jun 25 2020 02:05:13 GMT+0000 (UTC) 02:25:78
3530.5 none succeeded 1696/1703 N/A N/A Thu Jun 25 2020 02:05:13 GMT+0000 (UTC) 02:11:38
3530.6 none succeeded 1702/1703 N/A N/A Thu Jun 25 2020 02:05:13 GMT+0000 (UTC) 02:24:20
3530.7 none succeeded 1041/1703 N/A N/A Thu Jun 25 2020 02:05:13 GMT+0000 (UTC) 02:10:05
3530.8 none failed 1051/1703 N/A N/A Thu Jun 25 2020 02:05:13 GMT+0000 (UTC) 01:88:57
3530.9 none failed 1435/1703 N/A N/A Thu Jun 25 2020 02:05:13 GMT+0000 (UTC) 02:19:57
3530.10 none succeeded 1494/1703 N/A N/A Thu Jun 25 2020 02:05:14 GMT+0000 (UTC) 02:24:57
3530.11 none timeout 0/0 N/A N/A Thu Jun 25 2020 02:05:14 GMT+0000 (UTC) 02:25:74
3530.12 none timeout 0/0 N/A N/A Thu Jun 25 2020 02:05:14 GMT+0000 (UTC) 02:25:74
3530.13 none succeeded 1409/1703 N/A N/A Thu Jun 25 2020 02:05:14 GMT+0000 (UTC) 02:19:29
3530.14 none succeeded 1184/1703 N/A N/A Thu Jun 25 2020 02:05:14 GMT+0000 (UTC) 02:07:03
3530.15 none succeeded 1208/1703 N/A N/A Thu Jun 25 2020 02:05:14 GMT+0000 (UTC) 02:92:17
3530.16 none failed 1434/1703 N/A N/A Thu Jun 25 2020 02:05:14 GMT+0000 (UTC) 02:22:95
3530.17 none succeeded 1217/1703 N/A N/A Thu Jun 25 2020 02:05:14 GMT+0000 (UTC) 02:06:59
3530.18 none succeeded 1634/1703 N/A N/A Thu Jun 25 2020 02:05:14 GMT+0000 (UTC) 02:15:84
3530.19 none succeeded 1217/1703 N/A N/A Thu Jun 25 2020 02:05:14 GMT+0000 (UTC) 02:95:06
3530.20 none succeeded 1677/1703 N/A N/A Thu Jun 25 2020 02:05:14 GMT+0000 (UTC) 02:14:15
3530.21 none succeeded 1452/1703 N/A N/A Thu Jun 25 2020 02:05:14 GMT+0000 (UTC) 02:23:66
3530.22 none succeeded 1321/1702 N/A N/A Thu Jun 25 2020 02:05:14 GMT+0000 (UTC) 02:15:22
3530.23 none succeeded 1280/1702 N/A N/A Thu Jun 25 2020 02:05:14 GMT+0000 (UTC) 02:05:04
3530.24 none succeeded 1326/1702 N/A N/A Thu Jun 25 2020 02:05:14 GMT+0000 (UTC) 02:12:44
3530.25 none timeout 0/0 N/A N/A Thu Jun 25 2020 02:05:14 GMT+0000 (UTC) 02:24:67
3530.26 none timeout 0/0 N/A N/A Thu Jun 25 2020 02:05:14 GMT+0000 (UTC) 02:24:66
3530.27 none succeeded 1097/1702 N/A N/A Thu Jun 25 2020 02:05:14 GMT+0000 (UTC) 02:05:18
3530.28 none timeout 0/0 N/A N/A Thu Jun 25 2020 02:05:14 GMT+0000 (UTC) 02:24:65
3530.29 none succeeded 1405/1702 N/A N/A Thu Jun 25 2020 02:05:15 GMT+0000 (UTC) 02:06:52
3530.30 none timeout 0/0 N/A N/A Thu Jun 25 2020 02:05:15 GMT+0000 (UTC) 02:24:64
3530.31 none timeout 0/0 N/A N/A Thu Jun 25 2020 02:05:15 GMT+0000 (UTC) 02:22:00
3530.32 none timeout 0/0 N/A N/A Thu Jun 25 2020 02:05:15 GMT+0000 (UTC) 02:21:88
3530.33 none timeout 0/0 N/A N/A Thu Jun 25 2020 02:05:15 GMT+0000 (UTC) 02:23:55
3530.34 none succeeded 1692/1702 N/A N/A Thu Jun 25 2020 02:05:15 GMT+0000 (UTC) 02:21:38
3530.35 none failed 1701/1702 N/A N/A Thu Jun 25 2020 02:05:15 GMT+0000 (UTC) 02:16:71


Need help with Shippable? File an Issue

[ master ] Build SUCCEEDED for zephyrproject-rtos/test_results ( zephyr-v2.3.0-562-g979e124e21: stm32 results Non reg result analysis on last run: (verdicts: T/p: Passed, F/f: Failed, t:timeout) tests/drivers/counter/counter_basic_api/drivers.counter, nucleo_f746zg (instable: ppfppppfppppppppp) Total results not available as campaign was run also on non supported boards (removed later) Signed-off-by: Erwan Gouriou <erwan.gouriou@linaro.org> ) on Shippable.com #builds

Shippable.com <noreply@...>
 

SHIPPABLE BUILD REPORT

104
test_results
Branch : master Sha : 121ad89c45
Builder : Erwan Gouriou Triggered By : Anas Nashif
Custom Environment Variables:
JOB_TRIGGERED_BY_NAME="create_test_commit"
JOB_TRIGGERED_BY_ID="125148"
# Runtime Status Tests Branch Coverage Sequence Coverage Triggered at Duration
104.1 none succeeded 0/0 N/A N/A Thu Jun 25 2020 04:06:56 GMT+0000 (UTC) 00:23:81
104.2 none succeeded 0/0 N/A N/A Thu Jun 25 2020 04:06:56 GMT+0000 (UTC) 00:17:34
104.3 none succeeded 0/0 N/A N/A Thu Jun 25 2020 04:06:56 GMT+0000 (UTC) 00:19:65
104.4 none succeeded 0/0 N/A N/A Thu Jun 25 2020 04:06:56 GMT+0000 (UTC) 00:21:87
104.5 none succeeded 0/0 N/A N/A Thu Jun 25 2020 04:06:56 GMT+0000 (UTC) 00:23:50
104.6 none succeeded 0/0 N/A N/A Thu Jun 25 2020 04:06:56 GMT+0000 (UTC) 00:18:09
104.7 none succeeded 0/0 N/A N/A Thu Jun 25 2020 04:06:56 GMT+0000 (UTC) 00:25:91
104.8 none succeeded 0/0 N/A N/A Thu Jun 25 2020 04:06:56 GMT+0000 (UTC) 00:23:66
104.9 none succeeded 0/0 N/A N/A Thu Jun 25 2020 04:06:56 GMT+0000 (UTC) 01:30:00
104.10 none succeeded 0/0 N/A N/A Thu Jun 25 2020 04:06:56 GMT+0000 (UTC) 00:25:13


Need help with Shippable? File an Issue

[ master ] Build TIMEOUT for zephyrproject-rtos/ci-test ( ci: Update sdk to 0.11.3 Update sdk to 0.11.3 release and update docker image to get that SDK version. Signed-off-by: Kumar Gala <kumar.gala@linaro.org> ) on Shippable.com #builds

Shippable.com <noreply@...>
 

SHIPPABLE BUILD REPORT

3529
ci-test
Branch : master Sha : 5f9e0cfc3c
Builder : Kumar Gala Triggered By : Kumar Gala
Custom Environment Variables:
JOB_TRIGGERED_BY_NAME="daily-verify"
JOB_TRIGGERED_BY_ID="23790"
# Runtime Status Tests Branch Coverage Sequence Coverage Triggered at Duration
3529.1 none succeeded 1477/1703 N/A N/A Wed Jun 24 2020 02:05:16 GMT+0000 (UTC) 02:99:65
3529.2 none failed 942/1703 N/A N/A Wed Jun 24 2020 02:05:16 GMT+0000 (UTC) 01:79:16
3529.3 none timeout 0/0 N/A N/A Wed Jun 24 2020 02:05:16 GMT+0000 (UTC) 02:24:46
3529.4 none timeout 0/0 N/A N/A Wed Jun 24 2020 02:05:16 GMT+0000 (UTC) 02:24:45
3529.5 none succeeded 1696/1703 N/A N/A Wed Jun 24 2020 02:05:16 GMT+0000 (UTC) 02:05:81
3529.6 none timeout 1702/1703 N/A N/A Wed Jun 24 2020 02:05:16 GMT+0000 (UTC) 02:24:44
3529.7 none succeeded 1040/1703 N/A N/A Wed Jun 24 2020 02:05:16 GMT+0000 (UTC) 02:10:19
3529.8 none succeeded 1053/1703 N/A N/A Wed Jun 24 2020 02:05:16 GMT+0000 (UTC) 02:90:03
3529.9 none succeeded 1435/1703 N/A N/A Wed Jun 24 2020 02:05:16 GMT+0000 (UTC) 02:16:78
3529.10 none timeout 1494/1703 N/A N/A Wed Jun 24 2020 02:05:16 GMT+0000 (UTC) 02:24:42
3529.11 none timeout 0/0 N/A N/A Wed Jun 24 2020 02:05:16 GMT+0000 (UTC) 02:24:41
3529.12 none timeout 0/0 N/A N/A Wed Jun 24 2020 02:05:16 GMT+0000 (UTC) 02:24:41
3529.13 none timeout 1409/1703 N/A N/A Wed Jun 24 2020 02:05:17 GMT+0000 (UTC) 02:24:40
3529.14 none succeeded 1182/1703 N/A N/A Wed Jun 24 2020 02:05:17 GMT+0000 (UTC) 02:08:56
3529.15 none succeeded 1207/1703 N/A N/A Wed Jun 24 2020 02:05:17 GMT+0000 (UTC) 02:93:79
3529.16 none succeeded 1435/1703 N/A N/A Wed Jun 24 2020 02:05:17 GMT+0000 (UTC) 02:18:76
3529.17 none succeeded 1217/1703 N/A N/A Wed Jun 24 2020 02:05:17 GMT+0000 (UTC) 02:07:42
3529.18 none succeeded 1634/1703 N/A N/A Wed Jun 24 2020 02:05:17 GMT+0000 (UTC) 02:17:10
3529.19 none succeeded 1217/1703 N/A N/A Wed Jun 24 2020 02:05:17 GMT+0000 (UTC) 02:00:74
3529.20 none succeeded 1677/1703 N/A N/A Wed Jun 24 2020 02:05:17 GMT+0000 (UTC) 02:15:26
3529.21 none timeout 1452/1703 N/A N/A Wed Jun 24 2020 02:05:17 GMT+0000 (UTC) 02:24:36
3529.22 none succeeded 1322/1703 N/A N/A Wed Jun 24 2020 02:05:17 GMT+0000 (UTC) 02:15:24
3529.23 none succeeded 1280/1702 N/A N/A Wed Jun 24 2020 02:05:17 GMT+0000 (UTC) 02:08:87
3529.24 none succeeded 1326/1702 N/A N/A Wed Jun 24 2020 02:05:17 GMT+0000 (UTC) 02:14:65
3529.25 none timeout 0/0 N/A N/A Wed Jun 24 2020 02:05:17 GMT+0000 (UTC) 02:24:34
3529.26 none timeout 0/0 N/A N/A Wed Jun 24 2020 02:05:17 GMT+0000 (UTC) 02:24:34
3529.27 none succeeded 1097/1702 N/A N/A Wed Jun 24 2020 02:05:17 GMT+0000 (UTC) 02:05:99
3529.28 none timeout 0/0 N/A N/A Wed Jun 24 2020 02:05:17 GMT+0000 (UTC) 02:24:33
3529.29 none succeeded 1405/1702 N/A N/A Wed Jun 24 2020 02:05:17 GMT+0000 (UTC) 02:07:04
3529.30 none timeout 0/0 N/A N/A Wed Jun 24 2020 02:05:17 GMT+0000 (UTC) 02:24:32
3529.31 none timeout 0/0 N/A N/A Wed Jun 24 2020 02:05:18 GMT+0000 (UTC) 02:20:13
3529.32 none timeout 0/0 N/A N/A Wed Jun 24 2020 02:05:18 GMT+0000 (UTC) 02:24:38
3529.33 none timeout 0/0 N/A N/A Wed Jun 24 2020 02:05:18 GMT+0000 (UTC) 02:21:58
3529.34 none succeeded 1692/1702 N/A N/A Wed Jun 24 2020 02:05:18 GMT+0000 (UTC) 02:19:25
3529.35 none succeeded 1702/1702 N/A N/A Wed Jun 24 2020 02:05:18 GMT+0000 (UTC) 02:19:46


Need help with Shippable? File an Issue

[ master ] Build SUCCEEDED for zephyrproject-rtos/test_results ( zephyr-v2.3.0-520-gba0a791635: stm32 results Non reg result analysis on last run: (verdicts: T/p: Passed, F/f: Failed, t:timeout) samples/subsys/nvs/sample.nvs.basic, disco_l475_iot1 (instable: pttptttpttptttppt) tests/kernel/fatal/kernel.common.stack_protection_arm_fpu_sharing, nucleo_f746zg tests/kernel/mem_protect/userspace/kernel.memory_protection.userspace, disco_l475_iot1 (instable: pttpppppppppppppp) tests/kernel/mem_protect/userspace/kernel.memory_protection.userspace, nucleo_f429zi (instable: ptpppppppppptptpp) tests/kernel/mem_protect/userspace/kernel.memory_protection.userspace, nucleo_l4r5zi tests/kernel/mem_protect/userspace/kernel.memory_protection.userspace, nucleo_wb55rg tests/subsys/logging/log_immediate/logging.log_immediate.clean_output, nucleo_f207zg Total: 14 test(s) failed out of 1566 tests run 4 regression(s) on stable test Signed-off-by: Erwan Gouriou <erwan.gouriou@linaro.org> ) on Shippable.com #

Shippable.com <noreply@...>
 

SHIPPABLE BUILD REPORT

103
test_results
Branch : master Sha : a4527bf15e
Builder : Erwan Gouriou Triggered By : Anas Nashif
Custom Environment Variables:
JOB_TRIGGERED_BY_NAME="create_test_commit"
JOB_TRIGGERED_BY_ID="125148"
# Runtime Status Tests Branch Coverage Sequence Coverage Triggered at Duration
103.1 none succeeded 0/0 N/A N/A Wed Jun 24 2020 04:08:02 GMT+0000 (UTC) 00:25:01
103.2 none succeeded 0/0 N/A N/A Wed Jun 24 2020 04:08:02 GMT+0000 (UTC) 00:19:26
103.3 none succeeded 0/0 N/A N/A Wed Jun 24 2020 04:08:02 GMT+0000 (UTC) 00:17:04
103.4 none succeeded 0/0 N/A N/A Wed Jun 24 2020 04:08:02 GMT+0000 (UTC) 00:19:66
103.5 none succeeded 0/0 N/A N/A Wed Jun 24 2020 04:08:02 GMT+0000 (UTC) 00:20:72
103.6 none succeeded 0/0 N/A N/A Wed Jun 24 2020 04:08:02 GMT+0000 (UTC) 00:19:38
103.7 none succeeded 0/0 N/A N/A Wed Jun 24 2020 04:08:02 GMT+0000 (UTC) 00:24:61
103.8 none succeeded 0/0 N/A N/A Wed Jun 24 2020 04:08:02 GMT+0000 (UTC) 00:24:54
103.9 none succeeded 0/0 N/A N/A Wed Jun 24 2020 04:08:02 GMT+0000 (UTC) 01:30:28
103.10 none succeeded 0/0 N/A N/A Wed Jun 24 2020 04:08:02 GMT+0000 (UTC) 00:30:86


Need help with Shippable? File an Issue