Date   

[Still Failing] Zephyr / zephyr-daily #367 (main) #builds

Buildkite <notifications@...>
 

Scheduled build Duration: 6 hours, 35 minutes, 7 seconds
Build #367 | main | c15b169
View Build →
ℹ︎

Read the JUnit test report


[Still Failing] Zephyr / zephyr-daily #366 (main) #builds

Buildkite <notifications@...>
 

Scheduled build Duration: 6 hours, 21 minutes, 10 seconds
Build #366 | main | de2e141
View Build →
ℹ︎

Read the JUnit test report


[Still Failing] Zephyr / zephyr-daily #365 (main) #builds

Buildkite <notifications@...>
 

Scheduled build Duration: 6 hours, 13 minutes, 40 seconds
Build #365 | main | 7ba52d8
View Build →
ℹ︎

Read the JUnit test report


[Still Failing] Zephyr / zephyr-daily #364 (main) #builds

Buildkite <notifications@...>
 

Scheduled build Duration: 6 hours, 24 minutes, 46 seconds
Build #364 | main | c9aa260
View Build →
ℹ︎

Read the JUnit test report


[Still Failing] Zephyr / zephyr-daily #363 (main) #builds

Buildkite <notifications@...>
 

Scheduled build Duration: 6 hours, 14 minutes, 31 seconds
Build #363 | main | c9aa260
View Build →
ℹ︎

Read the JUnit test report


[Still Failing] Zephyr / zephyr-daily #362 (main) #builds

Buildkite <notifications@...>
 

Scheduled build Duration: 6 hours, 14 minutes, 1 second
Build #362 | main | 070cf6a
View Build →
ℹ︎

Read the JUnit test report


[Still Failing] Zephyr / zephyr-daily #361 (main) #builds

Buildkite <notifications@...>
 

Scheduled build Duration: 6 hours, 14 minutes, 57 seconds
Build #361 | main | 6c9945a
View Build →
ℹ︎

Read the JUnit test report


[Still Failing] Zephyr / zephyr-daily #360 (main) #builds

Buildkite <notifications@...>
 

Scheduled build Duration: 6 hours, 17 minutes, 57 seconds
Build #360 | main | 8875340
View Build →
ℹ︎

Read the JUnit test report


[Still Failing] Zephyr / zephyr-daily #359 (main) #builds

Buildkite <notifications@...>
 

Scheduled build Duration: 6 hours, 29 minutes, 31 seconds
Build #359 | main | 5719e54
View Build →
ℹ︎

Read the JUnit test report


[Failed] Zephyr / zephyr-daily #358 (main) #builds

Buildkite <notifications@...>
 

Scheduled build Duration: 6 hours, 7 minutes, 33 seconds
Build #358 | main | 1ce8d6f
View Build →
ℹ︎

Read the JUnit test report

✖︎

8 failures:

samples/drivers/eeprom/sample.drivers.eeprom.shield.x_nucleo_eeprma2 in nucleo_l152re:samples/drivers/eeprom/sample.drivers
Including boilerplate (Zephyr base): /workdir/zephyr/cmake/app/boilerplate.cmake
-- Application: /workdir/zephyr/samples/drivers/eeprom
-- Zephyr version: 2.6.99 (/workdir/zephyr), build: zephyr-v2.6.0-96-g1ce8d6fae43e
-- Found Python3: /usr/bin/python3.8 (found suitable exact version "3.8.5") found components: Interpreter
-- Found west (found suitable version "0.11.0", minimum required is "0.7.1")
-- Board: nucleo_l152re, Shield(s): x_nucleo_eeprma2
-- Cache files will be written to: /root/.cache/zephyr
-- Using toolchain: zephyr 0.12.4 (/opt/toolchains/zephyr-sdk-0.12.4)
-- Found dtc: /opt/toolchains/zephyr-sdk-0.12.4/sysroots/x86_64-pokysdk-linux/usr/bin/dtc (found suitable version "1.5.0", minimum required is "1.4.6")
-- Found BOARD.dts: /workdir/zephyr/boards/arm/nucleo_l152re/nucleo_l152re.dts
-- Found devicetree overlay: /workdir/zephyr/boards/shields/x_nucleo_eeprma2/x_nucleo_eeprma2.overlay
Error: nucleo_l152re.dts.pre.tmp:999.1-13 Label or path arduino_spi not found
FATAL ERROR: Syntax error parsing input tree
CMake Error at /workdir/zephyr/cmake/dts.cmake:214 (message):
  command failed with return code: 1
Call Stack (most recent call first):
  /workdir/zephyr/cmake/app/boilerplate.cmake:564 (include)
  /workdir/zephyr/share/zephyr-package/cmake/ZephyrConfig.cmake:24 (include)
  /workdir/zephyr/share/zephyr-package/cmake/ZephyrConfig.cmake:35 (include_boilerplate)
  CMakeLists.txt:4 (find_package)


-- Configuring incomplete, errors occurred!

in Job #10cffe64-2622-44f4-babb-a0d3ed30ff2a

samples/drivers/eeprom/sample.drivers.eeprom.shield.x_nucleo_eeprma2 in ubx_evkninab3_nrf52840:samples/drivers/eeprom/sample.drivers
Including boilerplate (Zephyr base): /workdir/zephyr/cmake/app/boilerplate.cmake
-- Application: /workdir/zephyr/samples/drivers/eeprom
-- Zephyr version: 2.6.99 (/workdir/zephyr), build: zephyr-v2.6.0-96-g1ce8d6fae43e
-- Found Python3: /usr/bin/python3.8 (found suitable exact version "3.8.5") found components: Interpreter
-- Found west (found suitable version "0.11.0", minimum required is "0.7.1")
-- Board: ubx_evkninab3_nrf52840, Shield(s): x_nucleo_eeprma2
-- Cache files will be written to: /root/.cache/zephyr
-- Using toolchain: zephyr 0.12.4 (/opt/toolchains/zephyr-sdk-0.12.4)
-- Found dtc: /opt/toolchains/zephyr-sdk-0.12.4/sysroots/x86_64-pokysdk-linux/usr/bin/dtc (found suitable version "1.5.0", minimum required is "1.4.6")
-- Found BOARD.dts: /workdir/zephyr/boards/arm/ubx_evkninab3_nrf52840/ubx_evkninab3_nrf52840.dts
-- Found devicetree overlay: /workdir/zephyr/boards/shields/x_nucleo_eeprma2/x_nucleo_eeprma2.overlay
Error: ubx_evkninab3_nrf52840.dts.pre.tmp:603.1-13 Label or path arduino_spi not found
FATAL ERROR: Syntax error parsing input tree
CMake Error at /workdir/zephyr/cmake/dts.cmake:214 (message):
  command failed with return code: 1
Call Stack (most recent call first):
  /workdir/zephyr/cmake/app/boilerplate.cmake:564 (include)
  /workdir/zephyr/share/zephyr-package/cmake/ZephyrConfig.cmake:24 (include)
  /workdir/zephyr/share/zephyr-package/cmake/ZephyrConfig.cmake:35 (include_boilerplate)
  CMakeLists.txt:4 (find_package)


-- Configuring incomplete, errors occurred!

in Job #2ecafa5e-a08c-40f7-89c2-35503943e97a

samples/drivers/eeprom/sample.drivers.eeprom.shield.x_nucleo_eeprma2 in nucleo_h745zi_q_m7:samples/drivers/eeprom/sample.drivers
Including boilerplate (Zephyr base): /workdir/zephyr/cmake/app/boilerplate.cmake
-- Application: /workdir/zephyr/samples/drivers/eeprom
-- Zephyr version: 2.6.99 (/workdir/zephyr), build: zephyr-v2.6.0-96-g1ce8d6fae43e
-- Found Python3: /usr/bin/python3.8 (found suitable exact version "3.8.5") found components: Interpreter
-- Found west (found suitable version "0.11.0", minimum required is "0.7.1")
-- Board: nucleo_h745zi_q_m7, Shield(s): x_nucleo_eeprma2
-- Cache files will be written to: /root/.cache/zephyr
-- Using toolchain: zephyr 0.12.4 (/opt/toolchains/zephyr-sdk-0.12.4)
-- Found dtc: /opt/toolchains/zephyr-sdk-0.12.4/sysroots/x86_64-pokysdk-linux/usr/bin/dtc (found suitable version "1.5.0", minimum required is "1.4.6")
-- Found BOARD.dts: /workdir/zephyr/boards/arm/nucleo_h745zi_q/nucleo_h745zi_q_m7.dts
-- Found devicetree overlay: /workdir/zephyr/boards/shields/x_nucleo_eeprma2/x_nucleo_eeprma2.overlay
Error: nucleo_h745zi_q_m7.dts.pre.tmp:4605.1-13 Label or path arduino_spi not found
FATAL ERROR: Syntax error parsing input tree
CMake Error at /workdir/zephyr/cmake/dts.cmake:214 (message):
  command failed with return code: 1
Call Stack (most recent call first):
  /workdir/zephyr/cmake/app/boilerplate.cmake:564 (include)
  /workdir/zephyr/share/zephyr-package/cmake/ZephyrConfig.cmake:24 (include)
  /workdir/zephyr/share/zephyr-package/cmake/ZephyrConfig.cmake:35 (include_boilerplate)
  CMakeLists.txt:4 (find_package)


-- Configuring incomplete, errors occurred!

in Job #9854b1ce-4c71-4ff8-928f-c814a40446a7

samples/drivers/eeprom/sample.drivers.eeprom.shield.x_nucleo_eeprma2 in nucleo_h723zg:samples/drivers/eeprom/sample.drivers
Including boilerplate (Zephyr base): /workdir/zephyr/cmake/app/boilerplate.cmake
-- Application: /workdir/zephyr/samples/drivers/eeprom
-- Zephyr version: 2.6.99 (/workdir/zephyr), build: zephyr-v2.6.0-96-g1ce8d6fae43e
-- Found Python3: /usr/bin/python3.8 (found suitable exact version "3.8.5") found components: Interpreter
-- Found west (found suitable version "0.11.0", minimum required is "0.7.1")
-- Board: nucleo_h723zg, Shield(s): x_nucleo_eeprma2
-- Cache files will be written to: /root/.cache/zephyr
-- Using toolchain: zephyr 0.12.4 (/opt/toolchains/zephyr-sdk-0.12.4)
-- Found dtc: /opt/toolchains/zephyr-sdk-0.12.4/sysroots/x86_64-pokysdk-linux/usr/bin/dtc (found suitable version "1.5.0", minimum required is "1.4.6")
-- Found BOARD.dts: /workdir/zephyr/boards/arm/nucleo_h723zg/nucleo_h723zg.dts
-- Found devicetree overlay: /workdir/zephyr/boards/shields/x_nucleo_eeprma2/x_nucleo_eeprma2.overlay
Error: nucleo_h723zg.dts.pre.tmp:3050.1-13 Label or path arduino_spi not found
FATAL ERROR: Syntax error parsing input tree
CMake Error at /workdir/zephyr/cmake/dts.cmake:214 (message):
  command failed with return code: 1
Call Stack (most recent call first):
  /workdir/zephyr/cmake/app/boilerplate.cmake:564 (include)
  /workdir/zephyr/share/zephyr-package/cmake/ZephyrConfig.cmake:24 (include)
  /workdir/zephyr/share/zephyr-package/cmake/ZephyrConfig.cmake:35 (include_boilerplate)
  CMakeLists.txt:4 (find_package)


-- Configuring incomplete, errors occurred!

in Job #db6df723-3d5f-4f83-b55b-a6beaf17f594

samples/drivers/eeprom/sample.drivers.eeprom.shield.x_nucleo_eeprma2 in nrf21540dk_nrf52840:samples/drivers/eeprom/sample.drivers
Including boilerplate (Zephyr base): /workdir/zephyr/cmake/app/boilerplate.cmake
-- Application: /workdir/zephyr/samples/drivers/eeprom
-- Zephyr version: 2.6.99 (/workdir/zephyr), build: zephyr-v2.6.0-96-g1ce8d6fae43e
-- Found Python3: /usr/bin/python3.8 (found suitable exact version "3.8.5") found components: Interpreter
-- Found west (found suitable version "0.11.0", minimum required is "0.7.1")
-- Board: nrf21540dk_nrf52840, Shield(s): x_nucleo_eeprma2
-- Cache files will be written to: /root/.cache/zephyr
-- Using toolchain: zephyr 0.12.4 (/opt/toolchains/zephyr-sdk-0.12.4)
-- Found dtc: /opt/toolchains/zephyr-sdk-0.12.4/sysroots/x86_64-pokysdk-linux/usr/bin/dtc (found suitable version "1.5.0", minimum required is "1.4.6")
-- Found BOARD.dts: /workdir/zephyr/boards/arm/nrf21540dk_nrf52840/nrf21540dk_nrf52840.dts
-- Found devicetree overlay: /workdir/zephyr/boards/shields/x_nucleo_eeprma2/x_nucleo_eeprma2.overlay
Error: nrf21540dk_nrf52840.dts.pre.tmp:646.1-13 Label or path arduino_spi not found
FATAL ERROR: Syntax error parsing input tree
CMake Error at /workdir/zephyr/cmake/dts.cmake:214 (message):
  command failed with return code: 1
Call Stack (most recent call first):
  /workdir/zephyr/cmake/app/boilerplate.cmake:564 (include)
  /workdir/zephyr/share/zephyr-package/cmake/ZephyrConfig.cmake:24 (include)
  /workdir/zephyr/share/zephyr-package/cmake/ZephyrConfig.cmake:35 (include_boilerplate)
  CMakeLists.txt:4 (find_package)


-- Configuring incomplete, errors occurred!

in Job #e59c125a-ff4d-4d76-bbbf-07c164fe21e2

samples/drivers/eeprom/sample.drivers.eeprom.shield.x_nucleo_eeprma2 in hifive1_revb:samples/drivers/eeprom/sample.drivers
Including boilerplate (Zephyr base): /workdir/zephyr/cmake/app/boilerplate.cmake
-- Application: /workdir/zephyr/samples/drivers/eeprom
-- Zephyr version: 2.6.99 (/workdir/zephyr), build: zephyr-v2.6.0-96-g1ce8d6fae43e
-- Found Python3: /usr/bin/python3.8 (found suitable exact version "3.8.5") found components: Interpreter
-- Found west (found suitable version "0.11.0", minimum required is "0.7.1")
-- Board: hifive1_revb, Shield(s): x_nucleo_eeprma2
-- Cache files will be written to: /root/.cache/zephyr
-- Using toolchain: zephyr 0.12.4 (/opt/toolchains/zephyr-sdk-0.12.4)
-- Found dtc: /opt/toolchains/zephyr-sdk-0.12.4/sysroots/x86_64-pokysdk-linux/usr/bin/dtc (found suitable version "1.5.0", minimum required is "1.4.6")
-- Found BOARD.dts: /workdir/zephyr/boards/riscv/hifive1_revb/hifive1_revb.dts
-- Found devicetree overlay: /workdir/zephyr/boards/shields/x_nucleo_eeprma2/x_nucleo_eeprma2.overlay
Error: hifive1_revb.dts.pre.tmp:373.11-12 syntax error
FATAL ERROR: Unable to parse input tree
CMake Error at /workdir/zephyr/cmake/dts.cmake:214 (message):
  command failed with return code: 1
Call Stack (most recent call first):
  /workdir/zephyr/cmake/app/boilerplate.cmake:564 (include)
  /workdir/zephyr/share/zephyr-package/cmake/ZephyrConfig.cmake:24 (include)
  /workdir/zephyr/share/zephyr-package/cmake/ZephyrConfig.cmake:35 (include_boilerplate)
  CMakeLists.txt:4 (find_package)


-- Configuring incomplete, errors occurred!

in Job #f5326bf8-0f03-42c7-8be2-18d2e7f70a45

samples/drivers/eeprom/sample.drivers.eeprom.shield.x_nucleo_eeprma2 in rv32m1_vega_ri5cy:samples/drivers/eeprom/sample.drivers
Including boilerplate (Zephyr base): /workdir/zephyr/cmake/app/boilerplate.cmake
-- Application: /workdir/zephyr/samples/drivers/eeprom
-- Zephyr version: 2.6.99 (/workdir/zephyr), build: zephyr-v2.6.0-96-g1ce8d6fae43e
-- Found Python3: /usr/bin/python3.8 (found suitable exact version "3.8.5") found components: Interpreter
-- Found west (found suitable version "0.11.0", minimum required is "0.7.1")
-- Board: rv32m1_vega_ri5cy, Shield(s): x_nucleo_eeprma2
-- Cache files will be written to: /root/.cache/zephyr
-- Using toolchain: zephyr 0.12.4 (/opt/toolchains/zephyr-sdk-0.12.4)
-- Found dtc: /opt/toolchains/zephyr-sdk-0.12.4/sysroots/x86_64-pokysdk-linux/usr/bin/dtc (found suitable version "1.5.0", minimum required is "1.4.6")
-- Found BOARD.dts: /workdir/zephyr/boards/riscv/rv32m1_vega/rv32m1_vega_ri5cy.dts
-- Found devicetree overlay: /workdir/zephyr/boards/shields/x_nucleo_eeprma2/x_nucleo_eeprma2.overlay
Error: rv32m1_vega_ri5cy.dts.pre.tmp:832.11-12 syntax error
FATAL ERROR: Unable to parse input tree
CMake Error at /workdir/zephyr/cmake/dts.cmake:214 (message):
  command failed with return code: 1
Call Stack (most recent call first):
  /workdir/zephyr/cmake/app/boilerplate.cmake:564 (include)
  /workdir/zephyr/share/zephyr-package/cmake/ZephyrConfig.cmake:24 (include)
  /workdir/zephyr/share/zephyr-package/cmake/ZephyrConfig.cmake:35 (include_boilerplate)
  CMakeLists.txt:4 (find_package)


-- Configuring incomplete, errors occurred!

in Job #fb660a4b-e46a-417c-83f8-8e368b67d016

samples/drivers/eeprom/sample.drivers.eeprom.shield.x_nucleo_eeprma2 in rv32m1_vega_zero_riscy:samples/drivers/eeprom/sample.drivers
Including boilerplate (Zephyr base): /workdir/zephyr/cmake/app/boilerplate.cmake
-- Application: /workdir/zephyr/samples/drivers/eeprom
-- Zephyr version: 2.6.99 (/workdir/zephyr), build: zephyr-v2.6.0-96-g1ce8d6fae43e
-- Found Python3: /usr/bin/python3.8 (found suitable exact version "3.8.5") found components: Interpreter
-- Found west (found suitable version "0.11.0", minimum required is "0.7.1")
-- Board: rv32m1_vega_zero_riscy, Shield(s): x_nucleo_eeprma2
-- Cache files will be written to: /root/.cache/zephyr
-- Using toolchain: zephyr 0.12.4 (/opt/toolchains/zephyr-sdk-0.12.4)
-- Found dtc: /opt/toolchains/zephyr-sdk-0.12.4/sysroots/x86_64-pokysdk-linux/usr/bin/dtc (found suitable version "1.5.0", minimum required is "1.4.6")
-- Found BOARD.dts: /workdir/zephyr/boards/riscv/rv32m1_vega/rv32m1_vega_zero_riscy.dts
-- Found devicetree overlay: /workdir/zephyr/boards/shields/x_nucleo_eeprma2/x_nucleo_eeprma2.overlay
Error: rv32m1_vega_zero_riscy.dts.pre.tmp:803.11-12 syntax error
FATAL ERROR: Unable to parse input tree
CMake Error at /workdir/zephyr/cmake/dts.cmake:214 (message):
  command failed with return code: 1
Call Stack (most recent call first):
  /workdir/zephyr/cmake/app/boilerplate.cmake:564 (include)
  /workdir/zephyr/share/zephyr-package/cmake/ZephyrConfig.cmake:24 (include)
  /workdir/zephyr/share/zephyr-package/cmake/ZephyrConfig.cmake:35 (include_boilerplate)
  CMakeLists.txt:4 (find_package)


-- Configuring incomplete, errors occurred!

in Job #fcd13554-d746-447c-8641-7131eeba6cab


[Failed] Zephyr / zephyr-daily #355 (main) #builds

Buildkite <notifications@...>
 

Scheduled build Duration: 5 hours, 40 minutes, 4 seconds
Build #355 | main | 2bf6313
View Build →
ℹ︎

Read the JUnit test report


[Failed] Zephyr / zephyr-daily #346 (main) #builds

Buildkite <notifications@...>
 

Scheduled build Duration: 6 hours, 7 minutes, 25 seconds
Build #346 | main | 94e8c2e
View Build →
ℹ︎

Read the JUnit test report

✖︎

2 failures:

tests/subsys/cpp/libcxx/cpp.libcxx.exceptions in intel_s1000_crb:tests/subsys/cpp/libcxx/cpp.libcxx
Including boilerplate (Zephyr base): /workdir/zephyr/cmake/app/boilerplate.cmake
-- Application: /workdir/zephyr/tests/subsys/cpp/libcxx
-- Zephyr version: 2.6.0-rc2 (/workdir/zephyr), build: v2.6.0-rc2-39-g94e8c2eb81f3
-- Found Python3: /usr/bin/python3.8 (found suitable exact version "3.8.5") found components: Interpreter
-- Found west (found suitable version "0.11.0", minimum required is "0.7.1")
-- Board: intel_s1000_crb
-- Cache files will be written to: /root/.cache/zephyr
-- Using toolchain: zephyr 0.12.4 (/opt/toolchains/zephyr-sdk-0.12.4)
-- Found dtc: /opt/toolchains/zephyr-sdk-0.12.4/sysroots/x86_64-pokysdk-linux/usr/bin/dtc (found suitable version "1.5.0", minimum required is "1.4.6")
-- Found BOARD.dts: /workdir/zephyr/boards/xtensa/intel_s1000_crb/intel_s1000_crb.dts
-- Generated zephyr.dts: /workdir/zephyr/twister-out/intel_s1000_crb/tests/subsys/cpp/libcxx/cpp.libcxx.exceptions/zephyr/zephyr.dts
-- Generated devicetree_unfixed.h: /workdir/zephyr/twister-out/intel_s1000_crb/tests/subsys/cpp/libcxx/cpp.libcxx.exceptions/zephyr/include/generated/devicetree_unfixed.h
-- Generated device_extern.h: /workdir/zephyr/twister-out/intel_s1000_crb/tests/subsys/cpp/libcxx/cpp.libcxx.exceptions/zephyr/include/generated/device_extern.h
Parsing /workdir/zephyr/Kconfig
Loaded configuration '/workdir/zephyr/boards/xtensa/intel_s1000_crb/intel_s1000_crb_defconfig'
Merged configuration '/workdir/zephyr/tests/subsys/cpp/libcxx/prj.conf'
Merged configuration '/workdir/zephyr/twister-out/intel_s1000_crb/tests/subsys/cpp/libcxx/cpp.libcxx.exceptions/twister/testcase_extra.conf'
Configuration saved to '/workdir/zephyr/twister-out/intel_s1000_crb/tests/subsys/cpp/libcxx/cpp.libcxx.exceptions/zephyr/.config'
Kconfig header saved to '/workdir/zephyr/twister-out/intel_s1000_crb/tests/subsys/cpp/libcxx/cpp.libcxx.exceptions/zephyr/include/generated/autoconf.h'
-- The C compiler identification is GNU 10.2.0
-- The CXX compiler identification is GNU 10.2.0
-- The ASM compiler identification is GNU
-- Found assembler: /opt/toolchains/zephyr-sdk-0.12.4/xtensa/intel_s1000/xtensa-zephyr-elf/bin/xtensa-zephyr-elf-gcc
-- Configuring done
-- Generating done
-- Build files have been written to: /workdir/zephyr/twister-out/intel_s1000_crb/tests/subsys/cpp/libcxx/cpp.libcxx.exceptions
[1/133] Preparing syscall dependency handling

[2/133] Generating misc/generated/syscalls_subdirs.trigger
[3/133] Generating misc/generated/syscalls.json, misc/generated/struct_tags.json
[4/133] Generating include/generated/syscall_dispatch.c, include/generated/syscall_list.h
[5/133] Generating include/generated/driver-validation.h
[6/133] Generating include/generated/kobj-types-enum.h, include/generated/otype-to-str.h, include/generated/otype-to-size.h
[7/133] Building C object zephyr/CMakeFiles/offsets.dir/arch/xtensa/core/offsets/offsets.c.obj
[8/133] Generating include/generated/offsets.h
[9/133] Building C object zephyr/CMakeFiles/zephyr.dir/lib/os/cbprintf.c.obj
[10/133] Building C object zephyr/CMakeFiles/zephyr.dir/lib/os/crc32c_sw.c.obj
[11/133] Building C object zephyr/CMakeFiles/zephyr.dir/lib/os/cbprintf_packaged.c.obj
[12/133] Building C object zephyr/CMakeFiles/zephyr.dir/lib/os/crc32_sw.c.obj
[13/133] Building C object zephyr/CMakeFiles/zephyr.dir/lib/os/crc8_sw.c.obj
[14/133] Building C object zephyr/CMakeFiles/zephyr.dir/lib/os/crc16_sw.c.obj
[15/133] Building C object zephyr/CMakeFiles/zephyr.dir/lib/os/crc7_sw.c.obj
[16/133] Building C object zephyr/CMakeFiles/zephyr.dir/lib/os/dec.c.obj
[17/133] Building C object zephyr/CMakeFiles/zephyr.dir/lib/os/hex.c.obj
[18/133] Building C object zephyr/CMakeFiles/zephyr.dir/lib/os/fdtable.c.obj
[19/133] Building C object zephyr/CMakeFiles/zephyr.dir/lib/os/notify.c.obj
[20/133] Building C object zephyr/CMakeFiles/zephyr.dir/lib/os/printk.c.obj
[21/133] Building C object zephyr/CMakeFiles/zephyr.dir/lib/os/onoff.c.obj
[22/133] Building C object zephyr/CMakeFiles/zephyr.dir/lib/os/rb.c.obj
[23/133] Building C object zephyr/CMakeFiles/zephyr.dir/lib/os/sem.c.obj
[24/133] Building C object zephyr/CMakeFiles/zephyr.dir/lib/os/thread_entry.c.obj
[25/133] Building CXX object CMakeFiles/app.dir/src/main.cpp.obj
[26/133] Linking CXX static library app/libapp.a
[27/133] Building C object zephyr/CMakeFiles/zephyr.dir/lib/os/timeutil.c.obj
[28/133] Building C object zephyr/CMakeFiles/zephyr.dir/lib/os/heap.c.obj
[29/133] Building C object zephyr/CMakeFiles/zephyr.dir/lib/os/heap-validate.c.obj
[30/133] Building C object zephyr/CMakeFiles/zephyr.dir/lib/os/bitarray.c.obj
[31/133] Building C object zephyr/CMakeFiles/zephyr.dir/lib/os/assert.c.obj
[32/133] Building C object zephyr/CMakeFiles/zephyr.dir/misc/generated/configs.c.obj
[33/133] Building C object zephyr/CMakeFiles/zephyr.dir/lib/os/cbprintf_complete.c.obj
[34/133] Building C object zephyr/CMakeFiles/zephyr.dir/subsys/logging/log_minimal.c.obj
[35/133] Building C object zephyr/CMakeFiles/zephyr.dir/subsys/cpp/cpp_init_array.c.obj
[36/133] Building C object zephyr/CMakeFiles/zephyr.dir/subsys/cpp/cpp_ctors.c.obj
[37/133] Building C object zephyr/CMakeFiles/zephyr.dir/lib/os/mpsc_pbuf.c.obj
[38/133] Building C object zephyr/CMakeFiles/zephyr.dir/subsys/cpp/cpp_dtors.c.obj
[39/133] Building C object zephyr/CMakeFiles/zephyr.dir/subsys/tracing/tracing_none.c.obj
[40/133] Building C object zephyr/CMakeFiles/zephyr.dir/drivers/console/uart_console.c.obj
[41/133] Building C object zephyr/CMakeFiles/zephyr.dir/drivers/interrupt_controller/intc_cavs.c.obj
[42/133] Building C object zephyr/CMakeFiles/zephyr.dir/drivers/interrupt_controller/intc_dw.c.obj
[43/133] Building C object zephyr/CMakeFiles/zephyr.dir/drivers/timer/sys_clock_init.c.obj
[44/133] Building C object zephyr/CMakeFiles/zephyr.dir/drivers/pinmux/pinmux_intel_s1000.c.obj
[45/133] Generating linker_zephyr_prebuilt.cmd
[46/133] Building C object zephyr/CMakeFiles/zephyr_prebuilt.dir/misc/empty_file.c.obj
[47/133] Building C object zephyr/arch/common/CMakeFiles/isr_tables.dir/isr_tables.c.obj
[48/133] Linking C static library zephyr/arch/common/libisr_tables.a
[49/133] Building C object zephyr/arch/common/CMakeFiles/arch__common.dir/sw_isr_common.c.obj
[50/133] Linking C static library zephyr/arch/common/libarch__common.a
[51/133] Building C object zephyr/CMakeFiles/zephyr.dir/drivers/timer/xtensa_sys_timer.c.obj
[52/133] Linking C static library zephyr/libzephyr.a
[53/133] Building ASM object zephyr/arch/arch/xtensa/core/CMakeFiles/arch__xtensa__core.dir/window_vectors.S.obj
[54/133] Building ASM object zephyr/arch/arch/xtensa/core/CMakeFiles/arch__xtensa__core.dir/xtensa-asm2-util.S.obj
[55/133] Building C object zephyr/arch/arch/xtensa/core/CMakeFiles/arch__xtensa__core.dir/fatal.c.obj
[56/133] Building C object zephyr/arch/arch/xtensa/core/CMakeFiles/arch__xtensa__core.dir/cpu_idle.c.obj
[57/133] Building ASM object zephyr/arch/arch/xtensa/core/CMakeFiles/arch__xtensa__core.dir/crt1.S.obj
[58/133] Building C object zephyr/arch/arch/xtensa/core/CMakeFiles/arch__xtensa__core.dir/irq_manage.c.obj
[59/133] Building ASM object zephyr/arch/arch/xtensa/core/startup/CMakeFiles/arch__xtensa__core__startup.dir/reset-vector.S.obj
[60/133] Building ASM object zephyr/arch/arch/xtensa/core/startup/CMakeFiles/arch__xtensa__core__startup.dir/memerror-vector.S.obj
[61/133] Building ASM object zephyr/arch/arch/xtensa/core/startup/CMakeFiles/arch__xtensa__core__startup.dir/memctl_default.S.obj
[62/133] Linking ASM static library zephyr/arch/arch/xtensa/core/startup/libarch__xtensa__core__startup.a
[63/133] Building C object zephyr/lib/posix/CMakeFiles/lib__posix.dir/pthread_common.c.obj
[64/133] Building C object zephyr/lib/libc/newlib/CMakeFiles/lib__libc__newlib.dir/libc-hooks.c.obj
[65/133] Linking C static library zephyr/lib/libc/newlib/liblib__libc__newlib.a
[66/133] Building C object zephyr/lib/posix/CMakeFiles/lib__posix.dir/nanosleep.c.obj
[67/133] Linking C static library zephyr/lib/posix/liblib__posix.a
[68/133] Building C object zephyr/arch/arch/xtensa/core/CMakeFiles/arch__xtensa__core.dir/xtensa-asm2.c.obj
[69/133] Linking C static library zephyr/arch/arch/xtensa/core/libarch__xtensa__core.a
[70/133] Building C object zephyr/boards/xtensa/intel_s1000_crb/CMakeFiles/boards__xtensa__intel_s1000_crb.dir/pinmux.c.obj
[71/133] Building ASM object modules/xtensa/CMakeFiles/modules_xtensa_hal.dir/src/hal/mp_asm.S.obj
[72/133] Linking C static library zephyr/boards/xtensa/intel_s1000_crb/libboards__xtensa__intel_s1000_crb.a
[73/133] Building C object zephyr/soc/xtensa/intel_s1000/CMakeFiles/soc__xtensa__intel_s1000.dir/soc.c.obj
[74/133] Linking C static library zephyr/soc/xtensa/intel_s1000/libsoc__xtensa__intel_s1000.a
[75/133] Building C object zephyr/subsys/testsuite/ztest/CMakeFiles/subsys__testsuite__ztest.dir/src/ztest_error_hook.c.obj
[76/133] Building C object zephyr/subsys/testsuite/ztest/CMakeFiles/subsys__testsuite__ztest.dir/src/ztest.c.obj
[77/133] Building C object modules/xtensa/CMakeFiles/modules_xtensa_hal.dir/src/hal/attribute.c.obj
[78/133] Linking C static library zephyr/subsys/testsuite/ztest/libsubsys__testsuite__ztest.a
[79/133] Building C object modules/xtensa/CMakeFiles/modules_xtensa_hal.dir/src/hal/cache.c.obj
[80/133] Building ASM object modules/xtensa/CMakeFiles/modules_xtensa_hal.dir/src/hal/clock.S.obj
[81/133] Building ASM object modules/xtensa/CMakeFiles/modules_xtensa_hal.dir/src/hal/cache_asm.S.obj
[82/133] Building C object modules/xtensa/CMakeFiles/modules_xtensa_hal.dir/src/hal/coherence.c.obj
[83/133] Building C object modules/xtensa/CMakeFiles/modules_xtensa_hal.dir/src/hal/debug.c.obj
[84/133] Building ASM object modules/xtensa/CMakeFiles/modules_xtensa_hal.dir/src/hal/debug_hndlr.S.obj
[85/133] Building C object modules/xtensa/CMakeFiles/modules_xtensa_hal.dir/src/hal/disass.c.obj
[86/133] Building ASM object modules/xtensa/CMakeFiles/modules_xtensa_hal.dir/src/hal/int_asm.S.obj
[87/133] Building ASM object modules/xtensa/CMakeFiles/modules_xtensa_hal.dir/src/hal/memcopy.S.obj
[88/133] Building C object zephyr/drivers/serial/CMakeFiles/drivers__serial.dir/uart_ns16550.c.obj
[89/133] Building C object modules/xtensa/CMakeFiles/modules_xtensa_hal.dir/src/hal/interrupts.c.obj
[90/133] Linking C static library zephyr/drivers/serial/libdrivers__serial.a
[91/133] Building ASM object modules/xtensa/CMakeFiles/modules_xtensa_hal.dir/src/hal/mem_ecc_parity.S.obj
[92/133] Building ASM object modules/xtensa/CMakeFiles/modules_xtensa_hal.dir/src/hal/miscellaneous.S.obj
[93/133] Building C object modules/xtensa/CMakeFiles/modules_xtensa_hal.dir/src/hal/misc.c.obj
[94/133] Building C object modules/xtensa/CMakeFiles/modules_xtensa_hal.dir/src/hal/mmu.c.obj
[95/133] Building ASM object modules/xtensa/CMakeFiles/modules_xtensa_hal.dir/src/hal/state_asm.S.obj
[96/133] Building C object modules/xtensa/CMakeFiles/modules_xtensa_hal.dir/src/hal/set_region_translate.c.obj
[97/133] Building ASM object modules/xtensa/CMakeFiles/modules_xtensa_hal.dir/src/hal/syscache_asm.S.obj
[98/133] Building ASM object modules/xtensa/CMakeFiles/modules_xtensa_hal.dir/src/hal/windowspill_asm.S.obj
[99/133] Building C object modules/xtensa/CMakeFiles/modules_xtensa_hal.dir/src/hal/state.c.obj
[100/133] Linking C static library modules/xtensa/libmodules_xtensa_hal.a
[101/133] Building C object zephyr/kernel/CMakeFiles/kernel.dir/banner.c.obj
[102/133] Building C object zephyr/kernel/CMakeFiles/kernel.dir/errno.c.obj
[103/133] Building C object zephyr/kernel/CMakeFiles/kernel.dir/device.c.obj
[104/133] Building C object zephyr/kernel/CMakeFiles/kernel.dir/fatal.c.obj
[105/133] Building C object zephyr/kernel/CMakeFiles/kernel.dir/init.c.obj
[106/133] Building C object zephyr/kernel/CMakeFiles/kernel.dir/kheap.c.obj
[107/133] Building C object zephyr/kernel/CMakeFiles/kernel.dir/version.c.obj
[108/133] Building C object zephyr/kernel/CMakeFiles/kernel.dir/mem_slab.c.obj
[109/133] Building C object zephyr/kernel/CMakeFiles/kernel.dir/idle.c.obj
[110/133] Building C object zephyr/kernel/CMakeFiles/kernel.dir/thread.c.obj
[111/133] Building C object zephyr/kernel/CMakeFiles/kernel.dir/mailbox.c.obj
[112/133] Building C object zephyr/kernel/CMakeFiles/kernel.dir/msg_q.c.obj
[113/133] Building C object zephyr/kernel/CMakeFiles/kernel.dir/mutex.c.obj
[114/133] Building C object zephyr/kernel/CMakeFiles/kernel.dir/queue.c.obj
[115/133] Building C object zephyr/kernel/CMakeFiles/kernel.dir/pipes.c.obj
[116/133] Building C object zephyr/kernel/CMakeFiles/kernel.dir/system_work_q.c.obj
[117/133] Building C object zephyr/kernel/CMakeFiles/kernel.dir/sem.c.obj
[118/133] Building C object zephyr/kernel/CMakeFiles/kernel.dir/stack.c.obj
[119/133] Building C object zephyr/kernel/CMakeFiles/kernel.dir/condvar.c.obj
[120/133] Building C object zephyr/kernel/CMakeFiles/kernel.dir/work.c.obj
[121/133] Building C object zephyr/kernel/CMakeFiles/kernel.dir/timeout.c.obj
[122/133] Building C object zephyr/kernel/CMakeFiles/kernel.dir/sched.c.obj
[123/133] Building C object zephyr/kernel/CMakeFiles/kernel.dir/mempool.c.obj
[124/133] Building C object zephyr/kernel/CMakeFiles/kernel.dir/timer.c.obj
[125/133] Linking C static library zephyr/kernel/libkernel.a
[126/133] Linking CXX executable zephyr/zephyr_prebuilt.elf
FAILED: zephyr/zephyr_prebuilt.elf zephyr/zephyr_prebuilt.map
: && ccache /opt/toolchains/zephyr-sdk-0.12.4/xtensa/intel_s1000/xtensa-zephyr-elf/bin/xtensa-zephyr-elf-g++   /opt/toolchains/zephyr-sdk-0.12.4/xtensa/intel_s1000/xtensa-zephyr-elf/bin/../lib/gcc/xtensa-zephyr-elf/10.2.0/crtbegin.o zephyr/CMakeFiles/zephyr_prebuilt.dir/misc/empty_file.c.obj -o zephyr/zephyr_prebuilt.elf  -fuse-ld=bfd  -Wl,-T  zephyr/linker_zephyr_prebuilt.cmd  -Wl,-Map=/workdir/zephyr/twister-out/intel_s1000_crb/tests/subsys/cpp/libcxx/cpp.libcxx.exceptions/zephyr/zephyr_prebuilt.map  -Wl,--whole-archive  app/libapp.a  zephyr/libzephyr.a  zephyr/arch/common/libarch__common.a  zephyr/arch/arch/xtensa/core/libarch__xtensa__core.a  zephyr/arch/arch/xtensa/core/startup/libarch__xtensa__core__startup.a  zephyr/lib/libc/newlib/liblib__libc__newlib.a  zephyr/lib/posix/liblib__posix.a  zephyr/soc/xtensa/intel_s1000/libsoc__xtensa__intel_s1000.a  zephyr/boards/xtensa/intel_s1000_crb/libboards__xtensa__intel_s1000_crb.a  zephyr/subsys/testsuite/ztest/libsubsys__testsuite__ztest.a  zephyr/drivers/serial/libdrivers__serial.a  modules/xtensa/libmodules_xtensa_hal.a  -Wl,--no-whole-archive  zephyr/kernel/libkernel.a  zephyr/CMakeFiles/offsets.dir/./arch/xtensa/core/offsets/offsets.c.obj  -L"/opt/toolchains/zephyr-sdk-0.12.4/xtensa/intel_s1000/xtensa-zephyr-elf/bin/../lib/gcc/xtensa-zephyr-elf/10.2.0"  -L/workdir/zephyr/twister-out/intel_s1000_crb/tests/subsys/cpp/libcxx/cpp.libcxx.exceptions/zephyr  -lgcc  zephyr/arch/common/libisr_tables.a  -Wl,--gc-sections  -Wl,--build-id=none  -Wl,--sort-common=descending  -Wl,--sort-section=alignment  -Wl,-u,_OffsetAbsSyms  -Wl,-u,_ConfigAbsSyms  -nostdlib  -static  -no-pie  -Wl,-X  -Wl,-N  -Wl,--orphan-handling=warn  -lstdc++  -Wl,--fatal-warnings  -lm  -Wl,-lc  -L"/opt/toolchains/zephyr-sdk-0.12.4/xtensa/intel_s1000/xtensa-zephyr-elf"/lib/.  -Wl,-lgcc  -lc /opt/toolchains/zephyr-sdk-0.12.4/xtensa/intel_s1000/xtensa-zephyr-elf/bin/../lib/gcc/xtensa-zephyr-elf/10.2.0/crtend.o && cd /workdir/zephyr/twister-out/intel_s1000_crb/tests/subsys/cpp/libcxx/cpp.libcxx.exceptions/zephyr && /usr/local/bin/cmake -E echo
/opt/toolchains/zephyr-sdk-0.12.4/xtensa/intel_s1000/xtensa-zephyr-elf/bin/../lib/gcc/xtensa-zephyr-elf/10.2.0/../../../../xtensa-zephyr-elf/bin/ld.bfd: warning: orphan section `.tm_clone_table' from `/opt/toolchains/zephyr-sdk-0.12.4/xtensa/intel_s1000/xtensa-zephyr-elf/bin/../lib/gcc/xtensa-zephyr-elf/10.2.0/crtbegin.o' being placed in section `.tm_clone_table'
/opt/toolchains/zephyr-sdk-0.12.4/xtensa/intel_s1000/xtensa-zephyr-elf/bin/../lib/gcc/xtensa-zephyr-elf/10.2.0/../../../../xtensa-zephyr-elf/bin/ld.bfd: warning: orphan section `.tm_clone_table' from `/opt/toolchains/zephyr-sdk-0.12.4/xtensa/intel_s1000/xtensa-zephyr-elf/bin/../lib/gcc/xtensa-zephyr-elf/10.2.0/crtend.o' being placed in section `.tm_clone_table'
collect2: error: ld returned 1 exit status
ninja: build stopped: subcommand failed.

in Job #e586506c-05a0-443f-97f2-6521cf5cef27

tests/subsys/cpp/libcxx/cpp.libcxx.exceptions in intel_adsp_cavs15:tests/subsys/cpp/libcxx/cpp.libcxx
Including boilerplate (Zephyr base): /workdir/zephyr/cmake/app/boilerplate.cmake
-- Application: /workdir/zephyr/tests/subsys/cpp/libcxx
-- Zephyr version: 2.6.0-rc2 (/workdir/zephyr), build: v2.6.0-rc2-39-g94e8c2eb81f3
-- Found Python3: /usr/bin/python3.8 (found suitable exact version "3.8.5") found components: Interpreter
-- Found west (found suitable version "0.11.0", minimum required is "0.7.1")
-- Board: intel_adsp_cavs15
-- Cache files will be written to: /root/.cache/zephyr
-- Using toolchain: zephyr 0.12.4 (/opt/toolchains/zephyr-sdk-0.12.4)
-- Found dtc: /opt/toolchains/zephyr-sdk-0.12.4/sysroots/x86_64-pokysdk-linux/usr/bin/dtc (found suitable version "1.5.0", minimum required is "1.4.6")
-- Found BOARD.dts: /workdir/zephyr/boards/xtensa/intel_adsp_cavs15/intel_adsp_cavs15.dts
intel_adsp_cavs15.dts.pre.tmp:96.28-99.5: Warning (simple_bus_reg): /soc/ipm_console: missing or empty reg/ranges property
-- Generated zephyr.dts: /workdir/zephyr/twister-out/intel_adsp_cavs15/tests/subsys/cpp/libcxx/cpp.libcxx.exceptions/zephyr/zephyr.dts
-- Generated devicetree_unfixed.h: /workdir/zephyr/twister-out/intel_adsp_cavs15/tests/subsys/cpp/libcxx/cpp.libcxx.exceptions/zephyr/include/generated/devicetree_unfixed.h
-- Generated device_extern.h: /workdir/zephyr/twister-out/intel_adsp_cavs15/tests/subsys/cpp/libcxx/cpp.libcxx.exceptions/zephyr/include/generated/device_extern.h
Parsing /workdir/zephyr/Kconfig
Loaded configuration '/workdir/zephyr/boards/xtensa/intel_adsp_cavs15/intel_adsp_cavs15_defconfig'
Merged configuration '/workdir/zephyr/tests/subsys/cpp/libcxx/prj.conf'
Merged configuration '/workdir/zephyr/twister-out/intel_adsp_cavs15/tests/subsys/cpp/libcxx/cpp.libcxx.exceptions/twister/testcase_extra.conf'
Configuration saved to '/workdir/zephyr/twister-out/intel_adsp_cavs15/tests/subsys/cpp/libcxx/cpp.libcxx.exceptions/zephyr/.config'
Kconfig header saved to '/workdir/zephyr/twister-out/intel_adsp_cavs15/tests/subsys/cpp/libcxx/cpp.libcxx.exceptions/zephyr/include/generated/autoconf.h'
-- The C compiler identification is GNU 10.2.0
-- The CXX compiler identification is GNU 10.2.0
-- The ASM compiler identification is GNU
-- Found assembler: /opt/toolchains/zephyr-sdk-0.12.4/xtensa/intel_apl_adsp/xtensa-zephyr-elf/bin/xtensa-zephyr-elf-gcc
-- Configuring done
-- Generating done
-- Build files have been written to: /workdir/zephyr/twister-out/intel_adsp_cavs15/tests/subsys/cpp/libcxx/cpp.libcxx.exceptions
[1/143] Building C object zephyr/soc/xtensa/intel_adsp/common/bootloader/CMakeFiles/boot_module.dir/boot_module.c.obj
[2/143] Preparing syscall dependency handling

[3/143] Building C object zephyr/soc/xtensa/intel_adsp/common/bootloader/CMakeFiles/base_module.dir/base_module.c.obj
[4/143] Linking C static library zephyr/soc/xtensa/intel_adsp/common/bootloader/libboot_module.a
[5/143] Linking C static library zephyr/soc/xtensa/intel_adsp/common/bootloader/libbase_module.a
[6/143] Generating misc/generated/syscalls_subdirs.trigger
[7/143] Generating misc/generated/syscalls.json, misc/generated/struct_tags.json
[8/143] Generating include/generated/syscall_dispatch.c, include/generated/syscall_list.h
[9/143] Generating include/generated/driver-validation.h
[10/143] Generating include/generated/kobj-types-enum.h, include/generated/otype-to-str.h, include/generated/otype-to-size.h
[11/143] Building C object zephyr/CMakeFiles/offsets.dir/arch/xtensa/core/offsets/offsets.c.obj
[12/143] Generating include/generated/offsets.h
[13/143] Building C object zephyr/CMakeFiles/zephyr.dir/lib/os/cbprintf.c.obj
[14/143] Building C object zephyr/CMakeFiles/zephyr.dir/lib/os/crc32c_sw.c.obj
[15/143] Building C object zephyr/CMakeFiles/zephyr.dir/lib/os/crc32_sw.c.obj
[16/143] Building C object zephyr/CMakeFiles/zephyr.dir/lib/os/cbprintf_packaged.c.obj
[17/143] Building C object zephyr/CMakeFiles/zephyr.dir/lib/os/crc8_sw.c.obj
[18/143] Building C object zephyr/CMakeFiles/zephyr.dir/lib/os/crc16_sw.c.obj
[19/143] Building C object zephyr/CMakeFiles/zephyr.dir/lib/os/crc7_sw.c.obj
[20/143] Building C object zephyr/CMakeFiles/zephyr.dir/lib/os/dec.c.obj
[21/143] Building C object zephyr/CMakeFiles/zephyr.dir/lib/os/hex.c.obj
[22/143] Building C object zephyr/CMakeFiles/zephyr.dir/lib/os/fdtable.c.obj
[23/143] Building C object zephyr/CMakeFiles/zephyr.dir/lib/os/notify.c.obj
[24/143] Building C object zephyr/CMakeFiles/zephyr.dir/lib/os/printk.c.obj
[25/143] Building C object zephyr/CMakeFiles/zephyr.dir/lib/os/rb.c.obj
[26/143] Building C object zephyr/CMakeFiles/zephyr.dir/lib/os/onoff.c.obj
[27/143] Building C object zephyr/CMakeFiles/zephyr.dir/lib/os/sem.c.obj
[28/143] Building C object zephyr/CMakeFiles/zephyr.dir/lib/os/thread_entry.c.obj
[29/143] Building C object zephyr/CMakeFiles/zephyr.dir/lib/os/timeutil.c.obj
[30/143] Building CXX object CMakeFiles/app.dir/src/main.cpp.obj
[31/143] Linking CXX static library app/libapp.a
[32/143] Building C object zephyr/CMakeFiles/zephyr.dir/lib/os/heap-validate.c.obj
[33/143] Building C object zephyr/CMakeFiles/zephyr.dir/lib/os/heap.c.obj
[34/143] Building C object zephyr/CMakeFiles/zephyr.dir/lib/os/assert.c.obj
[35/143] Building C object zephyr/CMakeFiles/zephyr.dir/misc/generated/configs.c.obj
[36/143] Building C object zephyr/CMakeFiles/zephyr.dir/lib/os/bitarray.c.obj
[37/143] Building C object zephyr/CMakeFiles/zephyr.dir/subsys/cpp/cpp_init_array.c.obj
[38/143] Building C object zephyr/CMakeFiles/zephyr.dir/subsys/cpp/cpp_ctors.c.obj
[39/143] Building C object zephyr/CMakeFiles/zephyr.dir/subsys/cpp/cpp_dtors.c.obj
[40/143] Building C object zephyr/CMakeFiles/zephyr.dir/lib/os/cbprintf_complete.c.obj
[41/143] Building C object zephyr/CMakeFiles/zephyr.dir/subsys/tracing/tracing_none.c.obj
[42/143] Building C object zephyr/CMakeFiles/zephyr.dir/drivers/interrupt_controller/intc_cavs.c.obj
[43/143] Generating linker_zephyr_prebuilt.cmd
[44/143] Building C object zephyr/CMakeFiles/zephyr.dir/drivers/timer/sys_clock_init.c.obj
[45/143] Building C object zephyr/CMakeFiles/zephyr_prebuilt.dir/misc/empty_file.c.obj
[46/143] Building C object zephyr/arch/common/CMakeFiles/isr_tables.dir/isr_tables.c.obj
[47/143] Linking C static library zephyr/arch/common/libisr_tables.a
[48/143] Building C object zephyr/arch/common/CMakeFiles/arch__common.dir/sw_isr_common.c.obj
[49/143] Building C object zephyr/CMakeFiles/zephyr.dir/drivers/timer/cavs_timer.c.obj
[50/143] Linking C static library zephyr/arch/common/libarch__common.a
[51/143] Linking C static library zephyr/libzephyr.a
[52/143] Building ASM object zephyr/arch/arch/xtensa/core/CMakeFiles/arch__xtensa__core.dir/window_vectors.S.obj
[53/143] Building C object zephyr/arch/arch/xtensa/core/CMakeFiles/arch__xtensa__core.dir/cpu_idle.c.obj
[54/143] Building ASM object zephyr/arch/arch/xtensa/core/CMakeFiles/arch__xtensa__core.dir/xtensa-asm2-util.S.obj
[55/143] Building C object zephyr/arch/arch/xtensa/core/CMakeFiles/arch__xtensa__core.dir/fatal.c.obj
[56/143] Building ASM object zephyr/arch/arch/xtensa/core/CMakeFiles/arch__xtensa__core.dir/crt1.S.obj
[57/143] Building C object zephyr/arch/arch/xtensa/core/CMakeFiles/arch__xtensa__core.dir/irq_manage.c.obj
[58/143] Building ASM object zephyr/arch/arch/xtensa/core/startup/CMakeFiles/arch__xtensa__core__startup.dir/reset-vector.S.obj
[59/143] Building ASM object zephyr/arch/arch/xtensa/core/startup/CMakeFiles/arch__xtensa__core__startup.dir/memerror-vector.S.obj
[60/143] Building ASM object zephyr/arch/arch/xtensa/core/startup/CMakeFiles/arch__xtensa__core__startup.dir/memctl_default.S.obj
[61/143] Linking ASM static library zephyr/arch/arch/xtensa/core/startup/libarch__xtensa__core__startup.a
[62/143] Building C object zephyr/lib/posix/CMakeFiles/lib__posix.dir/pthread_common.c.obj
[63/143] Building C object zephyr/lib/libc/newlib/CMakeFiles/lib__libc__newlib.dir/libc-hooks.c.obj
[64/143] Linking C static library zephyr/lib/libc/newlib/liblib__libc__newlib.a
[65/143] Building C object zephyr/lib/posix/CMakeFiles/lib__posix.dir/nanosleep.c.obj
[66/143] Linking C static library zephyr/lib/posix/liblib__posix.a
[67/143] Building C object zephyr/arch/arch/xtensa/core/CMakeFiles/arch__xtensa__core.dir/xtensa-asm2.c.obj
[68/143] Linking C static library zephyr/arch/arch/xtensa/core/libarch__xtensa__core.a
[69/143] Building C object zephyr/soc/xtensa/intel_adsp/common/CMakeFiles/intel_adsp_common.dir/adsp.c.obj
[70/143] Building ASM object zephyr/soc/xtensa/intel_adsp/common/CMakeFiles/intel_adsp_common.dir/main_entry.S.obj
[71/143] Building C object zephyr/soc/xtensa/intel_adsp/common/CMakeFiles/intel_adsp_common.dir/soc_mp.c.obj
[72/143] Building C object zephyr/soc/xtensa/intel_adsp/common/CMakeFiles/intel_adsp_common.dir/trace_out.c.obj
[73/143] Building ASM object zephyr/soc/xtensa/intel_adsp/common/bootloader/CMakeFiles/bootloader.dir/boot_entry.S.obj
[74/143] Building C object zephyr/soc/xtensa/intel_adsp/common/CMakeFiles/intel_adsp_common.dir/soc.c.obj
[75/143] Linking C static library zephyr/soc/xtensa/intel_adsp/common/libintel_adsp_common.a
[76/143] Building ASM object zephyr/soc/xtensa/intel_adsp/common/bootloader/CMakeFiles/bootloader.dir/__/__/__/__/__/arch/xtensa/core/startup/memctl_default.S.obj
[77/143] Building ASM object zephyr/soc/xtensa/intel_adsp/common/bootloader/CMakeFiles/bootloader.dir/__/__/__/__/__/arch/xtensa/core/startup/memerror-vector.S.obj
[78/143] Building ASM object zephyr/soc/xtensa/intel_adsp/common/bootloader/CMakeFiles/bootloader.dir/start_address.S.obj
[79/143] Building C object modules/xtensa/CMakeFiles/modules_xtensa_hal.dir/src/hal/cache.c.obj
[80/143] Building C object zephyr/soc/xtensa/intel_adsp/common/bootloader/CMakeFiles/bootloader.dir/boot_loader.c.obj
[81/143] Building C object zephyr/subsys/testsuite/ztest/CMakeFiles/subsys__testsuite__ztest.dir/src/ztest_error_hook.c.obj
[82/143] Building C object modules/xtensa/CMakeFiles/modules_xtensa_hal.dir/src/hal/attribute.c.obj
[83/143] Building C object zephyr/subsys/testsuite/ztest/CMakeFiles/subsys__testsuite__ztest.dir/src/ztest.c.obj
[84/143] Building C object zephyr/drivers/ipm/CMakeFiles/drivers__ipm.dir/ipm_cavs_idc.c.obj
[85/143] Linking C static library zephyr/subsys/testsuite/ztest/libsubsys__testsuite__ztest.a
[86/143] Linking C static library zephyr/drivers/ipm/libdrivers__ipm.a
[87/143] Building ASM object modules/xtensa/CMakeFiles/modules_xtensa_hal.dir/src/hal/cache_asm.S.obj
[88/143] Building ASM object modules/xtensa/CMakeFiles/modules_xtensa_hal.dir/src/hal/clock.S.obj
[89/143] Building C object modules/xtensa/CMakeFiles/modules_xtensa_hal.dir/src/hal/coherence.c.obj
[90/143] Building C object modules/xtensa/CMakeFiles/modules_xtensa_hal.dir/src/hal/debug.c.obj
[91/143] Building ASM object modules/xtensa/CMakeFiles/modules_xtensa_hal.dir/src/hal/debug_hndlr.S.obj
[92/143] Building ASM object modules/xtensa/CMakeFiles/modules_xtensa_hal.dir/src/hal/int_asm.S.obj
[93/143] Building ASM object modules/xtensa/CMakeFiles/modules_xtensa_hal.dir/src/hal/memcopy.S.obj
[94/143] Building C object modules/xtensa/CMakeFiles/modules_xtensa_hal.dir/src/hal/disass.c.obj
[95/143] Building C object modules/xtensa/CMakeFiles/modules_xtensa_hal.dir/src/hal/interrupts.c.obj
[96/143] Building ASM object modules/xtensa/CMakeFiles/modules_xtensa_hal.dir/src/hal/mem_ecc_parity.S.obj
[97/143] Building C object modules/xtensa/CMakeFiles/modules_xtensa_hal.dir/src/hal/misc.c.obj
[98/143] Building ASM object modules/xtensa/CMakeFiles/modules_xtensa_hal.dir/src/hal/miscellaneous.S.obj
[99/143] Building C object modules/xtensa/CMakeFiles/modules_xtensa_hal.dir/src/hal/mmu.c.obj
[100/143] Building ASM object modules/xtensa/CMakeFiles/modules_xtensa_hal.dir/src/hal/mp_asm.S.obj
[101/143] Building ASM object modules/xtensa/CMakeFiles/modules_xtensa_hal.dir/src/hal/state_asm.S.obj
[102/143] Building C object modules/xtensa/CMakeFiles/modules_xtensa_hal.dir/src/hal/state.c.obj
[103/143] Building ASM object modules/xtensa/CMakeFiles/modules_xtensa_hal.dir/src/hal/syscache_asm.S.obj
[104/143] Building ASM object modules/xtensa/CMakeFiles/modules_xtensa_hal.dir/src/hal/windowspill_asm.S.obj
[105/143] Building C object modules/xtensa/CMakeFiles/modules_xtensa_hal.dir/src/hal/set_region_translate.c.obj
[106/143] Linking C static library modules/xtensa/libmodules_xtensa_hal.a
[107/143] Linking C executable zephyr/soc/xtensa/intel_adsp/common/bootloader/bootloader.elf
[108/143] cd /workdir/zephyr/twister-out/intel_adsp_cavs15/tests/subsys/cpp/libcxx/cpp.libcxx.exceptions/zephyr/soc/xtensa/intel_adsp/common && /opt/toolchains/zephyr-sdk-0.12.4/xtensa/intel_apl_adsp/xtensa-zephyr-elf/bin/xtensa-zephyr-elf-objcopy --dump-section .data=mod-boot.bin /workdir/zephyr/twister-out/intel_adsp_cavs15/tests/subsys/cpp/libcxx/cpp.libcxx.exceptions/zephyr/soc/xtensa/intel_adsp/common/bootloader/libboot_module.a && /opt/toolchains/zephyr-sdk-0.12.4/xtensa/intel_apl_adsp/xtensa-zephyr-elf/bin/xtensa-zephyr-elf-objcopy --add-section .module=mod-boot.bin --set-section-flags .module=load,readonly /workdir/zephyr/twister-out/intel_adsp_cavs15/tests/subsys/cpp/libcxx/cpp.libcxx.exceptions/zephyr/soc/xtensa/intel_adsp/common/bootloader/bootloader.elf /workdir/zephyr/twister-out/intel_adsp_cavs15/tests/subsys/cpp/libcxx/cpp.libcxx.exceptions/zephyr/bootloader.elf.mod
[109/143] Building C object zephyr/kernel/CMakeFiles/kernel.dir/banner.c.obj
[110/143] Building C object zephyr/kernel/CMakeFiles/kernel.dir/errno.c.obj
[111/143] Building C object zephyr/kernel/CMakeFiles/kernel.dir/device.c.obj
[112/143] Building C object zephyr/kernel/CMakeFiles/kernel.dir/fatal.c.obj
[113/143] Building C object zephyr/kernel/CMakeFiles/kernel.dir/kheap.c.obj
[114/143] Building C object zephyr/kernel/CMakeFiles/kernel.dir/init.c.obj
[115/143] Building C object zephyr/kernel/CMakeFiles/kernel.dir/version.c.obj
[116/143] Building C object zephyr/kernel/CMakeFiles/kernel.dir/mem_slab.c.obj
[117/143] Building C object zephyr/kernel/CMakeFiles/kernel.dir/idle.c.obj
[118/143] Building C object zephyr/kernel/CMakeFiles/kernel.dir/thread.c.obj
[119/143] Building C object zephyr/kernel/CMakeFiles/kernel.dir/mailbox.c.obj
[120/143] Building C object zephyr/kernel/CMakeFiles/kernel.dir/msg_q.c.obj
[121/143] Building C object zephyr/kernel/CMakeFiles/kernel.dir/mutex.c.obj
[122/143] Building C object zephyr/kernel/CMakeFiles/kernel.dir/pipes.c.obj
[123/143] Building C object zephyr/kernel/CMakeFiles/kernel.dir/queue.c.obj
[124/143] Building C object zephyr/kernel/CMakeFiles/kernel.dir/system_work_q.c.obj
[125/143] Building C object zephyr/kernel/CMakeFiles/kernel.dir/stack.c.obj
[126/143] Building C object zephyr/kernel/CMakeFiles/kernel.dir/sem.c.obj
[127/143] Building C object zephyr/kernel/CMakeFiles/kernel.dir/condvar.c.obj
[128/143] Building C object zephyr/kernel/CMakeFiles/kernel.dir/smp.c.obj
[129/143] Building C object zephyr/kernel/CMakeFiles/kernel.dir/work.c.obj
[130/143] Building C object zephyr/kernel/CMakeFiles/kernel.dir/timer.c.obj
[131/143] Building C object zephyr/kernel/CMakeFiles/kernel.dir/mempool.c.obj
[132/143] Building C object zephyr/kernel/CMakeFiles/kernel.dir/timeout.c.obj
[133/143] Building C object zephyr/kernel/CMakeFiles/kernel.dir/sched.c.obj
[134/143] Linking C static library zephyr/kernel/libkernel.a
[135/143] Linking CXX executable zephyr/zephyr_prebuilt.elf
FAILED: zephyr/zephyr_prebuilt.elf zephyr/zephyr_prebuilt.map
: && ccache /opt/toolchains/zephyr-sdk-0.12.4/xtensa/intel_apl_adsp/xtensa-zephyr-elf/bin/xtensa-zephyr-elf-g++   /opt/toolchains/zephyr-sdk-0.12.4/xtensa/intel_apl_adsp/xtensa-zephyr-elf/bin/../lib/gcc/xtensa-zephyr-elf/10.2.0/crtbegin.o zephyr/CMakeFiles/zephyr_prebuilt.dir/misc/empty_file.c.obj -o zephyr/zephyr_prebuilt.elf  -fuse-ld=bfd  -Wl,-T  zephyr/linker_zephyr_prebuilt.cmd  -Wl,-Map=/workdir/zephyr/twister-out/intel_adsp_cavs15/tests/subsys/cpp/libcxx/cpp.libcxx.exceptions/zephyr/zephyr_prebuilt.map  -Wl,--whole-archive  app/libapp.a  zephyr/libzephyr.a  zephyr/arch/common/libarch__common.a  zephyr/arch/arch/xtensa/core/libarch__xtensa__core.a  zephyr/arch/arch/xtensa/core/startup/libarch__xtensa__core__startup.a  zephyr/lib/libc/newlib/liblib__libc__newlib.a  zephyr/lib/posix/liblib__posix.a  zephyr/soc/xtensa/intel_adsp/common/libintel_adsp_common.a  zephyr/subsys/testsuite/ztest/libsubsys__testsuite__ztest.a  zephyr/drivers/ipm/libdrivers__ipm.a  modules/xtensa/libmodules_xtensa_hal.a  -Wl,--no-whole-archive  zephyr/kernel/libkernel.a  zephyr/CMakeFiles/offsets.dir/./arch/xtensa/core/offsets/offsets.c.obj  -L"/opt/toolchains/zephyr-sdk-0.12.4/xtensa/intel_apl_adsp/xtensa-zephyr-elf/bin/../lib/gcc/xtensa-zephyr-elf/10.2.0"  -L/workdir/zephyr/twister-out/intel_adsp_cavs15/tests/subsys/cpp/libcxx/cpp.libcxx.exceptions/zephyr  -lgcc  zephyr/arch/common/libisr_tables.a  zephyr/soc/xtensa/intel_adsp/common/libintel_adsp_common.a  -Wl,--gc-sections  -Wl,--build-id=none  -Wl,--sort-common=descending  -Wl,--sort-section=alignment  -Wl,-u,_OffsetAbsSyms  -Wl,-u,_ConfigAbsSyms  -nostdlib  -static  -no-pie  -Wl,-X  -Wl,-N  -Wl,--orphan-handling=warn  -lstdc++  -Wl,--fatal-warnings  -lm  -Wl,-lc  -L"/opt/toolchains/zephyr-sdk-0.12.4/xtensa/intel_apl_adsp/xtensa-zephyr-elf"/lib/.  -Wl,-lgcc  -lc /opt/toolchains/zephyr-sdk-0.12.4/xtensa/intel_apl_adsp/xtensa-zephyr-elf/bin/../lib/gcc/xtensa-zephyr-elf/10.2.0/crtend.o && cd /workdir/zephyr/twister-out/intel_adsp_cavs15/tests/subsys/cpp/libcxx/cpp.libcxx.exceptions/zephyr && /usr/local/bin/cmake -E echo
/opt/toolchains/zephyr-sdk-0.12.4/xtensa/intel_apl_adsp/xtensa-zephyr-elf/bin/../lib/gcc/xtensa-zephyr-elf/10.2.0/../../../../xtensa-zephyr-elf/bin/ld.bfd: warning: orphan section `.tm_clone_table' from `/opt/toolchains/zephyr-sdk-0.12.4/xtensa/intel_apl_adsp/xtensa-zephyr-elf/bin/../lib/gcc/xtensa-zephyr-elf/10.2.0/crtbegin.o' being placed in section `.tm_clone_table'
/opt/toolchains/zephyr-sdk-0.12.4/xtensa/intel_apl_adsp/xtensa-zephyr-elf/bin/../lib/gcc/xtensa-zephyr-elf/10.2.0/../../../../xtensa-zephyr-elf/bin/ld.bfd: warning: orphan section `.tm_clone_table' from `/opt/toolchains/zephyr-sdk-0.12.4/xtensa/intel_apl_adsp/xtensa-zephyr-elf/bin/../lib/gcc/xtensa-zephyr-elf/10.2.0/crtend.o' being placed in section `.tm_clone_table'
collect2: error: ld returned 1 exit status
ninja: build stopped: subcommand failed.

in Job #f2de618c-9e2e-4306-bb72-08c397c51130


[Failed] Zephyr / zephyr-daily #339 (main) #builds

Buildkite <notifications@...>
 

test Duration: 3 hours, 11 minutes, 54 seconds
Build #339 | main | a46a36a
Kumar Gala View Build →
ℹ︎

Read the JUnit test report

✖︎

1 failure:

tests/misc/test_build/buildsystem.debug.build in lpcxpresso55s69_ns:tests/misc/test_build/buildsystem.debug
Including boilerplate (Zephyr base): /workdir/zephyr/cmake/app/boilerplate.cmake
-- Application: /workdir/zephyr/tests/misc/test_build
-- Zephyr version: 2.6.0-rc1 (/workdir/zephyr), build: v2.6.0-rc1-292-ga46a36a4cfeb
-- Found Python3: /usr/bin/python3.8 (found suitable exact version "3.8.5") found components: Interpreter
-- Found west (found suitable version "0.11.0", minimum required is "0.7.1")
-- Board: lpcxpresso55s69_ns
-- Cache files will be written to: /root/.cache/zephyr
-- Using toolchain: zephyr 0.12.4 (/opt/toolchains/zephyr-sdk-0.12.4)
-- Found dtc: /opt/toolchains/zephyr-sdk-0.12.4/sysroots/x86_64-pokysdk-linux/usr/bin/dtc (found suitable version "1.5.0", minimum required is "1.4.6")
-- Found BOARD.dts: /workdir/zephyr/boards/arm/lpcxpresso55s69/lpcxpresso55s69_ns.dts
-- Generated zephyr.dts: /workdir/zephyr/twister-out/lpcxpresso55s69_ns/tests/misc/test_build/buildsystem.debug.build/zephyr/zephyr.dts
-- Generated devicetree_unfixed.h: /workdir/zephyr/twister-out/lpcxpresso55s69_ns/tests/misc/test_build/buildsystem.debug.build/zephyr/include/generated/devicetree_unfixed.h
-- Generated device_extern.h: /workdir/zephyr/twister-out/lpcxpresso55s69_ns/tests/misc/test_build/buildsystem.debug.build/zephyr/include/generated/device_extern.h
Parsing /workdir/zephyr/Kconfig
Loaded configuration '/workdir/zephyr/boards/arm/lpcxpresso55s69/lpcxpresso55s69_ns_defconfig'
Merged configuration 'debug.conf'
Configuration saved to '/workdir/zephyr/twister-out/lpcxpresso55s69_ns/tests/misc/test_build/buildsystem.debug.build/zephyr/.config'
Kconfig header saved to '/workdir/zephyr/twister-out/lpcxpresso55s69_ns/tests/misc/test_build/buildsystem.debug.build/zephyr/include/generated/autoconf.h'
-- The C compiler identification is GNU 10.2.0
-- The CXX compiler identification is GNU 10.2.0
-- The ASM compiler identification is GNU
-- Found assembler: /opt/toolchains/zephyr-sdk-0.12.4/arm-zephyr-eabi/bin/arm-zephyr-eabi-gcc
-- Configuring done
-- Generating done
-- Build files have been written to: /workdir/zephyr/twister-out/lpcxpresso55s69_ns/tests/misc/test_build/buildsystem.debug.build
[1/155] Preparing syscall dependency handling

[2/155] Generating misc/generated/syscalls_subdirs.trigger
[3/155] Generating misc/generated/syscalls.json, misc/generated/struct_tags.json
[4/155] Generating include/generated/syscall_dispatch.c, include/generated/syscall_list.h
[5/155] Generating include/generated/driver-validation.h
[6/155] Generating include/generated/kobj-types-enum.h, include/generated/otype-to-str.h, include/generated/otype-to-size.h
[7/155] cd /workdir/zephyr/twister-out/lpcxpresso55s69_ns/tests/misc/test_build/buildsystem.debug.build/tfm && /usr/local/bin/cmake -GNinja -DTFM_TOOLCHAIN_FILE=/workdir/modules/tee/tfm/trusted-firmware-m/toolchain_GNUARM.cmake -DTFM_PLATFORM=nxp/lpcxpresso55s69 -DCROSS_COMPILE=/opt/toolchains/zephyr-sdk-0.12.4/arm-zephyr-eabi/bin/arm-zephyr-eabi -DCMAKE_BUILD_TYPE=Debug -DBL2=TRUE -DTFM_PSA_API=ON ISOLATION_LEVEL 2 -DTFM_PROFILE=profile_medium -DMCUBOOT_IMAGE_NUMBER=2 -DTFM_TEST_REPO_PATH=/workdir/modules/tee/tfm/tf-m-tests -DMBEDCRYPTO_PATH=/workdir/modules/tee/tfm/../../crypto/mbedtls/mbedtls -DMCUBOOT_PATH=/workdir/modules/tee/tfm/../tfm-mcuboot -DPSA_ARCH_TESTS_PATH=/workdir/modules/tee/tfm/psa-arch-tests -DTFM_PARTITION_PROTECTED_STORAGE=ON -DTFM_PARTITION_INTERNAL_TRUSTED_STORAGE=ON -DTFM_PARTITION_CRYPTO=ON -DTFM_PARTITION_INITIAL_ATTESTATION=ON -DTFM_PARTITION_PLATFORM=ON -DTFM_PARTITION_AUDIT_LOG=OFF /workdir/modules/tee/tfm/trusted-firmware-m
FAILED: modules/trusted-firmware-m/CMakeFiles/tfm_cmake
cd /workdir/zephyr/twister-out/lpcxpresso55s69_ns/tests/misc/test_build/buildsystem.debug.build/tfm && /usr/local/bin/cmake -GNinja -DTFM_TOOLCHAIN_FILE=/workdir/modules/tee/tfm/trusted-firmware-m/toolchain_GNUARM.cmake -DTFM_PLATFORM=nxp/lpcxpresso55s69 -DCROSS_COMPILE=/opt/toolchains/zephyr-sdk-0.12.4/arm-zephyr-eabi/bin/arm-zephyr-eabi -DCMAKE_BUILD_TYPE=Debug -DBL2=TRUE -DTFM_PSA_API=ON ISOLATION_LEVEL 2 -DTFM_PROFILE=profile_medium -DMCUBOOT_IMAGE_NUMBER=2 -DTFM_TEST_REPO_PATH=/workdir/modules/tee/tfm/tf-m-tests -DMBEDCRYPTO_PATH=/workdir/modules/tee/tfm/../../crypto/mbedtls/mbedtls -DMCUBOOT_PATH=/workdir/modules/tee/tfm/../tfm-mcuboot -DPSA_ARCH_TESTS_PATH=/workdir/modules/tee/tfm/psa-arch-tests -DTFM_PARTITION_PROTECTED_STORAGE=ON -DTFM_PARTITION_INTERNAL_TRUSTED_STORAGE=ON -DTFM_PARTITION_CRYPTO=ON -DTFM_PARTITION_INITIAL_ATTESTATION=ON -DTFM_PARTITION_PLATFORM=ON -DTFM_PARTITION_AUDIT_LOG=OFF /workdir/modules/tee/tfm/trusted-firmware-m
-- The C compiler identification is GNU 10.2.0
-- The ASM compiler identification is GNU
-- Found assembler: /opt/toolchains/zephyr-sdk-0.12.4/arm-zephyr-eabi/bin/arm-zephyr-eabi-gcc
-- Found Python3: /usr/bin/python3.8 (found version "3.8.5") found components: Interpreter
Start to generate PSA manifests:
Generating /workdir/zephyr/twister-out/lpcxpresso55s69_ns/tests/misc/test_build/buildsystem.debug.build/tfm/generated/secure_fw/partitions/protected_storage/psa_manifest/tfm_protected_storage.h
Generating /workdir/zephyr/twister-out/lpcxpresso55s69_ns/tests/misc/test_build/buildsystem.debug.build/tfm/generated/secure_fw/partitions/protected_storage/auto_generated/intermedia_tfm_protected_storage.c
Generating /workdir/zephyr/twister-out/lpcxpresso55s69_ns/tests/misc/test_build/buildsystem.debug.build/tfm/generated/secure_fw/partitions/internal_trusted_storage/psa_manifest/tfm_internal_trusted_storage.h
Generating /workdir/zephyr/twister-out/lpcxpresso55s69_ns/tests/misc/test_build/buildsystem.debug.build/tfm/generated/secure_fw/partitions/internal_trusted_storage/auto_generated/intermedia_tfm_internal_trusted_storage.c
Generating /workdir/zephyr/twister-out/lpcxpresso55s69_ns/tests/misc/test_build/buildsystem.debug.build/tfm/generated/secure_fw/partitions/audit_logging/psa_manifest/tfm_audit_logging.h
Generating /workdir/zephyr/twister-out/lpcxpresso55s69_ns/tests/misc/test_build/buildsystem.debug.build/tfm/generated/secure_fw/partitions/audit_logging/auto_generated/intermedia_tfm_audit_logging.c
Generating /workdir/zephyr/twister-out/lpcxpresso55s69_ns/tests/misc/test_build/buildsystem.debug.build/tfm/generated/secure_fw/partitions/crypto/psa_manifest/tfm_crypto.h
Generating /workdir/zephyr/twister-out/lpcxpresso55s69_ns/tests/misc/test_build/buildsystem.debug.build/tfm/generated/secure_fw/partitions/crypto/auto_generated/intermedia_tfm_crypto.c
Generating /workdir/zephyr/twister-out/lpcxpresso55s69_ns/tests/misc/test_build/buildsystem.debug.build/tfm/generated/secure_fw/partitions/platform/psa_manifest/tfm_platform.h
Generating /workdir/zephyr/twister-out/lpcxpresso55s69_ns/tests/misc/test_build/buildsystem.debug.build/tfm/generated/secure_fw/partitions/platform/auto_generated/intermedia_tfm_platform.c
Generating /workdir/zephyr/twister-out/lpcxpresso55s69_ns/tests/misc/test_build/buildsystem.debug.build/tfm/generated/secure_fw/partitions/initial_attestation/psa_manifest/tfm_initial_attestation.h
Generating /workdir/zephyr/twister-out/lpcxpresso55s69_ns/tests/misc/test_build/buildsystem.debug.build/tfm/generated/secure_fw/partitions/initial_attestation/auto_generated/intermedia_tfm_initial_attestation.c
Generating /workdir/zephyr/twister-out/lpcxpresso55s69_ns/tests/misc/test_build/buildsystem.debug.build/tfm/generated/test_services/tfm_core_test/psa_manifest/tfm_ss_core_test.h
Generating /workdir/zephyr/twister-out/lpcxpresso55s69_ns/tests/misc/test_build/buildsystem.debug.build/tfm/generated/test_services/tfm_core_test/auto_generated/intermedia_tfm_ss_core_test.c
Generating /workdir/zephyr/twister-out/lpcxpresso55s69_ns/tests/misc/test_build/buildsystem.debug.build/tfm/generated/test_services/tfm_core_test_2/psa_manifest/tfm_ss_core_test_2.h
Generating /workdir/zephyr/twister-out/lpcxpresso55s69_ns/tests/misc/test_build/buildsystem.debug.build/tfm/generated/test_services/tfm_core_test_2/auto_generated/intermedia_tfm_ss_core_test_2.c
Generating /workdir/zephyr/twister-out/lpcxpresso55s69_ns/tests/misc/test_build/buildsystem.debug.build/tfm/generated/test_services/tfm_secure_client_service/psa_manifest/tfm_secure_client_service.h
Generating /workdir/zephyr/twister-out/lpcxpresso55s69_ns/tests/misc/test_build/buildsystem.debug.build/tfm/generated/test_services/tfm_secure_client_service/auto_generated/intermedia_tfm_secure_client_service.c
Generating /workdir/zephyr/twister-out/lpcxpresso55s69_ns/tests/misc/test_build/buildsystem.debug.build/tfm/generated/test_services/tfm_ipc_service/psa_manifest/tfm_ipc_service_test.h
Generating /workdir/zephyr/twister-out/lpcxpresso55s69_ns/tests/misc/test_build/buildsystem.debug.build/tfm/generated/test_services/tfm_ipc_service/auto_generated/intermedia_tfm_ipc_service_test.c
Generating /workdir/zephyr/twister-out/lpcxpresso55s69_ns/tests/misc/test_build/buildsystem.debug.build/tfm/generated/test_services/tfm_ipc_client/psa_manifest/tfm_ipc_client_test.h
Generating /workdir/zephyr/twister-out/lpcxpresso55s69_ns/tests/misc/test_build/buildsystem.debug.build/tfm/generated/test_services/tfm_ipc_client/auto_generated/intermedia_tfm_ipc_client_test.c
Generating /workdir/zephyr/twister-out/lpcxpresso55s69_ns/tests/misc/test_build/buildsystem.debug.build/tfm/generated/test_services/tfm_irq_test_service_1/psa_manifest/tfm_irq_test_service_1.h
Generating /workdir/zephyr/twister-out/lpcxpresso55s69_ns/tests/misc/test_build/buildsystem.debug.build/tfm/generated/test_services/tfm_irq_test_service_1/auto_generated/intermedia_tfm_irq_test_service_1.c
Generating /workdir/zephyr/twister-out/lpcxpresso55s69_ns/tests/misc/test_build/buildsystem.debug.build/tfm/generated/test_services/tfm_ps_test_service/psa_manifest/tfm_ps_test_service.h
Generating /workdir/zephyr/twister-out/lpcxpresso55s69_ns/tests/misc/test_build/buildsystem.debug.build/tfm/generated/test_services/tfm_ps_test_service/auto_generated/intermedia_tfm_ps_test_service.c
Generating /workdir/zephyr/twister-out/lpcxpresso55s69_ns/tests/misc/test_build/buildsystem.debug.build/tfm/generated/test_services/tfm_secure_client_2/psa_manifest/tfm_secure_client_2.h
Generating /workdir/zephyr/twister-out/lpcxpresso55s69_ns/tests/misc/test_build/buildsystem.debug.build/tfm/generated/test_services/tfm_secure_client_2/auto_generated/intermedia_tfm_secure_client_2.c
Generating /workdir/zephyr/twister-out/lpcxpresso55s69_ns/tests/misc/test_build/buildsystem.debug.build/tfm/generated/secure_fw/partitions/psa_proxy/psa_manifest/tfm_psa_proxy.h
Generating /workdir/zephyr/twister-out/lpcxpresso55s69_ns/tests/misc/test_build/buildsystem.debug.build/tfm/generated/secure_fw/partitions/psa_proxy/auto_generated/intermedia_tfm_psa_proxy.c
Generating /workdir/zephyr/twister-out/lpcxpresso55s69_ns/tests/misc/test_build/buildsystem.debug.build/tfm/generated/secure_fw/partitions/firmware_update/psa_manifest/tfm_firmware_update.h
Generating /workdir/zephyr/twister-out/lpcxpresso55s69_ns/tests/misc/test_build/buildsystem.debug.build/tfm/generated/secure_fw/partitions/firmware_update/auto_generated/intermedia_tfm_firmware_update.c
Generating /workdir/zephyr/twister-out/lpcxpresso55s69_ns/tests/misc/test_build/buildsystem.debug.build/tfm/generated/secure_fw/partitions/tfm_ffm11_partition/psa_manifest/tfm_ffm11_partition.h
Generating /workdir/zephyr/twister-out/lpcxpresso55s69_ns/tests/misc/test_build/buildsystem.debug.build/tfm/generated/secure_fw/partitions/tfm_ffm11_partition/auto_generated/intermedia_tfm_ffm11_partition.c
Start to generate file from the generated list:
Generating /workdir/zephyr/twister-out/lpcxpresso55s69_ns/tests/misc/test_build/buildsystem.debug.build/tfm/generated/secure_fw/spm/cmsis_func/tfm_spm_db_func.inc
Generating /workdir/zephyr/twister-out/lpcxpresso55s69_ns/tests/misc/test_build/buildsystem.debug.build/tfm/generated/secure_fw/spm/cmsis_psa/tfm_spm_db_ipc.inc
Generating /workdir/zephyr/twister-out/lpcxpresso55s69_ns/tests/misc/test_build/buildsystem.debug.build/tfm/generated/secure_fw/partitions/tfm_service_list.inc
Generating /workdir/zephyr/twister-out/lpcxpresso55s69_ns/tests/misc/test_build/buildsystem.debug.build/tfm/generated/secure_fw/spm/cmsis_func/tfm_veneers.c
Generating /workdir/zephyr/twister-out/lpcxpresso55s69_ns/tests/misc/test_build/buildsystem.debug.build/tfm/generated/interface/include/tfm_veneers.h
Generating /workdir/zephyr/twister-out/lpcxpresso55s69_ns/tests/misc/test_build/buildsystem.debug.build/tfm/generated/secure_fw/spm/cmsis_func/tfm_secure_irq_handlers.inc
Generating /workdir/zephyr/twister-out/lpcxpresso55s69_ns/tests/misc/test_build/buildsystem.debug.build/tfm/generated/secure_fw/spm/cmsis_psa/tfm_secure_irq_handlers_ipc.inc
Generating /workdir/zephyr/twister-out/lpcxpresso55s69_ns/tests/misc/test_build/buildsystem.debug.build/tfm/generated/interface/include/psa_manifest/sid.h
Generating /workdir/zephyr/twister-out/lpcxpresso55s69_ns/tests/misc/test_build/buildsystem.debug.build/tfm/generated/interface/include/psa_manifest/pid.h
Generation of files done
-- Found PythonInterp: /usr/bin/python3 (found suitable version "3.8.5", minimum required is "3")
-- Found Sphinx: /usr/local/bin/sphinx-build (found version "3.5.4")
CMake Warning (dev) at /usr/local/share/cmake-3.18/Modules/FindPackageHandleStandardArgs.cmake:273 (message):
  The package name passed to `find_package_handle_standard_args` (PY_M2R)
  does not match the name of the calling package (PythonModules).  This can
  lead to problems in calling code that expects `find_package` result
  variables (e.g., `_FOUND`) to follow a certain pattern.
Call Stack (most recent call first):
  cmake/FindPythonModules.cmake:60 (find_package_handle_standard_args)
  docs/CMakeLists.txt:14 (find_package)
This warning is for project developers.  Use -Wno-dev to suppress it.

-- Can not find Python module m2r (missing: PY_M2R)
CMake Warning (dev) at /usr/local/share/cmake-3.18/Modules/FindPackageHandleStandardArgs.cmake:273 (message):
  The package name passed to `find_package_handle_standard_args`
  (PY_SPHINX-RTD-THEME) does not match the name of the calling package
  (PythonModules).  This can lead to problems in calling code that expects
  `find_package` result variables (e.g., `_FOUND`) to follow a certain
  pattern.
Call Stack (most recent call first):
  cmake/FindPythonModules.cmake:60 (find_package_handle_standard_args)
  docs/CMakeLists.txt:14 (find_package)
This warning is for project developers.  Use -Wno-dev to suppress it.

-- Found PY_SPHINX-RTD-THEME: /usr/local/lib/python3.8/dist-packages/sphinx_rtd_theme/__init__.py
CMake Warning (dev) at /usr/local/share/cmake-3.18/Modules/FindPackageHandleStandardArgs.cmake:273 (message):
  The package name passed to `find_package_handle_standard_args`
  (PY_SPHINXCONTRIB.PLANTUML) does not match the name of the calling package
  (PythonModules).  This can lead to problems in calling code that expects
  `find_package` result variables (e.g., `_FOUND`) to follow a certain
  pattern.
Call Stack (most recent call first):
  cmake/FindPythonModules.cmake:60 (find_package_handle_standard_args)
  docs/CMakeLists.txt:14 (find_package)
This warning is for project developers.  Use -Wno-dev to suppress it.

-- Can not find Python module sphinxcontrib.plantuml (missing: PY_SPHINXCONTRIB.PLANTUML)
-- Could NOT find Java (missing: Java_JAVA_EXECUTABLE Runtime) (Required is at least version "1.8")
CMake Warning (dev) at /usr/local/share/cmake-3.18/Modules/FindPackageHandleStandardArgs.cmake:273 (message):
  The package name passed to `find_package_handle_standard_args` (Plantuml)
  does not match the name of the calling package (PlantUML).  This can lead
  to problems in calling code that expects `find_package` result variables
  (e.g., `_FOUND`) to follow a certain pattern.
Call Stack (most recent call first):
  cmake/FindPlantUML.cmake:63 (find_package_handle_standard_args)
  docs/CMakeLists.txt:15 (find_package)
This warning is for project developers.  Use -Wno-dev to suppress it.

-- Could NOT find Plantuml (missing: PLANTUML_JAR_PATH PLANTUML_VERSION)
-- Could NOT find Doxygen (missing: DOXYGEN_EXECUTABLE) (Required is at least version "1.8.0")
-- Could NOT find LATEX (missing: LATEX_COMPILER PDFLATEX)
-- ---------- Display crypto configuration - start --------------
-- CRYPTO_KEY_MODULE_DISABLED is set to FALSE
-- CRYPTO_AEAD_MODULE_DISABLED is set to FALSE
-- CRYPTO_MAC_MODULE_DISABLED is set to FALSE
-- CRYPTO_CIPHER_MODULE_DISABLED is set to FALSE
-- CRYPTO_HASH_MODULE_DISABLED is set to FALSE
-- CRYPTO_GENERATOR_MODULE_DISABLED is set to FALSE
-- CRYPTO_ASYMMETRIC_MODULE_DISABLED is set to FALSE
-- CRYPTO_ENGINE_BUF_SIZE is set to 0x2080
-- CRYPTO_CONC_OPER_NUM is set to 8
-- CRYPTO_IOVEC_BUFFER_SIZE is set to 5120
-- ---------- Display crypto configuration - stop ---------------
-- Performing Test C_COMPILER_SUPPORTS_WFORMAT_SIGNEDNESS
-- Performing Test C_COMPILER_SUPPORTS_WFORMAT_SIGNEDNESS - Failed
-- ----------- Display storage configuration - start ------------
-- PS_CREATE_FLASH_LAYOUT is set to ON
-- PS_ENCRYPTION is set to ON
-- PS_RAM_FS is set to OFF
-- PS_ROLLBACK_PROTECTION is set to ON
-- PS_VALIDATE_METADATA_FROM_FLASH is set to ON
-- PS_MAX_ASSET_SIZE is set to 2048
-- PS_NUM_ASSETS is set to 5
-- PS_CRYPTO_AEAD_ALG is set to PSA_ALG_CCM
-- ITS_CREATE_FLASH_LAYOUT is set to ON
-- ITS_RAM_FS is set to OFF
-- ITS_VALIDATE_METADATA_FROM_FLASH is set to ON
-- ITS_MAX_ASSET_SIZE is set to 512
-- ITS_NUM_ASSETS is set to 10
-- ITS_BUF_SIZE is set to 32
-- ----------- Display storage configuration - stop -------------
CMake Error at platform/ext/target/nxp/lpcxpresso55s69/CMakeLists.txt:14 (Message):
  If BL2 is enabled, "Debug" build type cannot be selected as it is currently
  not supported on nxp/lpcxpresso55s69.  For more information please refer to
  the platform's README file.


-- Configuring incomplete, errors occurred!
See also "/workdir/zephyr/twister-out/lpcxpresso55s69_ns/tests/misc/test_build/buildsystem.debug.build/tfm/CMakeFiles/CMakeOutput.log".
See also "/workdir/zephyr/twister-out/lpcxpresso55s69_ns/tests/misc/test_build/buildsystem.debug.build/tfm/CMakeFiles/CMakeError.log".
ninja: build stopped: subcommand failed.

in Job #244c6b57-6c60-4035-ad6e-cead7f4a1fcc


[Still Failing] Zephyr / zephyr-daily #323 (master) #builds

Buildkite <notifications@...>
 

Scheduled build Duration: 3 hours, 4 minutes, 17 seconds
Build #323 | master | 88f3a98
View Build →
ℹ︎

Read the JUnit test report


[Still Failing] Zephyr / zephyr-daily #322 (master) #builds

Buildkite <notifications@...>
 

Scheduled build Duration: 3 hours, 2 minutes, 10 seconds
Build #322 | master | 2de6bf9
View Build →
ℹ︎

Read the JUnit test report


[Still Failing] Zephyr / zephyr-daily #321 (master) #builds

Buildkite <notifications@...>
 

Scheduled build Duration: 2 hours, 58 minutes, 15 seconds
Build #321 | master | af10c06
View Build →
ℹ︎

Read the JUnit test report


[Failed] Zephyr / zephyr-daily #320 (master) #builds

Buildkite <notifications@...>
 

Scheduled build Duration: 3 hours, 7 minutes, 12 seconds
Build #320 | master | ebfe9be
View Build →
ℹ︎

Read the JUnit test report


[Canceled] Zephyr / zephyr-daily #319 (master) #builds

Buildkite <notifications@...>
 

Scheduled build Duration: 6 hours, 10 minutes, 55 seconds
Build #319 | master | 37de0c4
View Build →


[Still Failing] Zephyr / zephyr-daily #318 (master) #builds

Buildkite <notifications@...>
 

Scheduled build Duration: 6 hours, 14 seconds
Build #318 | master | b61c239
View Build →
ℹ︎

Read the JUnit test report


[Still Failing] Zephyr / zephyr-daily #317 (master) #builds

Buildkite <notifications@...>
 

Scheduled build Duration: 5 hours, 42 minutes, 37 seconds
Build #317 | master | b61c239
View Build →
ℹ︎

Read the JUnit test report

101 - 120 of 2917