Date   

[Still Failing] Zephyr / zephyr-daily #18 (master) #builds

Buildkite <notifications@...>
 

Scheduled build Duration: 2 hours, 50 minutes, 13 seconds
Build #18 | master | 2eb633d
View Build →


[Still Failing] Zephyr / zephyr-daily #17 (master) #builds

Buildkite <notifications@...>
 

Scheduled build Duration: 2 hours, 51 minutes, 44 seconds
Build #17 | master | 897b5bf
View Build →


[Still Failing] Zephyr / zephyr-daily #16 (master) #builds

Buildkite <notifications@...>
 

Scheduled build Duration: 2 hours, 35 minutes, 14 seconds
Build #16 | master | c001baa
View Build →


[Still Failing] Zephyr / zephyr-daily #15 (master) #builds

Buildkite <notifications@...>
 

Scheduled build Duration: 2 hours, 35 minutes, 38 seconds
Build #15 | master | c7ab1a1
View Build →


[Still Failing] Zephyr / zephyr-daily #14 (master) #builds

Buildkite <notifications@...>
 

Scheduled build Duration: 2 hours, 35 minutes, 19 seconds
Build #14 | master | 95717db
View Build →


[Still Failing] Zephyr / zephyr-daily #13 (master) #builds

Buildkite <notifications@...>
 

Scheduled build Duration: 2 hours, 59 minutes, 24 seconds
Build #13 | master | ab3e778
View Build →
✖︎

1 failure:

samples/drivers/flash_shell/sample.drivers.flash.shell in intel_s1000_crb:samples/drivers/flash_shell/sample.drivers
Including boilerplate (Zephyr base): /workdir/zephyr/cmake/app/boilerplate.cmake
-- Application: /workdir/zephyr/samples/drivers/flash_shell
-- Zephyr version: 2.3.99 (/workdir/zephyr)
-- Found Python3: /usr/bin/python3.6 (found suitable exact version "3.6.9") found components:  Interpreter
-- Board: intel_s1000_crb
-- Found toolchain: zephyr (/opt/sdk/zephyr-sdk-0.11.3)
-- Found west: /usr/local/bin/west (found suitable version "0.7.2", minimum required is "0.7.1")
-- Found dtc: /opt/sdk/zephyr-sdk-0.11.3/sysroots/x86_64-pokysdk-linux/usr/bin/dtc (found suitable version "1.5.0", minimum required is "1.4.6")
-- Found BOARD.dts: /workdir/zephyr/boards/xtensa/intel_s1000_crb/intel_s1000_crb.dts
-- Generated zephyr.dts: /workdir/zephyr/sanity-out/intel_s1000_crb/samples/drivers/flash_shell/sample.drivers.flash.shell/zephyr/zephyr.dts
-- Generated devicetree_unfixed.h: /workdir/zephyr/sanity-out/intel_s1000_crb/samples/drivers/flash_shell/sample.drivers.flash.shell/zephyr/include/generated/devicetree_unfixed.h
Parsing /workdir/zephyr/samples/drivers/flash_shell/Kconfig
Loaded configuration '/workdir/zephyr/boards/xtensa/intel_s1000_crb/intel_s1000_crb_defconfig'
Merged configuration '/workdir/zephyr/samples/drivers/flash_shell/prj.conf'
Configuration saved to '/workdir/zephyr/sanity-out/intel_s1000_crb/samples/drivers/flash_shell/sample.drivers.flash.shell/zephyr/.config'
Kconfig header saved to '/workdir/zephyr/sanity-out/intel_s1000_crb/samples/drivers/flash_shell/sample.drivers.flash.shell/zephyr/include/generated/autoconf.h'
-- The C compiler identification is GNU 9.2.0
-- The CXX compiler identification is GNU 9.2.0
-- The ASM compiler identification is GNU
-- Found assembler: /opt/sdk/zephyr-sdk-0.11.3/xtensa/intel_s1000/xtensa-zephyr-elf/bin/xtensa-zephyr-elf-gcc
-- Cache files will be written to: /root/.cache/zephyr
-- Configuring done
-- Generating done
-- Build files have been written to: /workdir/zephyr/sanity-out/intel_s1000_crb/samples/drivers/flash_shell/sample.drivers.flash.shell
[1/158] Preparing syscall dependency handling

[2/158] Generating misc/generated/syscalls_subdirs.trigger
[3/158] Generating misc/generated/syscalls.json, misc/generated/struct_tags.json
[4/158] Generating include/generated/syscall_dispatch.c, include/generated/syscall_list.h
[5/158] Generating include/generated/driver-validation.h
[6/158] Generating include/generated/kobj-types-enum.h, include/generated/otype-to-str.h
[7/158] Building C object zephyr/CMakeFiles/offsets.dir/arch/xtensa/core/offsets/offsets.c.obj
[8/158] Generating include/generated/offsets.h
[9/158] Generating linker.cmd
[10/158] Building C object zephyr/CMakeFiles/zephyr.dir/lib/os/crc32_sw.c.obj
[11/158] Building C object zephyr/CMakeFiles/zephyr.dir/lib/os/crc16_sw.c.obj
[12/158] Building C object zephyr/CMakeFiles/zephyr.dir/lib/os/crc8_sw.c.obj
[13/158] Building C object zephyr/CMakeFiles/zephyr.dir/lib/os/crc7_sw.c.obj
[14/158] Building C object zephyr/CMakeFiles/zephyr.dir/lib/fnmatch/fnmatch.c.obj
[15/158] Building C object zephyr/CMakeFiles/zephyr.dir/lib/os/dec.c.obj
[16/158] Building C object zephyr/CMakeFiles/zephyr.dir/lib/os/hex.c.obj
[17/158] Building C object zephyr/CMakeFiles/zephyr.dir/lib/os/fdtable.c.obj
[18/158] Building C object CMakeFiles/app.dir/src/main.c.obj
[19/158] Linking C static library app/libapp.a
[20/158] Building C object zephyr/CMakeFiles/zephyr.dir/lib/os/notify.c.obj
[21/158] Building C object zephyr/CMakeFiles/zephyr.dir/lib/os/mempool.c.obj
[22/158] Building C object zephyr/CMakeFiles/zephyr.dir/lib/os/printk.c.obj
[23/158] Building C object zephyr/CMakeFiles/zephyr.dir/lib/os/rb.c.obj
[24/158] Building C object zephyr/CMakeFiles/zephyr.dir/lib/os/onoff.c.obj
[25/158] Building C object zephyr/CMakeFiles/zephyr.dir/lib/os/timeutil.c.obj
[26/158] Building C object zephyr/CMakeFiles/zephyr.dir/lib/os/sem.c.obj
[27/158] Building C object zephyr/CMakeFiles/zephyr.dir/lib/os/thread_entry.c.obj
[28/158] Building C object zephyr/CMakeFiles/zephyr.dir/lib/os/work_q.c.obj
[29/158] Building C object zephyr/CMakeFiles/zephyr.dir/lib/os/heap.c.obj
[30/158] Building C object zephyr/CMakeFiles/zephyr.dir/lib/os/heap-validate.c.obj
[31/158] Building C object zephyr/CMakeFiles/zephyr.dir/lib/os/ring_buffer.c.obj
[32/158] Building C object zephyr/CMakeFiles/zephyr.dir/misc/generated/configs.c.obj
[33/158] Building C object zephyr/CMakeFiles/zephyr.dir/subsys/logging/log_list.c.obj
[34/158] Building C object zephyr/CMakeFiles/zephyr.dir/subsys/logging/log_msg.c.obj
[35/158] Building C object zephyr/CMakeFiles/zephyr.dir/subsys/logging/log_output.c.obj
[36/158] Building C object zephyr/CMakeFiles/zephyr.dir/subsys/logging/log_core.c.obj
[37/158] Building C object zephyr/CMakeFiles/zephyr.dir/subsys/logging/log_cmds.c.obj
[38/158] Building C object zephyr/CMakeFiles/zephyr.dir/subsys/shell/modules/kernel_service.c.obj
[39/158] Building C object zephyr/CMakeFiles/zephyr.dir/subsys/shell/modules/device_service.c.obj
[40/158] Building C object zephyr/CMakeFiles/zephyr.dir/subsys/shell/shell_fprintf.c.obj
[41/158] Building C object zephyr/CMakeFiles/zephyr.dir/subsys/shell/shell_utils.c.obj
[42/158] Building C object zephyr/CMakeFiles/zephyr.dir/subsys/shell/shell_ops.c.obj
[43/158] Building C object zephyr/CMakeFiles/zephyr.dir/subsys/shell/shell.c.obj
[44/158] Building C object zephyr/CMakeFiles/zephyr.dir/subsys/shell/shell_uart.c.obj
[45/158] Building C object zephyr/CMakeFiles/zephyr.dir/subsys/shell/shell_help.c.obj
[46/158] Building C object zephyr/CMakeFiles/zephyr.dir/subsys/shell/shell_cmds.c.obj
[47/158] Building C object zephyr/CMakeFiles/zephyr.dir/subsys/shell/shell_history.c.obj
[48/158] Building C object zephyr/CMakeFiles/zephyr.dir/subsys/shell/shell_log_backend.c.obj
[49/158] Building C object zephyr/CMakeFiles/zephyr.dir/drivers/console/uart_console.c.obj
[50/158] Building C object zephyr/CMakeFiles/zephyr.dir/subsys/shell/shell_wildcard.c.obj
[51/158] Building C object zephyr/CMakeFiles/zephyr.dir/drivers/interrupt_controller/intc_cavs.c.obj
[52/158] Building C object zephyr/CMakeFiles/zephyr.dir/drivers/pinmux/pinmux_intel_s1000.c.obj
[53/158] Building C object zephyr/CMakeFiles/zephyr.dir/drivers/interrupt_controller/intc_dw.c.obj
[54/158] Building C object zephyr/CMakeFiles/zephyr_prebuilt.dir/misc/empty_file.c.obj
[55/158] Building C object zephyr/CMakeFiles/zephyr.dir/drivers/timer/sys_clock_init.c.obj
[56/158] Building C object zephyr/CMakeFiles/zephyr.dir/drivers/timer/xtensa_sys_timer.c.obj
[57/158] Linking C static library zephyr/libzephyr.a
[58/158] Building C object zephyr/arch/common/CMakeFiles/arch__common.dir/sw_isr_common.c.obj
[59/158] Building C object zephyr/arch/common/CMakeFiles/arch__common.dir/isr_tables.c.obj
[60/158] Linking C static library zephyr/arch/common/libarch__common.a
[61/158] Building ASM object zephyr/arch/arch/xtensa/core/CMakeFiles/arch__xtensa__core.dir/window_vectors.S.obj
[62/158] Building C object zephyr/arch/arch/xtensa/core/CMakeFiles/arch__xtensa__core.dir/cpu_idle.c.obj
[63/158] Building ASM object zephyr/arch/arch/xtensa/core/CMakeFiles/arch__xtensa__core.dir/xtensa-asm2-util.S.obj
[64/158] Building C object zephyr/arch/arch/xtensa/core/CMakeFiles/arch__xtensa__core.dir/fatal.c.obj
[65/158] Building ASM object zephyr/arch/arch/xtensa/core/CMakeFiles/arch__xtensa__core.dir/atomic.S.obj
[66/158] Building C object zephyr/arch/arch/xtensa/core/CMakeFiles/arch__xtensa__core.dir/irq_manage.c.obj
[67/158] Building ASM object zephyr/arch/arch/xtensa/core/CMakeFiles/arch__xtensa__core.dir/crt1.S.obj
[68/158] Building ASM object zephyr/arch/arch/xtensa/core/startup/CMakeFiles/arch__xtensa__core__startup.dir/reset-vector.S.obj
[69/158] Building ASM object zephyr/arch/arch/xtensa/core/startup/CMakeFiles/arch__xtensa__core__startup.dir/memerror-vector.S.obj
[70/158] Building ASM object zephyr/arch/arch/xtensa/core/startup/CMakeFiles/arch__xtensa__core__startup.dir/memctl_default.S.obj
[71/158] Linking ASM static library zephyr/arch/arch/xtensa/core/startup/libarch__xtensa__core__startup.a
[72/158] Building C object zephyr/lib/libc/minimal/CMakeFiles/lib__libc__minimal.dir/source/stdlib/atoi.c.obj
[73/158] Building C object zephyr/lib/libc/minimal/CMakeFiles/lib__libc__minimal.dir/source/stdlib/strtol.c.obj
[74/158] Building C object zephyr/lib/libc/minimal/CMakeFiles/lib__libc__minimal.dir/source/stdlib/strtoul.c.obj
[75/158] Building C object zephyr/lib/libc/minimal/CMakeFiles/lib__libc__minimal.dir/source/stdlib/bsearch.c.obj
[76/158] Building C object zephyr/lib/libc/minimal/CMakeFiles/lib__libc__minimal.dir/source/stdlib/malloc.c.obj
[77/158] Building C object zephyr/lib/libc/minimal/CMakeFiles/lib__libc__minimal.dir/source/string/strncasecmp.c.obj
[78/158] Building C object zephyr/lib/libc/minimal/CMakeFiles/lib__libc__minimal.dir/source/stdlib/exit.c.obj
[79/158] Building C object zephyr/lib/libc/minimal/CMakeFiles/lib__libc__minimal.dir/source/string/strstr.c.obj
[80/158] Building C object zephyr/arch/arch/xtensa/core/CMakeFiles/arch__xtensa__core.dir/xtensa-asm2.c.obj
[81/158] Linking C static library zephyr/arch/arch/xtensa/core/libarch__xtensa__core.a
[82/158] Building C object zephyr/lib/libc/minimal/CMakeFiles/lib__libc__minimal.dir/source/string/strspn.c.obj
[83/158] Building C object zephyr/lib/libc/minimal/CMakeFiles/lib__libc__minimal.dir/source/string/string.c.obj
[84/158] Building C object zephyr/lib/libc/minimal/CMakeFiles/lib__libc__minimal.dir/source/stdout/stdout_console.c.obj
[85/158] Building C object zephyr/lib/libc/minimal/CMakeFiles/lib__libc__minimal.dir/source/stdout/sprintf.c.obj
[86/158] Building C object zephyr/lib/libc/minimal/CMakeFiles/lib__libc__minimal.dir/source/stdout/fprintf.c.obj
[87/158] Building C object zephyr/lib/libc/minimal/CMakeFiles/lib__libc__minimal.dir/source/time/gmtime.c.obj
[88/158] Building C object zephyr/lib/posix/CMakeFiles/lib__posix.dir/pthread_common.c.obj
[89/158] Building C object zephyr/lib/posix/CMakeFiles/lib__posix.dir/nanosleep.c.obj
[90/158] Linking C static library zephyr/lib/posix/liblib__posix.a
[91/158] Building C object zephyr/lib/libc/minimal/CMakeFiles/lib__libc__minimal.dir/source/stdout/prf.c.obj
[92/158] Building C object zephyr/boards/xtensa/intel_s1000_crb/CMakeFiles/boards__xtensa__intel_s1000_crb.dir/pinmux.c.obj
[93/158] Linking C static library zephyr/lib/libc/minimal/liblib__libc__minimal.a
[94/158] Linking C static library zephyr/boards/xtensa/intel_s1000_crb/libboards__xtensa__intel_s1000_crb.a
[95/158] Building C object zephyr/soc/xtensa/intel_s1000/CMakeFiles/soc__xtensa__intel_s1000.dir/soc.c.obj
[96/158] Linking C static library zephyr/soc/xtensa/intel_s1000/libsoc__xtensa__intel_s1000.a
[97/158] Building C object zephyr/kernel/CMakeFiles/kernel.dir/queue.c.obj
[98/158] Building C object zephyr/drivers/flash/CMakeFiles/drivers__flash.dir/spi_nor.c.obj
[99/158] Building C object zephyr/drivers/flash/CMakeFiles/drivers__flash.dir/flash_page_layout.c.obj
[100/158] Building C object zephyr/drivers/flash/CMakeFiles/drivers__flash.dir/flash_shell.c.obj
FAILED: zephyr/drivers/flash/CMakeFiles/drivers__flash.dir/flash_shell.c.obj
ccache /opt/sdk/zephyr-sdk-0.11.3/xtensa/intel_s1000/xtensa-zephyr-elf/bin/xtensa-zephyr-elf-gcc -DBUILD_VERSION=zephyr-v2.3.0-720-gab3e778f47d8 -DKERNEL -D_FORTIFY_SOURCE=2 -D__ZEPHYR_SUPERVISOR__ -D__ZEPHYR__=1 -I../../../../../../include -Izephyr/include/generated -I../../../../../../soc/xtensa/intel_s1000 -I../../../../../../soc/xtensa/intel_s1000/include -I../../../../../../lib/fnmatch/. -I/var/lib/buildkite-agent/zephyr-module-cache/modules/hal/xtensa/include -I/var/lib/buildkite-agent/zephyr-module-cache/modules/hal/xtensa/zephyr/soc/intel_s1000 -isystem ../../../../../../lib/libc/minimal/include -isystem /opt/sdk/zephyr-sdk-0.11.3/xtensa/intel_s1000/xtensa-zephyr-elf/bin/../lib/gcc/xtensa-zephyr-elf/9.2.0/include -isystem /opt/sdk/zephyr-sdk-0.11.3/xtensa/intel_s1000/xtensa-zephyr-elf/bin/../lib/gcc/xtensa-zephyr-elf/9.2.0/include-fixed -Os -imacros/workdir/zephyr/sanity-out/intel_s1000_crb/samples/drivers/flash_shell/sample.drivers.flash.shell/zephyr/include/generated/autoconf.h -ffreestanding -fno-common -g -imacros/workdir/zephyr/include/toolchain/zephyr_stdint.h -Wall -Wformat -Wformat-security -Wno-format-zero-length -Wno-main -Wno-address-of-packed-member -Wno-pointer-sign -Wpointer-arith -Wno-unused-but-set-variable -Werror=implicit-int -Werror -fno-asynchronous-unwind-tables -fno-pie -fno-pic -fno-strict-overflow -fno-reorder-functions -fno-defer-pop -fmacro-prefix-map=/workdir/zephyr/samples/drivers/flash_shell=CMAKE_SOURCE_DIR -fmacro-prefix-map=/workdir/zephyr=ZEPHYR_BASE -fmacro-prefix-map=/workdir=WEST_TOPDIR -ffunction-sections -fdata-sections -mlongcalls -std=c99 -nostdinc -MD -MT zephyr/drivers/flash/CMakeFiles/drivers__flash.dir/flash_shell.c.obj -MF zephyr/drivers/flash/CMakeFiles/drivers__flash.dir/flash_shell.c.obj.d -o zephyr/drivers/flash/CMakeFiles/drivers__flash.dir/flash_shell.c.obj   -c /workdir/zephyr/drivers/flash/flash_shell.c
/workdir/zephyr/drivers/flash/flash_shell.c: In function 'parse_helper':
/workdir/zephyr/drivers/flash/flash_shell.c:29:4: error: 'DT_CHOSEN_ZEPHYR_FLASH_CONTROLLER_LABEL' undeclared (first use in this function)
   29 |    DT_CHOSEN_ZEPHYR_FLASH_CONTROLLER_LABEL);
      |    ^~~~~~~~~~~~~~~~~~~~~~~~~~~~~~~~~~~~~~~
/workdir/zephyr/drivers/flash/flash_shell.c:29:4: note: each undeclared identifier is reported only once for each function it appears in
[101/158] Building C object zephyr/drivers/serial/CMakeFiles/drivers__serial.dir/uart_ns16550.c.obj
[102/158] Building C object zephyr/drivers/spi/CMakeFiles/drivers__spi.dir/spi_dw.c.obj
ninja: build stopped: subcommand failed.
Including boilerplate (Zephyr base (cached)): /workdir/zephyr/cmake/app/boilerplate.cmake
-- Application: /workdir/zephyr/samples/drivers/flash_shell
-- Zephyr version: 2.3.99 (/workdir/zephyr)
-- Board: intel_s1000_crb
-- Found toolchain: zephyr (/opt/sdk/zephyr-sdk-0.11.3)
-- Found west: /usr/local/bin/west (found suitable version "0.7.2", minimum required is "0.7.1")
-- Found dtc: /opt/sdk/zephyr-sdk-0.11.3/sysroots/x86_64-pokysdk-linux/usr/bin/dtc (found suitable version "1.5.0", minimum required is "1.4.6")
-- Found BOARD.dts: /workdir/zephyr/boards/xtensa/intel_s1000_crb/intel_s1000_crb.dts
-- Generated zephyr.dts: /workdir/zephyr/sanity-out/intel_s1000_crb/samples/drivers/flash_shell/sample.drivers.flash.shell/zephyr/zephyr.dts
-- Generated devicetree_unfixed.h: /workdir/zephyr/sanity-out/intel_s1000_crb/samples/drivers/flash_shell/sample.drivers.flash.shell/zephyr/include/generated/devicetree_unfixed.h
Parsing /workdir/zephyr/samples/drivers/flash_shell/Kconfig
Loaded configuration '/workdir/zephyr/sanity-out/intel_s1000_crb/samples/drivers/flash_shell/sample.drivers.flash.shell/zephyr/.config'
No change to configuration in '/workdir/zephyr/sanity-out/intel_s1000_crb/samples/drivers/flash_shell/sample.drivers.flash.shell/zephyr/.config'
No change to Kconfig header in '/workdir/zephyr/sanity-out/intel_s1000_crb/samples/drivers/flash_shell/sample.drivers.flash.shell/zephyr/include/generated/autoconf.h'
-- Cache files will be written to: /root/.cache/zephyr
-- Configuring done
-- Generating done
-- Build files have been written to: /workdir/zephyr/sanity-out/intel_s1000_crb/samples/drivers/flash_shell/sample.drivers.flash.shell
[1/129] Generating misc/generated/syscalls.json, misc/generated/struct_tags.json
[2/122] Building C object zephyr/CMakeFiles/offsets.dir/arch/xtensa/core/offsets/offsets.c.obj
[3/122] Generating include/generated/offsets.h
[4/122] Building C object CMakeFiles/app.dir/src/main.c.obj
[5/122] Building C object zephyr/CMakeFiles/zephyr.dir/drivers/console/uart_console.c.obj
[6/122] Generating linker.cmd
[7/122] Building C object zephyr/CMakeFiles/zephyr.dir/lib/os/fdtable.c.obj
[8/122] Building C object zephyr/CMakeFiles/zephyr.dir/lib/os/mempool.c.obj
[9/122] Linking C static library app/libapp.a
[10/122] Building C object zephyr/CMakeFiles/zephyr.dir/lib/os/notify.c.obj
[11/122] Building C object zephyr/CMakeFiles/zephyr.dir/lib/os/printk.c.obj
[12/122] Building C object zephyr/CMakeFiles/zephyr.dir/lib/os/sem.c.obj
[13/122] Building C object zephyr/CMakeFiles/zephyr.dir/lib/os/onoff.c.obj
[14/122] Building C object zephyr/CMakeFiles/zephyr.dir/lib/os/rb.c.obj
[15/122] Building C object zephyr/CMakeFiles/zephyr.dir/lib/os/thread_entry.c.obj
[16/122] Building C object zephyr/CMakeFiles/zephyr.dir/lib/os/work_q.c.obj
[17/122] Building C object zephyr/CMakeFiles/zephyr.dir/lib/os/heap.c.obj
[18/122] Building C object zephyr/CMakeFiles/zephyr.dir/lib/os/ring_buffer.c.obj
[19/122] Building C object zephyr/CMakeFiles/zephyr.dir/lib/os/heap-validate.c.obj
[20/122] Building C object zephyr/CMakeFiles/zephyr.dir/subsys/logging/log_core.c.obj
[21/122] Building C object zephyr/CMakeFiles/zephyr.dir/subsys/logging/log_msg.c.obj
[22/122] Building C object zephyr/CMakeFiles/zephyr.dir/subsys/logging/log_output.c.obj
[23/122] Building C object zephyr/CMakeFiles/zephyr.dir/subsys/logging/log_cmds.c.obj
[24/122] Building C object zephyr/CMakeFiles/zephyr.dir/subsys/shell/modules/kernel_service.c.obj
[25/122] Building C object zephyr/CMakeFiles/zephyr.dir/subsys/shell/modules/device_service.c.obj
[26/122] Building C object zephyr/CMakeFiles/zephyr.dir/subsys/shell/shell.c.obj
[27/122] Building C object zephyr/CMakeFiles/zephyr.dir/subsys/shell/shell_fprintf.c.obj
[28/122] Building C object zephyr/CMakeFiles/zephyr.dir/subsys/shell/shell_ops.c.obj
[29/122] Building C object zephyr/CMakeFiles/zephyr.dir/subsys/shell/shell_utils.c.obj
[30/122] Building C object zephyr/CMakeFiles/zephyr.dir/subsys/shell/shell_uart.c.obj
[31/122] Building C object zephyr/CMakeFiles/zephyr.dir/subsys/shell/shell_help.c.obj
[32/122] Building C object zephyr/CMakeFiles/zephyr.dir/subsys/shell/shell_cmds.c.obj
[33/122] Building C object zephyr/CMakeFiles/zephyr.dir/subsys/shell/shell_history.c.obj
[34/122] Building C object zephyr/CMakeFiles/zephyr.dir/subsys/shell/shell_log_backend.c.obj
[35/122] Building C object zephyr/CMakeFiles/zephyr.dir/subsys/shell/shell_wildcard.c.obj
[36/122] Building C object zephyr/CMakeFiles/zephyr.dir/drivers/interrupt_controller/intc_dw.c.obj
[37/122] Building C object zephyr/CMakeFiles/zephyr.dir/drivers/interrupt_controller/intc_cavs.c.obj
[38/122] Building C object zephyr/CMakeFiles/zephyr.dir/drivers/pinmux/pinmux_intel_s1000.c.obj
[39/122] Building C object zephyr/CMakeFiles/zephyr.dir/drivers/timer/xtensa_sys_timer.c.obj
[40/122] Building C object zephyr/CMakeFiles/zephyr.dir/drivers/timer/sys_clock_init.c.obj
[41/122] Building C object zephyr/arch/common/CMakeFiles/arch__common.dir/isr_tables.c.obj
[42/122] Building C object zephyr/arch/common/CMakeFiles/arch__common.dir/sw_isr_common.c.obj
[43/122] Linking C static library zephyr/arch/common/libarch__common.a
[44/122] Building C object zephyr/arch/arch/xtensa/core/CMakeFiles/arch__xtensa__core.dir/cpu_idle.c.obj
[45/122] Building C object zephyr/arch/arch/xtensa/core/CMakeFiles/arch__xtensa__core.dir/fatal.c.obj
[46/122] Linking C static library zephyr/libzephyr.a
[47/122] Building ASM object zephyr/arch/arch/xtensa/core/CMakeFiles/arch__xtensa__core.dir/xtensa-asm2-util.S.obj
[48/122] Building C object zephyr/arch/arch/xtensa/core/CMakeFiles/arch__xtensa__core.dir/irq_manage.c.obj
[49/122] Building C object zephyr/lib/libc/minimal/CMakeFiles/lib__libc__minimal.dir/source/stdlib/malloc.c.obj
[50/122] Building C object zephyr/arch/arch/xtensa/core/CMakeFiles/arch__xtensa__core.dir/xtensa-asm2.c.obj
[51/122] Building C object zephyr/lib/libc/minimal/CMakeFiles/lib__libc__minimal.dir/source/stdlib/exit.c.obj
[52/122] Building C object zephyr/lib/posix/CMakeFiles/lib__posix.dir/pthread_common.c.obj
[53/122] Building C object zephyr/lib/posix/CMakeFiles/lib__posix.dir/nanosleep.c.obj
[54/122] Linking C static library zephyr/arch/arch/xtensa/core/libarch__xtensa__core.a
[55/122] Linking C static library zephyr/lib/posix/liblib__posix.a
[56/122] Building C object zephyr/soc/xtensa/intel_s1000/CMakeFiles/soc__xtensa__intel_s1000.dir/soc.c.obj
[57/122] Linking C static library zephyr/lib/libc/minimal/liblib__libc__minimal.a
[58/122] Building C object zephyr/boards/xtensa/intel_s1000_crb/CMakeFiles/boards__xtensa__intel_s1000_crb.dir/pinmux.c.obj
[59/122] Linking C static library zephyr/soc/xtensa/intel_s1000/libsoc__xtensa__intel_s1000.a
[60/122] Linking C static library zephyr/boards/xtensa/intel_s1000_crb/libboards__xtensa__intel_s1000_crb.a
[61/122] Building C object zephyr/kernel/CMakeFiles/kernel.dir/queue.c.obj
[62/122] Building C object zephyr/drivers/spi/CMakeFiles/drivers__spi.dir/spi_dw.c.obj
[63/122] Building C object zephyr/drivers/flash/CMakeFiles/drivers__flash.dir/spi_nor.c.obj
[64/122] Linking C static library zephyr/drivers/spi/libdrivers__spi.a
[65/122] Building C object zephyr/drivers/flash/CMakeFiles/drivers__flash.dir/flash_page_layout.c.obj
[66/122] Building C object zephyr/drivers/serial/CMakeFiles/drivers__serial.dir/uart_ns16550.c.obj
[67/122] Linking C static library zephyr/drivers/serial/libdrivers__serial.a
[68/122] Building C object modules/xtensa/CMakeFiles/modules_xtensa_hal.dir/src/hal/attribute.c.obj
[69/122] Building C object zephyr/drivers/flash/CMakeFiles/drivers__flash.dir/flash_shell.c.obj
FAILED: zephyr/drivers/flash/CMakeFiles/drivers__flash.dir/flash_shell.c.obj
ccache /opt/sdk/zephyr-sdk-0.11.3/xtensa/intel_s1000/xtensa-zephyr-elf/bin/xtensa-zephyr-elf-gcc -DBUILD_VERSION=zephyr-v2.3.0-720-gab3e778f47d8 -DKERNEL -D_FORTIFY_SOURCE=2 -D__ZEPHYR_SUPERVISOR__ -D__ZEPHYR__=1 -I../../../../../../include -Izephyr/include/generated -I../../../../../../soc/xtensa/intel_s1000 -I../../../../../../soc/xtensa/intel_s1000/include -I../../../../../../lib/fnmatch/. -I/var/lib/buildkite-agent/zephyr-module-cache/modules/hal/xtensa/include -I/var/lib/buildkite-agent/zephyr-module-cache/modules/hal/xtensa/zephyr/soc/intel_s1000 -isystem ../../../../../../lib/libc/minimal/include -isystem /opt/sdk/zephyr-sdk-0.11.3/xtensa/intel_s1000/xtensa-zephyr-elf/bin/../lib/gcc/xtensa-zephyr-elf/9.2.0/include -isystem /opt/sdk/zephyr-sdk-0.11.3/xtensa/intel_s1000/xtensa-zephyr-elf/bin/../lib/gcc/xtensa-zephyr-elf/9.2.0/include-fixed -Os -imacros/workdir/zephyr/sanity-out/intel_s1000_crb/samples/drivers/flash_shell/sample.drivers.flash.shell/zephyr/include/generated/autoconf.h -ffreestanding -fno-common -g -imacros/workdir/zephyr/include/toolchain/zephyr_stdint.h -Wall -Wformat -Wformat-security -Wno-format-zero-length -Wno-main -Wno-address-of-packed-member -Wno-pointer-sign -Wpointer-arith -Wno-unused-but-set-variable -Werror=implicit-int -Werror -fno-asynchronous-unwind-tables -fno-pie -fno-pic -fno-strict-overflow -fno-reorder-functions -fno-defer-pop -fmacro-prefix-map=/workdir/zephyr/samples/drivers/flash_shell=CMAKE_SOURCE_DIR -fmacro-prefix-map=/workdir/zephyr=ZEPHYR_BASE -fmacro-prefix-map=/workdir=WEST_TOPDIR -ffunction-sections -fdata-sections -mlongcalls -std=c99 -nostdinc -MD -MT zephyr/drivers/flash/CMakeFiles/drivers__flash.dir/flash_shell.c.obj -MF zephyr/drivers/flash/CMakeFiles/drivers__flash.dir/flash_shell.c.obj.d -o zephyr/drivers/flash/CMakeFiles/drivers__flash.dir/flash_shell.c.obj   -c /workdir/zephyr/drivers/flash/flash_shell.c
/workdir/zephyr/drivers/flash/flash_shell.c: In function 'parse_helper':
/workdir/zephyr/drivers/flash/flash_shell.c:29:4: error: 'DT_CHOSEN_ZEPHYR_FLASH_CONTROLLER_LABEL' undeclared (first use in this function)
   29 |    DT_CHOSEN_ZEPHYR_FLASH_CONTROLLER_LABEL);
      |    ^~~~~~~~~~~~~~~~~~~~~~~~~~~~~~~~~~~~~~~
/workdir/zephyr/drivers/flash/flash_shell.c:29:4: note: each undeclared identifier is reported only once for each function it appears in
[70/122] Building ASM object modules/xtensa/CMakeFiles/modules_xtensa_hal.dir/src/hal/cache_asm.S.obj
[71/122] Building C object modules/xtensa/CMakeFiles/modules_xtensa_hal.dir/src/hal/cache.c.obj
ninja: build stopped: subcommand failed.
Including boilerplate (Zephyr base (cached)): /workdir/zephyr/cmake/app/boilerplate.cmake
-- Application: /workdir/zephyr/samples/drivers/flash_shell
-- Zephyr version: 2.3.99 (/workdir/zephyr)
-- Board: intel_s1000_crb
-- Found toolchain: zephyr (/opt/sdk/zephyr-sdk-0.11.3)
-- Found west: /usr/local/bin/west (found suitable version "0.7.2", minimum required is "0.7.1")
-- Found dtc: /opt/sdk/zephyr-sdk-0.11.3/sysroots/x86_64-pokysdk-linux/usr/bin/dtc (found suitable version "1.5.0", minimum required is "1.4.6")
-- Found BOARD.dts: /workdir/zephyr/boards/xtensa/intel_s1000_crb/intel_s1000_crb.dts
-- Generated zephyr.dts: /workdir/zephyr/sanity-out/intel_s1000_crb/samples/drivers/flash_shell/sample.drivers.flash.shell/zephyr/zephyr.dts
-- Generated devicetree_unfixed.h: /workdir/zephyr/sanity-out/intel_s1000_crb/samples/drivers/flash_shell/sample.drivers.flash.shell/zephyr/include/generated/devicetree_unfixed.h
Parsing /workdir/zephyr/samples/drivers/flash_shell/Kconfig
Loaded configuration '/workdir/zephyr/sanity-out/intel_s1000_crb/samples/drivers/flash_shell/sample.drivers.flash.shell/zephyr/.config'
No change to configuration in '/workdir/zephyr/sanity-out/intel_s1000_crb/samples/drivers/flash_shell/sample.drivers.flash.shell/zephyr/.config'
No change to Kconfig header in '/workdir/zephyr/sanity-out/intel_s1000_crb/samples/drivers/flash_shell/sample.drivers.flash.shell/zephyr/include/generated/autoconf.h'
-- Cache files will be written to: /root/.cache/zephyr
-- Configuring done
-- Generating done
-- Build files have been written to: /workdir/zephyr/sanity-out/intel_s1000_crb/samples/drivers/flash_shell/sample.drivers.flash.shell
[1/126] Generating misc/generated/syscalls.json, misc/generated/struct_tags.json
[2/119] Building C object zephyr/CMakeFiles/offsets.dir/arch/xtensa/core/offsets/offsets.c.obj
[3/119] Generating include/generated/offsets.h
[4/119] Building C object CMakeFiles/app.dir/src/main.c.obj
[5/119] Building C object zephyr/CMakeFiles/zephyr.dir/drivers/console/uart_console.c.obj
[6/119] Building C object zephyr/CMakeFiles/zephyr.dir/lib/os/fdtable.c.obj
[7/119] Generating linker.cmd
[8/119] Linking C static library app/libapp.a
[9/119] Building C object zephyr/CMakeFiles/zephyr.dir/lib/os/mempool.c.obj
[10/119] Building C object zephyr/CMakeFiles/zephyr.dir/lib/os/printk.c.obj
[11/119] Building C object zephyr/CMakeFiles/zephyr.dir/lib/os/notify.c.obj
[12/119] Building C object zephyr/CMakeFiles/zephyr.dir/lib/os/onoff.c.obj
[13/119] Building C object zephyr/CMakeFiles/zephyr.dir/lib/os/rb.c.obj
[14/119] Building C object zephyr/CMakeFiles/zephyr.dir/lib/os/thread_entry.c.obj
[15/119] Building C object zephyr/CMakeFiles/zephyr.dir/lib/os/sem.c.obj
[16/119] Building C object zephyr/CMakeFiles/zephyr.dir/lib/os/work_q.c.obj
[17/119] Building C object zephyr/CMakeFiles/zephyr.dir/lib/os/heap.c.obj
[18/119] Building C object zephyr/CMakeFiles/zephyr.dir/lib/os/heap-validate.c.obj
[19/119] Building C object zephyr/CMakeFiles/zephyr.dir/lib/os/ring_buffer.c.obj
[20/119] Building C object zephyr/CMakeFiles/zephyr.dir/subsys/logging/log_core.c.obj
[21/119] Building C object zephyr/CMakeFiles/zephyr.dir/subsys/logging/log_msg.c.obj
[22/119] Building C object zephyr/CMakeFiles/zephyr.dir/subsys/shell/modules/kernel_service.c.obj
[23/119] Building C object zephyr/CMakeFiles/zephyr.dir/subsys/logging/log_cmds.c.obj
[24/119] Building C object zephyr/CMakeFiles/zephyr.dir/subsys/logging/log_output.c.obj
[25/119] Building C object zephyr/CMakeFiles/zephyr.dir/subsys/shell/modules/device_service.c.obj
[26/119] Building C object zephyr/CMakeFiles/zephyr.dir/subsys/shell/shell_fprintf.c.obj
[27/119] Building C object zephyr/CMakeFiles/zephyr.dir/subsys/shell/shell.c.obj
[28/119] Building C object zephyr/CMakeFiles/zephyr.dir/subsys/shell/shell_utils.c.obj
[29/119] Building C object zephyr/CMakeFiles/zephyr.dir/subsys/shell/shell_uart.c.obj
[30/119] Building C object zephyr/CMakeFiles/zephyr.dir/subsys/shell/shell_ops.c.obj
[31/119] Building C object zephyr/CMakeFiles/zephyr.dir/subsys/shell/shell_help.c.obj
[32/119] Building C object zephyr/CMakeFiles/zephyr.dir/subsys/shell/shell_cmds.c.obj
[33/119] Building C object zephyr/CMakeFiles/zephyr.dir/subsys/shell/shell_history.c.obj
[34/119] Building C object zephyr/CMakeFiles/zephyr.dir/subsys/shell/shell_log_backend.c.obj
[35/119] Building C object zephyr/CMakeFiles/zephyr.dir/drivers/interrupt_controller/intc_cavs.c.obj
[36/119] Building C object zephyr/CMakeFiles/zephyr.dir/subsys/shell/shell_wildcard.c.obj
[37/119] Building C object zephyr/CMakeFiles/zephyr.dir/drivers/interrupt_controller/intc_dw.c.obj
[38/119] Building C object zephyr/CMakeFiles/zephyr.dir/drivers/pinmux/pinmux_intel_s1000.c.obj
[39/119] Building C object zephyr/CMakeFiles/zephyr.dir/drivers/timer/sys_clock_init.c.obj
[40/119] Building C object zephyr/CMakeFiles/zephyr.dir/drivers/timer/xtensa_sys_timer.c.obj
[41/119] Building C object zephyr/arch/common/CMakeFiles/arch__common.dir/isr_tables.c.obj
[42/119] Building C object zephyr/arch/common/CMakeFiles/arch__common.dir/sw_isr_common.c.obj
[43/119] Building C object zephyr/arch/arch/xtensa/core/CMakeFiles/arch__xtensa__core.dir/cpu_idle.c.obj
[44/119] Building C object zephyr/arch/arch/xtensa/core/CMakeFiles/arch__xtensa__core.dir/fatal.c.obj
[45/119] Building ASM object zephyr/arch/arch/xtensa/core/CMakeFiles/arch__xtensa__core.dir/xtensa-asm2-util.S.obj
[46/119] Building C object zephyr/arch/arch/xtensa/core/CMakeFiles/arch__xtensa__core.dir/xtensa-asm2.c.obj
[47/119] Linking C static library zephyr/libzephyr.a
[48/119] Linking C static library zephyr/arch/common/libarch__common.a
[49/119] Building C object zephyr/arch/arch/xtensa/core/CMakeFiles/arch__xtensa__core.dir/irq_manage.c.obj
[50/119] Building C object zephyr/lib/libc/minimal/CMakeFiles/lib__libc__minimal.dir/source/stdlib/malloc.c.obj
[51/119] Building C object zephyr/lib/libc/minimal/CMakeFiles/lib__libc__minimal.dir/source/stdlib/exit.c.obj
[52/119] Linking C static library zephyr/arch/arch/xtensa/core/libarch__xtensa__core.a
[53/119] Building C object zephyr/lib/posix/CMakeFiles/lib__posix.dir/pthread_common.c.obj
[54/119] Building C object zephyr/lib/posix/CMakeFiles/lib__posix.dir/nanosleep.c.obj
[55/119] Building C object zephyr/soc/xtensa/intel_s1000/CMakeFiles/soc__xtensa__intel_s1000.dir/soc.c.obj
[56/119] Linking C static library zephyr/lib/posix/liblib__posix.a
[57/119] Linking C static library zephyr/lib/libc/minimal/liblib__libc__minimal.a
[58/119] Building C object zephyr/boards/xtensa/intel_s1000_crb/CMakeFiles/boards__xtensa__intel_s1000_crb.dir/pinmux.c.obj
[59/119] Linking C static library zephyr/soc/xtensa/intel_s1000/libsoc__xtensa__intel_s1000.a
[60/119] Building C object zephyr/kernel/CMakeFiles/kernel.dir/queue.c.obj
[61/119] Building C object zephyr/drivers/flash/CMakeFiles/drivers__flash.dir/spi_nor.c.obj
[62/119] Building C object zephyr/drivers/spi/CMakeFiles/drivers__spi.dir/spi_dw.c.obj
[63/119] Linking C static library zephyr/boards/xtensa/intel_s1000_crb/libboards__xtensa__intel_s1000_crb.a
[64/119] Building C object zephyr/drivers/flash/CMakeFiles/drivers__flash.dir/flash_page_layout.c.obj
[65/119] Building C object zephyr/drivers/serial/CMakeFiles/drivers__serial.dir/uart_ns16550.c.obj
[66/119] Linking C static library zephyr/drivers/spi/libdrivers__spi.a
[67/119] Linking C static library zephyr/drivers/serial/libdrivers__serial.a
[68/119] Building ASM object modules/xtensa/CMakeFiles/modules_xtensa_hal.dir/src/hal/clock.S.obj
[69/119] Building C object modules/xtensa/CMakeFiles/modules_xtensa_hal.dir/src/hal/coherence.c.obj
[70/119] Building C object zephyr/drivers/flash/CMakeFiles/drivers__flash.dir/flash_shell.c.obj
FAILED: zephyr/drivers/flash/CMakeFiles/drivers__flash.dir/flash_shell.c.obj
ccache /opt/sdk/zephyr-sdk-0.11.3/xtensa/intel_s1000/xtensa-zephyr-elf/bin/xtensa-zephyr-elf-gcc -DBUILD_VERSION=zephyr-v2.3.0-720-gab3e778f47d8 -DKERNEL -D_FORTIFY_SOURCE=2 -D__ZEPHYR_SUPERVISOR__ -D__ZEPHYR__=1 -I../../../../../../include -Izephyr/include/generated -I../../../../../../soc/xtensa/intel_s1000 -I../../../../../../soc/xtensa/intel_s1000/include -I../../../../../../lib/fnmatch/. -I/var/lib/buildkite-agent/zephyr-module-cache/modules/hal/xtensa/include -I/var/lib/buildkite-agent/zephyr-module-cache/modules/hal/xtensa/zephyr/soc/intel_s1000 -isystem ../../../../../../lib/libc/minimal/include -isystem /opt/sdk/zephyr-sdk-0.11.3/xtensa/intel_s1000/xtensa-zephyr-elf/bin/../lib/gcc/xtensa-zephyr-elf/9.2.0/include -isystem /opt/sdk/zephyr-sdk-0.11.3/xtensa/intel_s1000/xtensa-zephyr-elf/bin/../lib/gcc/xtensa-zephyr-elf/9.2.0/include-fixed -Os -imacros/workdir/zephyr/sanity-out/intel_s1000_crb/samples/drivers/flash_shell/sample.drivers.flash.shell/zephyr/include/generated/autoconf.h -ffreestanding -fno-common -g -imacros/workdir/zephyr/include/toolchain/zephyr_stdint.h -Wall -Wformat -Wformat-security -Wno-format-zero-length -Wno-main -Wno-address-of-packed-member -Wno-pointer-sign -Wpointer-arith -Wno-unused-but-set-variable -Werror=implicit-int -Werror -fno-asynchronous-unwind-tables -fno-pie -fno-pic -fno-strict-overflow -fno-reorder-functions -fno-defer-pop -fmacro-prefix-map=/workdir/zephyr/samples/drivers/flash_shell=CMAKE_SOURCE_DIR -fmacro-prefix-map=/workdir/zephyr=ZEPHYR_BASE -fmacro-prefix-map=/workdir=WEST_TOPDIR -ffunction-sections -fdata-sections -mlongcalls -std=c99 -nostdinc -MD -MT zephyr/drivers/flash/CMakeFiles/drivers__flash.dir/flash_shell.c.obj -MF zephyr/drivers/flash/CMakeFiles/drivers__flash.dir/flash_shell.c.obj.d -o zephyr/drivers/flash/CMakeFiles/drivers__flash.dir/flash_shell.c.obj   -c /workdir/zephyr/drivers/flash/flash_shell.c
/workdir/zephyr/drivers/flash/flash_shell.c: In function 'parse_helper':
/workdir/zephyr/drivers/flash/flash_shell.c:29:4: error: 'DT_CHOSEN_ZEPHYR_FLASH_CONTROLLER_LABEL' undeclared (first use in this function)
   29 |    DT_CHOSEN_ZEPHYR_FLASH_CONTROLLER_LABEL);
      |    ^~~~~~~~~~~~~~~~~~~~~~~~~~~~~~~~~~~~~~~
/workdir/zephyr/drivers/flash/flash_shell.c:29:4: note: each undeclared identifier is reported only once for each function it appears in
[71/119] Building C object modules/xtensa/CMakeFiles/modules_xtensa_hal.dir/src/hal/debug.c.obj
[72/119] Building ASM object modules/xtensa/CMakeFiles/modules_xtensa_hal.dir/src/hal/debug_hndlr.S.obj
ninja: build stopped: subcommand failed.
Including boilerplate (Zephyr base (cached)): /workdir/zephyr/cmake/app/boilerplate.cmake
-- Application: /workdir/zephyr/samples/drivers/flash_shell
-- Zephyr version: 2.3.99 (/workdir/zephyr)
-- Board: intel_s1000_crb
-- Found toolchain: zephyr (/opt/sdk/zephyr-sdk-0.11.3)
-- Found west: /usr/local/bin/west (found suitable version "0.7.2", minimum required is "0.7.1")
-- Found dtc: /opt/sdk/zephyr-sdk-0.11.3/sysroots/x86_64-pokysdk-linux/usr/bin/dtc (found suitable version "1.5.0", minimum required is "1.4.6")
-- Found BOARD.dts: /workdir/zephyr/boards/xtensa/intel_s1000_crb/intel_s1000_crb.dts
-- Generated zephyr.dts: /workdir/zephyr/sanity-out/intel_s1000_crb/samples/drivers/flash_shell/sample.drivers.flash.shell/zephyr/zephyr.dts
-- Generated devicetree_unfixed.h: /workdir/zephyr/sanity-out/intel_s1000_crb/samples/drivers/flash_shell/sample.drivers.flash.shell/zephyr/include/generated/devicetree_unfixed.h
Parsing /workdir/zephyr/samples/drivers/flash_shell/Kconfig
Loaded configuration '/workdir/zephyr/sanity-out/intel_s1000_crb/samples/drivers/flash_shell/sample.drivers.flash.shell/zephyr/.config'
No change to configuration in '/workdir/zephyr/sanity-out/intel_s1000_crb/samples/drivers/flash_shell/sample.drivers.flash.shell/zephyr/.config'
No change to Kconfig header in '/workdir/zephyr/sanity-out/intel_s1000_crb/samples/drivers/flash_shell/sample.drivers.flash.shell/zephyr/include/generated/autoconf.h'
-- Cache files will be written to: /root/.cache/zephyr
-- Configuring done
-- Generating done
-- Build files have been written to: /workdir/zephyr/sanity-out/intel_s1000_crb/samples/drivers/flash_shell/sample.drivers.flash.shell
[1/122] Generating misc/generated/syscalls.json, misc/generated/struct_tags.json
[2/115] Building C object zephyr/CMakeFiles/offsets.dir/arch/xtensa/core/offsets/offsets.c.obj
[3/115] Generating include/generated/offsets.h
[4/115] Building C object CMakeFiles/app.dir/src/main.c.obj
[5/115] Building C object zephyr/CMakeFiles/zephyr.dir/drivers/console/uart_console.c.obj
[6/115] Building C object zephyr/CMakeFiles/zephyr.dir/lib/os/fdtable.c.obj
[7/115] Generating linker.cmd
[8/115] Linking C static library app/libapp.a
[9/115] Building C object zephyr/CMakeFiles/zephyr.dir/lib/os/mempool.c.obj
[10/115] Building C object zephyr/CMakeFiles/zephyr.dir/lib/os/notify.c.obj
[11/115] Building C object zephyr/CMakeFiles/zephyr.dir/lib/os/printk.c.obj
[12/115] Building C object zephyr/CMakeFiles/zephyr.dir/lib/os/onoff.c.obj
[13/115] Building C object zephyr/CMakeFiles/zephyr.dir/lib/os/rb.c.obj
[14/115] Building C object zephyr/CMakeFiles/zephyr.dir/lib/os/thread_entry.c.obj
[15/115] Building C object zephyr/CMakeFiles/zephyr.dir/lib/os/sem.c.obj
[16/115] Building C object zephyr/CMakeFiles/zephyr.dir/lib/os/work_q.c.obj
[17/115] Building C object zephyr/CMakeFiles/zephyr.dir/lib/os/heap-validate.c.obj
[18/115] Building C object zephyr/CMakeFiles/zephyr.dir/lib/os/heap.c.obj
[19/115] Building C object zephyr/CMakeFiles/zephyr.dir/subsys/logging/log_core.c.obj
[20/115] Building C object zephyr/CMakeFiles/zephyr.dir/lib/os/ring_buffer.c.obj
[21/115] Building C object zephyr/CMakeFiles/zephyr.dir/subsys/logging/log_msg.c.obj
[22/115] Building C object zephyr/CMakeFiles/zephyr.dir/subsys/logging/log_output.c.obj
[23/115] Building C object zephyr/CMakeFiles/zephyr.dir/subsys/logging/log_cmds.c.obj
[24/115] Building C object zephyr/CMakeFiles/zephyr.dir/subsys/shell/modules/kernel_service.c.obj
[25/115] Building C object zephyr/CMakeFiles/zephyr.dir/subsys/shell/modules/device_service.c.obj
[26/115] Building C object zephyr/CMakeFiles/zephyr.dir/subsys/shell/shell.c.obj
[27/115] Building C object zephyr/CMakeFiles/zephyr.dir/subsys/shell/shell_fprintf.c.obj
[28/115] Building C object zephyr/CMakeFiles/zephyr.dir/subsys/shell/shell_utils.c.obj
[29/115] Building C object zephyr/CMakeFiles/zephyr.dir/subsys/shell/shell_ops.c.obj
[30/115] Building C object zephyr/CMakeFiles/zephyr.dir/subsys/shell/shell_help.c.obj
[31/115] Building C object zephyr/CMakeFiles/zephyr.dir/subsys/shell/shell_uart.c.obj
[32/115] Building C object zephyr/CMakeFiles/zephyr.dir/subsys/shell/shell_cmds.c.obj
[33/115] Building C object zephyr/CMakeFiles/zephyr.dir/subsys/shell/shell_history.c.obj
[34/115] Building C object zephyr/CMakeFiles/zephyr.dir/subsys/shell/shell_log_backend.c.obj
[35/115] Building C object zephyr/CMakeFiles/zephyr.dir/subsys/shell/shell_wildcard.c.obj
[36/115] Building C object zephyr/CMakeFiles/zephyr.dir/drivers/interrupt_controller/intc_cavs.c.obj
[37/115] Building C object zephyr/CMakeFiles/zephyr.dir/drivers/interrupt_controller/intc_dw.c.obj
[38/115] Building C object zephyr/CMakeFiles/zephyr.dir/drivers/pinmux/pinmux_intel_s1000.c.obj
[39/115] Building C object zephyr/CMakeFiles/zephyr.dir/drivers/timer/sys_clock_init.c.obj
[40/115] Building C object zephyr/CMakeFiles/zephyr.dir/drivers/timer/xtensa_sys_timer.c.obj
[41/115] Building C object zephyr/arch/common/CMakeFiles/arch__common.dir/isr_tables.c.obj
[42/115] Building C object zephyr/arch/common/CMakeFiles/arch__common.dir/sw_isr_common.c.obj
[43/115] Building C object zephyr/arch/arch/xtensa/core/CMakeFiles/arch__xtensa__core.dir/cpu_idle.c.obj
[44/115] Building C object zephyr/arch/arch/xtensa/core/CMakeFiles/arch__xtensa__core.dir/fatal.c.obj
[45/115] Building ASM object zephyr/arch/arch/xtensa/core/CMakeFiles/arch__xtensa__core.dir/xtensa-asm2-util.S.obj
[46/115] Linking C static library zephyr/arch/common/libarch__common.a
[47/115] Building C object zephyr/arch/arch/xtensa/core/CMakeFiles/arch__xtensa__core.dir/xtensa-asm2.c.obj
[48/115] Linking C static library zephyr/libzephyr.a
[49/115] Building C object zephyr/arch/arch/xtensa/core/CMakeFiles/arch__xtensa__core.dir/irq_manage.c.obj
[50/115] Building C object zephyr/lib/libc/minimal/CMakeFiles/lib__libc__minimal.dir/source/stdlib/malloc.c.obj
[51/115] Building C object zephyr/lib/posix/CMakeFiles/lib__posix.dir/pthread_common.c.obj
[52/115] Building C object zephyr/lib/libc/minimal/CMakeFiles/lib__libc__minimal.dir/source/stdlib/exit.c.obj
[53/115] Building C object zephyr/lib/posix/CMakeFiles/lib__posix.dir/nanosleep.c.obj
[54/115] Linking C static library zephyr/arch/arch/xtensa/core/libarch__xtensa__core.a
[55/115] Linking C static library zephyr/lib/posix/liblib__posix.a
[56/115] Building C object zephyr/soc/xtensa/intel_s1000/CMakeFiles/soc__xtensa__intel_s1000.dir/soc.c.obj
[57/115] Linking C static library zephyr/lib/libc/minimal/liblib__libc__minimal.a
[58/115] Building C object zephyr/boards/xtensa/intel_s1000_crb/CMakeFiles/boards__xtensa__intel_s1000_crb.dir/pinmux.c.obj
[59/115] Building C object zephyr/kernel/CMakeFiles/kernel.dir/queue.c.obj
[60/115] Linking C static library zephyr/boards/xtensa/intel_s1000_crb/libboards__xtensa__intel_s1000_crb.a
[61/115] Linking C static library zephyr/soc/xtensa/intel_s1000/libsoc__xtensa__intel_s1000.a
[62/115] Building C object zephyr/drivers/spi/CMakeFiles/drivers__spi.dir/spi_dw.c.obj
[63/115] Building C object zephyr/drivers/flash/CMakeFiles/drivers__flash.dir/flash_page_layout.c.obj
[64/115] Building C object zephyr/drivers/flash/CMakeFiles/drivers__flash.dir/spi_nor.c.obj
[65/115] Linking C static library zephyr/drivers/spi/libdrivers__spi.a
[66/115] Building C object zephyr/drivers/serial/CMakeFiles/drivers__serial.dir/uart_ns16550.c.obj
[67/115] Linking C static library zephyr/drivers/serial/libdrivers__serial.a
[68/115] Building ASM object modules/xtensa/CMakeFiles/modules_xtensa_hal.dir/src/hal/int_asm.S.obj
[69/115] Building C object modules/xtensa/CMakeFiles/modules_xtensa_hal.dir/src/hal/disass.c.obj
[70/115] Building C object zephyr/drivers/flash/CMakeFiles/drivers__flash.dir/flash_shell.c.obj
FAILED: zephyr/drivers/flash/CMakeFiles/drivers__flash.dir/flash_shell.c.obj
ccache /opt/sdk/zephyr-sdk-0.11.3/xtensa/intel_s1000/xtensa-zephyr-elf/bin/xtensa-zephyr-elf-gcc -DBUILD_VERSION=zephyr-v2.3.0-720-gab3e778f47d8 -DKERNEL -D_FORTIFY_SOURCE=2 -D__ZEPHYR_SUPERVISOR__ -D__ZEPHYR__=1 -I../../../../../../include -Izephyr/include/generated -I../../../../../../soc/xtensa/intel_s1000 -I../../../../../../soc/xtensa/intel_s1000/include -I../../../../../../lib/fnmatch/. -I/var/lib/buildkite-agent/zephyr-module-cache/modules/hal/xtensa/include -I/var/lib/buildkite-agent/zephyr-module-cache/modules/hal/xtensa/zephyr/soc/intel_s1000 -isystem ../../../../../../lib/libc/minimal/include -isystem /opt/sdk/zephyr-sdk-0.11.3/xtensa/intel_s1000/xtensa-zephyr-elf/bin/../lib/gcc/xtensa-zephyr-elf/9.2.0/include -isystem /opt/sdk/zephyr-sdk-0.11.3/xtensa/intel_s1000/xtensa-zephyr-elf/bin/../lib/gcc/xtensa-zephyr-elf/9.2.0/include-fixed -Os -imacros/workdir/zephyr/sanity-out/intel_s1000_crb/samples/drivers/flash_shell/sample.drivers.flash.shell/zephyr/include/generated/autoconf.h -ffreestanding -fno-common -g -imacros/workdir/zephyr/include/toolchain/zephyr_stdint.h -Wall -Wformat -Wformat-security -Wno-format-zero-length -Wno-main -Wno-address-of-packed-member -Wno-pointer-sign -Wpointer-arith -Wno-unused-but-set-variable -Werror=implicit-int -Werror -fno-asynchronous-unwind-tables -fno-pie -fno-pic -fno-strict-overflow -fno-reorder-functions -fno-defer-pop -fmacro-prefix-map=/workdir/zephyr/samples/drivers/flash_shell=CMAKE_SOURCE_DIR -fmacro-prefix-map=/workdir/zephyr=ZEPHYR_BASE -fmacro-prefix-map=/workdir=WEST_TOPDIR -ffunction-sections -fdata-sections -mlongcalls -std=c99 -nostdinc -MD -MT zephyr/drivers/flash/CMakeFiles/drivers__flash.dir/flash_shell.c.obj -MF zephyr/drivers/flash/CMakeFiles/drivers__flash.dir/flash_shell.c.obj.d -o zephyr/drivers/flash/CMakeFiles/drivers__flash.dir/flash_shell.c.obj   -c /workdir/zephyr/drivers/flash/flash_shell.c
/workdir/zephyr/drivers/flash/flash_shell.c: In function 'parse_helper':
/workdir/zephyr/drivers/flash/flash_shell.c:29:4: error: 'DT_CHOSEN_ZEPHYR_FLASH_CONTROLLER_LABEL' undeclared (first use in this function)
   29 |    DT_CHOSEN_ZEPHYR_FLASH_CONTROLLER_LABEL);
      |    ^~~~~~~~~~~~~~~~~~~~~~~~~~~~~~~~~~~~~~~
/workdir/zephyr/drivers/flash/flash_shell.c:29:4: note: each undeclared identifier is reported only once for each function it appears in
[71/115] Building ASM object modules/xtensa/CMakeFiles/modules_xtensa_hal.dir/src/hal/memcopy.S.obj
[72/115] Building C object modules/xtensa/CMakeFiles/modules_xtensa_hal.dir/src/hal/interrupts.c.obj
ninja: build stopped: subcommand failed.

in Job #091e8182-5f79-461a-9700-5baab2f99ea7


[ master ] Build TIMEOUT for zephyrproject-rtos/ci-test ( ci: Update sdk to 0.11.3 Update sdk to 0.11.3 release and update docker image to get that SDK version. Signed-off-by: Kumar Gala <kumar.gala@linaro.org> ) on Shippable.com #builds

Shippable.com <noreply@...>
 

SHIPPABLE BUILD REPORT

3537
ci-test
Branch : master Sha : 5f9e0cfc3c
Builder : Kumar Gala Triggered By : Kumar Gala
Custom Environment Variables:
JOB_TRIGGERED_BY_NAME="daily-verify"
JOB_TRIGGERED_BY_ID="23790"
# Runtime Status Tests Branch Coverage Sequence Coverage Triggered at Duration
3537.1 none succeeded 1494/1722 N/A N/A Thu Jul 02 2020 02:05:21 GMT+0000 (UTC) 02:13:63
3537.2 none failed 851/1722 N/A N/A Thu Jul 02 2020 02:05:21 GMT+0000 (UTC) 01:82:37
3537.3 none timeout 0/0 N/A N/A Thu Jul 02 2020 02:05:21 GMT+0000 (UTC) 02:23:07
3537.4 none timeout 0/0 N/A N/A Thu Jul 02 2020 02:05:21 GMT+0000 (UTC) 02:23:06
3537.5 none succeeded 1715/1722 N/A N/A Thu Jul 02 2020 02:05:21 GMT+0000 (UTC) 02:11:51
3537.6 none succeeded 1720/1722 N/A N/A Thu Jul 02 2020 02:05:21 GMT+0000 (UTC) 02:23:81
3537.7 none succeeded 1211/1722 N/A N/A Thu Jul 02 2020 02:05:21 GMT+0000 (UTC) 02:20:96
3537.8 none succeeded 934/1722 N/A N/A Thu Jul 02 2020 02:05:21 GMT+0000 (UTC) 01:79:30
3537.9 none succeeded 1485/1722 N/A N/A Thu Jul 02 2020 02:05:21 GMT+0000 (UTC) 02:17:49
3537.10 none timeout 1463/1722 N/A N/A Thu Jul 02 2020 02:05:21 GMT+0000 (UTC) 02:23:03
3537.11 none timeout 0/0 N/A N/A Thu Jul 02 2020 02:05:21 GMT+0000 (UTC) 02:23:03
3537.12 none timeout 0/0 N/A N/A Thu Jul 02 2020 02:05:21 GMT+0000 (UTC) 02:23:02
3537.13 none succeeded 1385/1722 N/A N/A Thu Jul 02 2020 02:05:22 GMT+0000 (UTC) 02:11:47
3537.14 none timeout 1312/1722 N/A N/A Thu Jul 02 2020 02:05:22 GMT+0000 (UTC) 02:23:01
3537.15 none succeeded 1135/1722 N/A N/A Thu Jul 02 2020 02:05:22 GMT+0000 (UTC) 02:91:43
3537.16 none succeeded 1441/1722 N/A N/A Thu Jul 02 2020 02:05:22 GMT+0000 (UTC) 02:14:41
3537.17 none failed 0/0 N/A N/A Thu Jul 02 2020 02:05:22 GMT+0000 (UTC) 00:07:03
3537.18 none succeeded 1697/1722 N/A N/A Thu Jul 02 2020 02:05:22 GMT+0000 (UTC) 02:19:58
3537.19 none succeeded 1190/1722 N/A N/A Thu Jul 02 2020 02:05:22 GMT+0000 (UTC) 02:94:37
3537.20 none succeeded 1690/1721 N/A N/A Thu Jul 02 2020 02:05:22 GMT+0000 (UTC) 02:17:00
3537.21 none timeout 1522/1721 N/A N/A Thu Jul 02 2020 02:05:22 GMT+0000 (UTC) 02:23:98
3537.22 none succeeded 1290/1721 N/A N/A Thu Jul 02 2020 02:05:22 GMT+0000 (UTC) 02:15:82
3537.23 none succeeded 1284/1721 N/A N/A Thu Jul 02 2020 02:05:22 GMT+0000 (UTC) 02:08:98
3537.24 none succeeded 1347/1721 N/A N/A Thu Jul 02 2020 02:05:22 GMT+0000 (UTC) 02:15:76
3537.25 none timeout 0/0 N/A N/A Thu Jul 02 2020 02:05:22 GMT+0000 (UTC) 02:23:95
3537.26 none timeout 0/0 N/A N/A Thu Jul 02 2020 02:05:22 GMT+0000 (UTC) 02:23:95
3537.27 none succeeded 1109/1721 N/A N/A Thu Jul 02 2020 02:05:22 GMT+0000 (UTC) 02:06:82
3537.28 none timeout 0/0 N/A N/A Thu Jul 02 2020 02:05:22 GMT+0000 (UTC) 02:23:83
3537.29 none succeeded 1422/1721 N/A N/A Thu Jul 02 2020 02:05:22 GMT+0000 (UTC) 02:10:84
3537.30 none timeout 0/0 N/A N/A Thu Jul 02 2020 02:05:22 GMT+0000 (UTC) 02:23:82
3537.31 none timeout 0/0 N/A N/A Thu Jul 02 2020 02:05:22 GMT+0000 (UTC) 02:21:79
3537.32 none timeout 0/0 N/A N/A Thu Jul 02 2020 02:05:23 GMT+0000 (UTC) 02:25:76
3537.33 none timeout 0/0 N/A N/A Thu Jul 02 2020 02:05:23 GMT+0000 (UTC) 02:21:70
3537.34 none succeeded 1711/1721 N/A N/A Thu Jul 02 2020 02:05:23 GMT+0000 (UTC) 02:21:66
3537.35 none succeeded 1721/1721 N/A N/A Thu Jul 02 2020 02:05:23 GMT+0000 (UTC) 02:14:16


Need help with Shippable? File an Issue


[ master ] Build FAILED for zephyrproject-rtos/test_results ( zephyr-v2.3.0-437-gb5764f9902: Intel Master Daily Test Report Intel Zephyr Daily Test Report for the master branch Signed-off-by: Maksim Masalski <maksim.masalski@intel.com> ) on Shippable.com #builds

Shippable.com <noreply@...>
 

SHIPPABLE BUILD REPORT

111
test_results
Branch : master Sha : 1fd961dad1
Builder : Maksim Masalski Triggered By : Anas Nashif
Custom Environment Variables:
JOB_TRIGGERED_BY_NAME="create_test_commit"
JOB_TRIGGERED_BY_ID="125148"
# Runtime Status Tests Branch Coverage Sequence Coverage Triggered at Duration
111.1 none succeeded 0/0 N/A N/A Thu Jul 02 2020 04:07:27 GMT+0000 (UTC) 00:22:28
111.2 none succeeded 0/0 N/A N/A Thu Jul 02 2020 04:07:27 GMT+0000 (UTC) 00:18:92
111.3 none succeeded 0/0 N/A N/A Thu Jul 02 2020 04:07:27 GMT+0000 (UTC) 00:21:80
111.4 none succeeded 0/0 N/A N/A Thu Jul 02 2020 04:07:27 GMT+0000 (UTC) 00:24:14
111.5 none succeeded 0/0 N/A N/A Thu Jul 02 2020 04:07:27 GMT+0000 (UTC) 00:23:82
111.6 none succeeded 0/0 N/A N/A Thu Jul 02 2020 04:07:28 GMT+0000 (UTC) 00:22:03
111.7 none failed 0/0 N/A N/A Thu Jul 02 2020 04:07:28 GMT+0000 (UTC) 00:30:95
111.8 none succeeded 0/0 N/A N/A Thu Jul 02 2020 04:07:28 GMT+0000 (UTC) 00:27:91
111.9 none succeeded 0/0 N/A N/A Thu Jul 02 2020 04:07:28 GMT+0000 (UTC) 01:34:51
111.10 none succeeded 0/0 N/A N/A Thu Jul 02 2020 04:07:28 GMT+0000 (UTC) 01:32:46


Need help with Shippable? File an Issue


[Failed] Zephyr / zephyr-daily #12 (master) #builds

Buildkite <notifications@...>
 

Scheduled build Duration: 3 hours, 4 minutes, 8 seconds
Build #12 | master | b466e57
View Build →


[ master ] Build TIMEOUT for zephyrproject-rtos/ci-test ( ci: Update sdk to 0.11.3 Update sdk to 0.11.3 release and update docker image to get that SDK version. Signed-off-by: Kumar Gala <kumar.gala@linaro.org> ) on Shippable.com #builds

Shippable.com <noreply@...>
 

SHIPPABLE BUILD REPORT

3536
ci-test
Branch : master Sha : 5f9e0cfc3c
Builder : Kumar Gala Triggered By : Kumar Gala
Custom Environment Variables:
JOB_TRIGGERED_BY_NAME="daily-verify"
JOB_TRIGGERED_BY_ID="23790"
# Runtime Status Tests Branch Coverage Sequence Coverage Triggered at Duration
3536.1 none succeeded 1483/1709 N/A N/A Wed Jul 01 2020 02:06:00 GMT+0000 (UTC) 02:05:04
3536.2 none failed 847/1709 N/A N/A Wed Jul 01 2020 02:06:01 GMT+0000 (UTC) 01:79:14
3536.3 none timeout 0/0 N/A N/A Wed Jul 01 2020 02:06:01 GMT+0000 (UTC) 02:22:25
3536.4 none timeout 0/0 N/A N/A Wed Jul 01 2020 02:06:01 GMT+0000 (UTC) 02:22:24
3536.5 none succeeded 1701/1708 N/A N/A Wed Jul 01 2020 02:06:01 GMT+0000 (UTC) 02:09:51
3536.6 none timeout 0/0 N/A N/A Wed Jul 01 2020 02:06:01 GMT+0000 (UTC) 02:22:23
3536.7 none succeeded 1196/1708 N/A N/A Wed Jul 01 2020 02:06:01 GMT+0000 (UTC) 02:18:90
3536.8 none failed 924/1708 N/A N/A Wed Jul 01 2020 02:06:01 GMT+0000 (UTC) 01:84:19
3536.9 none failed 1475/1708 N/A N/A Wed Jul 01 2020 02:06:01 GMT+0000 (UTC) 02:19:64
3536.10 none timeout 1452/1708 N/A N/A Wed Jul 01 2020 02:06:01 GMT+0000 (UTC) 02:22:21
3536.11 none timeout 0/0 N/A N/A Wed Jul 01 2020 02:06:01 GMT+0000 (UTC) 02:22:20
3536.12 none timeout 0/0 N/A N/A Wed Jul 01 2020 02:06:01 GMT+0000 (UTC) 02:22:20
3536.13 none succeeded 1375/1708 N/A N/A Wed Jul 01 2020 02:06:01 GMT+0000 (UTC) 02:18:07
3536.14 none succeeded 1304/1708 N/A N/A Wed Jul 01 2020 02:06:01 GMT+0000 (UTC) 02:15:89
3536.15 none succeeded 1125/1708 N/A N/A Wed Jul 01 2020 02:06:01 GMT+0000 (UTC) 02:91:78
3536.16 none failed 1427/1708 N/A N/A Wed Jul 01 2020 02:06:01 GMT+0000 (UTC) 02:19:48
3536.17 none succeeded 1207/1708 N/A N/A Wed Jul 01 2020 02:06:01 GMT+0000 (UTC) 02:09:40
3536.18 none succeeded 1683/1708 N/A N/A Wed Jul 01 2020 02:06:01 GMT+0000 (UTC) 02:17:91
3536.19 none succeeded 1181/1708 N/A N/A Wed Jul 01 2020 02:06:01 GMT+0000 (UTC) 02:95:94
3536.20 none succeeded 1677/1708 N/A N/A Wed Jul 01 2020 02:06:01 GMT+0000 (UTC) 02:16:42
3536.21 none timeout 0/0 N/A N/A Wed Jul 01 2020 02:06:01 GMT+0000 (UTC) 02:22:15
3536.22 none succeeded 1282/1708 N/A N/A Wed Jul 01 2020 02:06:01 GMT+0000 (UTC) 02:22:94
3536.23 none succeeded 1275/1708 N/A N/A Wed Jul 01 2020 02:06:01 GMT+0000 (UTC) 02:07:18
3536.24 none succeeded 1337/1708 N/A N/A Wed Jul 01 2020 02:06:02 GMT+0000 (UTC) 02:16:45
3536.25 none timeout 0/0 N/A N/A Wed Jul 01 2020 02:06:02 GMT+0000 (UTC) 02:22:13
3536.26 none timeout 0/0 N/A N/A Wed Jul 01 2020 02:06:02 GMT+0000 (UTC) 02:22:12
3536.27 none succeeded 1101/1708 N/A N/A Wed Jul 01 2020 02:06:02 GMT+0000 (UTC) 02:10:17
3536.28 none timeout 0/0 N/A N/A Wed Jul 01 2020 02:06:02 GMT+0000 (UTC) 02:22:11
3536.29 none succeeded 1411/1708 N/A N/A Wed Jul 01 2020 02:06:02 GMT+0000 (UTC) 02:13:96
3536.30 none timeout 0/0 N/A N/A Wed Jul 01 2020 02:06:02 GMT+0000 (UTC) 02:22:10
3536.31 none timeout 0/0 N/A N/A Wed Jul 01 2020 02:06:02 GMT+0000 (UTC) 02:23:08
3536.32 none timeout 0/0 N/A N/A Wed Jul 01 2020 02:06:02 GMT+0000 (UTC) 02:23:00
3536.33 none timeout 0/0 N/A N/A Wed Jul 01 2020 02:06:02 GMT+0000 (UTC) 02:21:34
3536.34 none succeeded 1698/1708 N/A N/A Wed Jul 01 2020 02:06:02 GMT+0000 (UTC) 02:20:10
3536.35 none failed 1707/1708 N/A N/A Wed Jul 01 2020 02:06:02 GMT+0000 (UTC) 02:15:17


Need help with Shippable? File an Issue


[ master ] Build FAILED for zephyrproject-rtos/test_results ( zephyr-v2.3.0-361-gcf72fe8fe9: arc em_starterkit_em9d results em_starterkit_em9d: 142 tests passed, 1 failed, 29 skipped 143 tests executed on platforms, 29 tests were only build samples/posix/eventfd/sample.posix.eventfd failed timeout Signed-off-by: Jingru Wang <jingru@synopsys.com> ) on Shippable.com #builds

Shippable.com <noreply@...>
 

SHIPPABLE BUILD REPORT

110
test_results
Branch : master Sha : 9f5377e91d
Builder : wangnuannuan Triggered By : Anas Nashif
Custom Environment Variables:
JOB_TRIGGERED_BY_NAME="create_test_commit"
JOB_TRIGGERED_BY_ID="125148"
# Runtime Status Tests Branch Coverage Sequence Coverage Triggered at Duration
110.1 none succeeded 0/0 N/A N/A Wed Jul 01 2020 04:07:54 GMT+0000 (UTC) 00:23:65
110.2 none succeeded 0/0 N/A N/A Wed Jul 01 2020 04:07:54 GMT+0000 (UTC) 00:18:81
110.3 none succeeded 0/0 N/A N/A Wed Jul 01 2020 04:07:54 GMT+0000 (UTC) 00:18:60
110.4 none succeeded 0/0 N/A N/A Wed Jul 01 2020 04:07:54 GMT+0000 (UTC) 00:19:63
110.5 none succeeded 0/0 N/A N/A Wed Jul 01 2020 04:07:55 GMT+0000 (UTC) 00:18:99
110.6 none succeeded 0/0 N/A N/A Wed Jul 01 2020 04:07:55 GMT+0000 (UTC) 00:19:36
110.7 none failed 0/0 N/A N/A Wed Jul 01 2020 04:07:55 GMT+0000 (UTC) 00:26:80
110.8 none succeeded 0/0 N/A N/A Wed Jul 01 2020 04:07:55 GMT+0000 (UTC) 00:23:09
110.9 none succeeded 0/0 N/A N/A Wed Jul 01 2020 04:07:55 GMT+0000 (UTC) 01:30:04
110.10 none succeeded 0/0 N/A N/A Wed Jul 01 2020 04:07:55 GMT+0000 (UTC) 00:28:93


Need help with Shippable? File an Issue


[Canceled] Zephyr / zephyr-daily #8 (master) #builds

Buildkite <notifications@...>
 

Scheduled build Duration: 19 minutes, 50 seconds
Build #8 | master | 83f7f81
View Build →


[ master ] Build TIMEOUT for zephyrproject-rtos/ci-test ( ci: Update sdk to 0.11.3 Update sdk to 0.11.3 release and update docker image to get that SDK version. Signed-off-by: Kumar Gala <kumar.gala@linaro.org> ) on Shippable.com #builds

Shippable.com <noreply@...>
 

SHIPPABLE BUILD REPORT

3535
ci-test
Branch : master Sha : 5f9e0cfc3c
Builder : Kumar Gala Triggered By : Kumar Gala
Custom Environment Variables:
JOB_TRIGGERED_BY_NAME="daily-verify"
JOB_TRIGGERED_BY_ID="23790"
# Runtime Status Tests Branch Coverage Sequence Coverage Triggered at Duration
3535.1 none succeeded 1483/1709 N/A N/A Tue Jun 30 2020 02:05:50 GMT+0000 (UTC) 02:03:04
3535.2 none failed 843/1709 N/A N/A Tue Jun 30 2020 02:05:50 GMT+0000 (UTC) 01:79:22
3535.3 none timeout 0/0 N/A N/A Tue Jun 30 2020 02:05:50 GMT+0000 (UTC) 02:21:56
3535.4 none timeout 0/0 N/A N/A Tue Jun 30 2020 02:05:50 GMT+0000 (UTC) 02:21:56
3535.5 none succeeded 1701/1708 N/A N/A Tue Jun 30 2020 02:05:50 GMT+0000 (UTC) 02:11:47
3535.6 none timeout 0/0 N/A N/A Tue Jun 30 2020 02:05:50 GMT+0000 (UTC) 02:21:55
3535.7 none succeeded 1196/1708 N/A N/A Tue Jun 30 2020 02:05:50 GMT+0000 (UTC) 02:20:78
3535.8 none failed 924/1708 N/A N/A Tue Jun 30 2020 02:05:50 GMT+0000 (UTC) 01:82:06
3535.9 none failed 1475/1708 N/A N/A Tue Jun 30 2020 02:05:50 GMT+0000 (UTC) 02:21:40
3535.10 none timeout 0/0 N/A N/A Tue Jun 30 2020 02:05:50 GMT+0000 (UTC) 02:21:52
3535.11 none timeout 0/0 N/A N/A Tue Jun 30 2020 02:05:50 GMT+0000 (UTC) 02:21:52
3535.12 none timeout 0/0 N/A N/A Tue Jun 30 2020 02:05:51 GMT+0000 (UTC) 02:21:51
3535.13 none succeeded 1375/1708 N/A N/A Tue Jun 30 2020 02:05:51 GMT+0000 (UTC) 02:17:18
3535.14 none succeeded 1304/1708 N/A N/A Tue Jun 30 2020 02:05:51 GMT+0000 (UTC) 02:13:76
3535.15 none succeeded 1125/1708 N/A N/A Tue Jun 30 2020 02:05:51 GMT+0000 (UTC) 02:92:49
3535.16 none failed 1427/1708 N/A N/A Tue Jun 30 2020 02:05:51 GMT+0000 (UTC) 02:18:89
3535.17 none succeeded 1207/1708 N/A N/A Tue Jun 30 2020 02:05:51 GMT+0000 (UTC) 02:11:61
3535.18 none succeeded 1683/1708 N/A N/A Tue Jun 30 2020 02:05:51 GMT+0000 (UTC) 02:17:96
3535.19 none succeeded 1181/1708 N/A N/A Tue Jun 30 2020 02:05:51 GMT+0000 (UTC) 02:96:87
3535.20 none succeeded 1677/1708 N/A N/A Tue Jun 30 2020 02:05:51 GMT+0000 (UTC) 02:16:51
3535.21 none timeout 0/0 N/A N/A Tue Jun 30 2020 02:05:51 GMT+0000 (UTC) 02:21:46
3535.22 none succeeded 1282/1708 N/A N/A Tue Jun 30 2020 02:05:51 GMT+0000 (UTC) 02:17:03
3535.23 none succeeded 1275/1708 N/A N/A Tue Jun 30 2020 02:05:51 GMT+0000 (UTC) 02:10:82
3535.24 none succeeded 1337/1708 N/A N/A Tue Jun 30 2020 02:05:51 GMT+0000 (UTC) 02:18:61
3535.25 none timeout 0/0 N/A N/A Tue Jun 30 2020 02:05:51 GMT+0000 (UTC) 02:21:44
3535.26 none timeout 0/0 N/A N/A Tue Jun 30 2020 02:05:51 GMT+0000 (UTC) 02:21:44
3535.27 none succeeded 1101/1708 N/A N/A Tue Jun 30 2020 02:05:51 GMT+0000 (UTC) 02:08:57
3535.28 none timeout 0/0 N/A N/A Tue Jun 30 2020 02:05:51 GMT+0000 (UTC) 02:21:43
3535.29 none succeeded 1411/1708 N/A N/A Tue Jun 30 2020 02:05:51 GMT+0000 (UTC) 02:13:76
3535.30 none timeout 0/0 N/A N/A Tue Jun 30 2020 02:05:52 GMT+0000 (UTC) 02:21:41
3535.31 none timeout 0/0 N/A N/A Tue Jun 30 2020 02:05:52 GMT+0000 (UTC) 02:22:35
3535.32 none timeout 0/0 N/A N/A Tue Jun 30 2020 02:05:52 GMT+0000 (UTC) 02:24:39
3535.33 none timeout 0/0 N/A N/A Tue Jun 30 2020 02:05:52 GMT+0000 (UTC) 02:23:74
3535.34 none succeeded 1698/1708 N/A N/A Tue Jun 30 2020 02:05:52 GMT+0000 (UTC) 02:22:25
3535.35 none failed 1707/1708 N/A N/A Tue Jun 30 2020 02:05:52 GMT+0000 (UTC) 02:16:32


Need help with Shippable? File an Issue


[ master ] Build SUCCEEDED for zephyrproject-rtos/test_results ( zephyr-v2.3.0-641-gb5fb9497b6: stm32 results Non reg result analysis on last run: (verdicts: T/p: Passed, F/f: Failed, t:timeout) tests/kernel/fpu_sharing/float_disable/kernel.fpu_sharing.float_disable.arm, nucleo_l4r5zi (instable: pfpfppppppppppppp) tests/kernel/mem_protect/userspace/kernel.memory_protection.userspace, disco_l475_iot1 (instable: pppppppttpppppppp) Total: 19 test(s) failed out of 1802 tests run 0 regression(s) on stable test Signed-off-by: Erwan Gouriou <erwan.gouriou@linaro.org> ) on Shippable.com #builds

Shippable.com <noreply@...>
 

SHIPPABLE BUILD REPORT

109
test_results
Branch : master Sha : 9910bd763a
Builder : Erwan Gouriou Triggered By : Anas Nashif
Custom Environment Variables:
JOB_TRIGGERED_BY_NAME="create_test_commit"
JOB_TRIGGERED_BY_ID="125148"
# Runtime Status Tests Branch Coverage Sequence Coverage Triggered at Duration
109.1 none succeeded 0/0 N/A N/A Tue Jun 30 2020 04:08:08 GMT+0000 (UTC) 00:22:39
109.2 none succeeded 0/0 N/A N/A Tue Jun 30 2020 04:08:08 GMT+0000 (UTC) 00:17:30
109.3 none succeeded 0/0 N/A N/A Tue Jun 30 2020 04:08:08 GMT+0000 (UTC) 00:17:10
109.4 none succeeded 0/0 N/A N/A Tue Jun 30 2020 04:08:08 GMT+0000 (UTC) 00:17:28
109.5 none succeeded 0/0 N/A N/A Tue Jun 30 2020 04:08:08 GMT+0000 (UTC) 00:17:25
109.6 none succeeded 0/0 N/A N/A Tue Jun 30 2020 04:08:08 GMT+0000 (UTC) 00:20:18
109.7 none succeeded 0/0 N/A N/A Tue Jun 30 2020 04:08:08 GMT+0000 (UTC) 00:22:02
109.8 none succeeded 0/0 N/A N/A Tue Jun 30 2020 04:08:08 GMT+0000 (UTC) 00:23:99
109.9 none succeeded 0/0 N/A N/A Tue Jun 30 2020 04:08:08 GMT+0000 (UTC) 01:30:14
109.10 none succeeded 0/0 N/A N/A Tue Jun 30 2020 04:08:08 GMT+0000 (UTC) 00:26:42


Need help with Shippable? File an Issue


[ master ] Build TIMEOUT for zephyrproject-rtos/ci-test ( ci: Update sdk to 0.11.3 Update sdk to 0.11.3 release and update docker image to get that SDK version. Signed-off-by: Kumar Gala <kumar.gala@linaro.org> ) on Shippable.com #builds

Shippable.com <noreply@...>
 

SHIPPABLE BUILD REPORT

3534
ci-test
Branch : master Sha : 5f9e0cfc3c
Builder : Kumar Gala Triggered By : Kumar Gala
Custom Environment Variables:
JOB_TRIGGERED_BY_NAME="daily-verify"
JOB_TRIGGERED_BY_ID="23790"
# Runtime Status Tests Branch Coverage Sequence Coverage Triggered at Duration
3534.1 none succeeded 1483/1709 N/A N/A Mon Jun 29 2020 02:05:32 GMT+0000 (UTC) 02:04:35
3534.2 none failed 843/1709 N/A N/A Mon Jun 29 2020 02:05:33 GMT+0000 (UTC) 01:78:09
3534.3 none timeout 0/0 N/A N/A Mon Jun 29 2020 02:05:33 GMT+0000 (UTC) 02:21:72
3534.4 none timeout 0/0 N/A N/A Mon Jun 29 2020 02:05:33 GMT+0000 (UTC) 02:21:71
3534.5 none succeeded 1701/1708 N/A N/A Mon Jun 29 2020 02:05:33 GMT+0000 (UTC) 02:12:27
3534.6 none timeout 0/0 N/A N/A Mon Jun 29 2020 02:05:33 GMT+0000 (UTC) 02:21:70
3534.7 none succeeded 1196/1708 N/A N/A Mon Jun 29 2020 02:05:33 GMT+0000 (UTC) 02:08:92
3534.8 none failed 924/1708 N/A N/A Mon Jun 29 2020 02:05:33 GMT+0000 (UTC) 01:83:58
3534.9 none failed 1475/1708 N/A N/A Mon Jun 29 2020 02:05:33 GMT+0000 (UTC) 02:20:18
3534.10 none timeout 1452/1708 N/A N/A Mon Jun 29 2020 02:05:33 GMT+0000 (UTC) 02:21:68
3534.11 none timeout 0/0 N/A N/A Mon Jun 29 2020 02:05:33 GMT+0000 (UTC) 02:21:68
3534.12 none timeout 0/0 N/A N/A Mon Jun 29 2020 02:05:33 GMT+0000 (UTC) 02:21:67
3534.13 none succeeded 1375/1708 N/A N/A Mon Jun 29 2020 02:05:33 GMT+0000 (UTC) 02:17:19
3534.14 none succeeded 1304/1708 N/A N/A Mon Jun 29 2020 02:05:33 GMT+0000 (UTC) 02:12:49
3534.15 none succeeded 1125/1708 N/A N/A Mon Jun 29 2020 02:05:33 GMT+0000 (UTC) 02:91:40
3534.16 none failed 1427/1708 N/A N/A Mon Jun 29 2020 02:05:33 GMT+0000 (UTC) 02:15:92
3534.17 none succeeded 1207/1708 N/A N/A Mon Jun 29 2020 02:05:33 GMT+0000 (UTC) 02:07:99
3534.18 none succeeded 1683/1708 N/A N/A Mon Jun 29 2020 02:05:34 GMT+0000 (UTC) 02:15:21
3534.19 none succeeded 1181/1708 N/A N/A Mon Jun 29 2020 02:05:34 GMT+0000 (UTC) 02:92:35
3534.20 none succeeded 1677/1708 N/A N/A Mon Jun 29 2020 02:05:34 GMT+0000 (UTC) 02:15:79
3534.21 none timeout 0/0 N/A N/A Mon Jun 29 2020 02:05:34 GMT+0000 (UTC) 02:24:23
3534.22 none succeeded 1282/1708 N/A N/A Mon Jun 29 2020 02:05:34 GMT+0000 (UTC) 02:14:51
3534.23 none succeeded 1275/1708 N/A N/A Mon Jun 29 2020 02:05:34 GMT+0000 (UTC) 02:06:57
3534.24 none succeeded 1337/1708 N/A N/A Mon Jun 29 2020 02:05:34 GMT+0000 (UTC) 02:17:04
3534.25 none timeout 0/0 N/A N/A Mon Jun 29 2020 02:05:34 GMT+0000 (UTC) 02:23:65
3534.26 none timeout 0/0 N/A N/A Mon Jun 29 2020 02:05:34 GMT+0000 (UTC) 02:20:28
3534.27 none succeeded 1101/1708 N/A N/A Mon Jun 29 2020 02:05:34 GMT+0000 (UTC) 02:06:86
3534.28 none timeout 0/0 N/A N/A Mon Jun 29 2020 02:05:34 GMT+0000 (UTC) 02:20:06
3534.29 none succeeded 1411/1708 N/A N/A Mon Jun 29 2020 02:05:34 GMT+0000 (UTC) 02:01:40
3534.30 none timeout 0/0 N/A N/A Mon Jun 29 2020 02:05:34 GMT+0000 (UTC) 02:23:01
3534.31 none timeout 0/0 N/A N/A Mon Jun 29 2020 02:05:34 GMT+0000 (UTC) 02:22:41
3534.32 none timeout 0/0 N/A N/A Mon Jun 29 2020 02:05:34 GMT+0000 (UTC) 02:20:22
3534.33 none timeout 0/0 N/A N/A Mon Jun 29 2020 02:05:34 GMT+0000 (UTC) 02:24:62
3534.34 none succeeded 1698/1708 N/A N/A Mon Jun 29 2020 02:05:35 GMT+0000 (UTC) 02:19:20
3534.35 none failed 1707/1708 N/A N/A Mon Jun 29 2020 02:05:35 GMT+0000 (UTC) 02:05:11


Need help with Shippable? File an Issue


[ master ] Build FAILED for zephyrproject-rtos/test_results ( zephyr-v2.3.0-618-ga53c813ac5: stm32 results Non reg result analysis on last run: (verdicts: T/p: Passed, F/f: Failed, t:timeout) samples/subsys/nvs/sample.nvs.basic, disco_l475_iot1 (instable: pttpttptttpttpttt) tests/kernel/mem_protect/userspace/kernel.memory_protection.userspace, nucleo_l4r5zi tests/kernel/timer/timer_api/kernel.timer, nucleo_f103rb tests/net/utils/net.util, nucleo_f429zi tests/net/utils/net.util, nucleo_f746zg tests/posix/common/portability.posix.common.newlib, nucleo_wb55rg Total: 18 test(s) failed out of 1799 tests run 5 regression(s) on stable test Signed-off-by: Erwan Gouriou <erwan.gouriou@linaro.org> ) on Shippable.com #builds

Shippable.com <noreply@...>
 

SHIPPABLE BUILD REPORT

108
test_results
Branch : master Sha : e88bee4aa8
Builder : Erwan Gouriou Triggered By : Anas Nashif
Custom Environment Variables:
JOB_TRIGGERED_BY_NAME="create_test_commit"
JOB_TRIGGERED_BY_ID="125148"
# Runtime Status Tests Branch Coverage Sequence Coverage Triggered at Duration
108.1 none succeeded 0/0 N/A N/A Mon Jun 29 2020 04:06:23 GMT+0000 (UTC) 00:22:33
108.2 none succeeded 0/0 N/A N/A Mon Jun 29 2020 04:06:23 GMT+0000 (UTC) 00:18:70
108.3 none succeeded 0/0 N/A N/A Mon Jun 29 2020 04:06:23 GMT+0000 (UTC) 00:22:37
108.4 none succeeded 0/0 N/A N/A Mon Jun 29 2020 04:06:23 GMT+0000 (UTC) 00:23:02
108.5 none succeeded 0/0 N/A N/A Mon Jun 29 2020 04:06:23 GMT+0000 (UTC) 00:25:79
108.6 none succeeded 0/0 N/A N/A Mon Jun 29 2020 04:06:23 GMT+0000 (UTC) 00:20:09
108.7 none failed 0/0 N/A N/A Mon Jun 29 2020 04:06:23 GMT+0000 (UTC) 00:27:47
108.8 none succeeded 0/0 N/A N/A Mon Jun 29 2020 04:06:23 GMT+0000 (UTC) 00:23:98
108.9 none succeeded 0/0 N/A N/A Mon Jun 29 2020 04:06:23 GMT+0000 (UTC) 01:31:51
108.10 none succeeded 0/0 N/A N/A Mon Jun 29 2020 04:06:23 GMT+0000 (UTC) 00:28:65


Need help with Shippable? File an Issue


[ master ] Build TIMEOUT for zephyrproject-rtos/ci-test ( ci: Update sdk to 0.11.3 Update sdk to 0.11.3 release and update docker image to get that SDK version. Signed-off-by: Kumar Gala <kumar.gala@linaro.org> ) on Shippable.com #builds

Shippable.com <noreply@...>
 

SHIPPABLE BUILD REPORT

3533
ci-test
Branch : master Sha : 5f9e0cfc3c
Builder : Kumar Gala Triggered By : Kumar Gala
Custom Environment Variables:
JOB_TRIGGERED_BY_NAME="daily-verify"
JOB_TRIGGERED_BY_ID="23790"
# Runtime Status Tests Branch Coverage Sequence Coverage Triggered at Duration
3533.1 none succeeded 1483/1709 N/A N/A Sun Jun 28 2020 02:06:00 GMT+0000 (UTC) 02:04:25
3533.2 none failed 843/1709 N/A N/A Sun Jun 28 2020 02:06:00 GMT+0000 (UTC) 01:72:46
3533.3 none timeout 0/0 N/A N/A Sun Jun 28 2020 02:06:00 GMT+0000 (UTC) 02:25:97
3533.4 none timeout 0/0 N/A N/A Sun Jun 28 2020 02:06:00 GMT+0000 (UTC) 02:25:96
3533.5 none succeeded 1701/1708 N/A N/A Sun Jun 28 2020 02:06:00 GMT+0000 (UTC) 02:09:62
3533.6 none succeeded 1706/1708 N/A N/A Sun Jun 28 2020 02:06:00 GMT+0000 (UTC) 02:23:61
3533.7 none succeeded 1196/1708 N/A N/A Sun Jun 28 2020 02:06:00 GMT+0000 (UTC) 02:18:89
3533.8 none failed 924/1708 N/A N/A Sun Jun 28 2020 02:06:00 GMT+0000 (UTC) 01:83:55
3533.9 none failed 1475/1708 N/A N/A Sun Jun 28 2020 02:06:00 GMT+0000 (UTC) 02:20:23
3533.10 none timeout 1452/1708 N/A N/A Sun Jun 28 2020 02:06:00 GMT+0000 (UTC) 02:25:93
3533.11 none timeout 0/0 N/A N/A Sun Jun 28 2020 02:06:01 GMT+0000 (UTC) 02:25:92
3533.12 none timeout 0/0 N/A N/A Sun Jun 28 2020 02:06:01 GMT+0000 (UTC) 02:25:92
3533.13 none succeeded 1375/1708 N/A N/A Sun Jun 28 2020 02:06:01 GMT+0000 (UTC) 02:21:54
3533.14 none succeeded 1304/1708 N/A N/A Sun Jun 28 2020 02:06:01 GMT+0000 (UTC) 02:16:44
3533.15 none succeeded 1125/1708 N/A N/A Sun Jun 28 2020 02:06:01 GMT+0000 (UTC) 02:99:42
3533.16 none timeout 0/0 N/A N/A Sun Jun 28 2020 02:06:01 GMT+0000 (UTC) 02:25:90
3533.17 none succeeded 1207/1708 N/A N/A Sun Jun 28 2020 02:06:01 GMT+0000 (UTC) 02:14:32
3533.18 none succeeded 1683/1708 N/A N/A Sun Jun 28 2020 02:06:01 GMT+0000 (UTC) 02:19:14
3533.19 none succeeded 1181/1708 N/A N/A Sun Jun 28 2020 02:06:01 GMT+0000 (UTC) 02:96:58
3533.20 none succeeded 1677/1708 N/A N/A Sun Jun 28 2020 02:06:01 GMT+0000 (UTC) 02:18:79
3533.21 none timeout 0/0 N/A N/A Sun Jun 28 2020 02:06:01 GMT+0000 (UTC) 02:25:87
3533.22 none succeeded 1282/1708 N/A N/A Sun Jun 28 2020 02:06:01 GMT+0000 (UTC) 02:14:63
3533.23 none succeeded 1275/1708 N/A N/A Sun Jun 28 2020 02:06:01 GMT+0000 (UTC) 02:09:35
3533.24 none succeeded 1337/1708 N/A N/A Sun Jun 28 2020 02:06:01 GMT+0000 (UTC) 02:23:83
3533.25 none timeout 0/0 N/A N/A Sun Jun 28 2020 02:06:01 GMT+0000 (UTC) 02:25:85
3533.26 none timeout 0/0 N/A N/A Sun Jun 28 2020 02:06:01 GMT+0000 (UTC) 02:25:84
3533.27 none succeeded 1101/1708 N/A N/A Sun Jun 28 2020 02:06:01 GMT+0000 (UTC) 02:09:46
3533.28 none timeout 0/0 N/A N/A Sun Jun 28 2020 02:06:01 GMT+0000 (UTC) 02:25:83
3533.29 none succeeded 1411/1708 N/A N/A Sun Jun 28 2020 02:06:01 GMT+0000 (UTC) 02:14:20
3533.30 none timeout 0/0 N/A N/A Sun Jun 28 2020 02:06:02 GMT+0000 (UTC) 02:25:82
3533.31 none timeout 0/0 N/A N/A Sun Jun 28 2020 02:06:02 GMT+0000 (UTC) 02:23:52
3533.32 none timeout 0/0 N/A N/A Sun Jun 28 2020 02:06:02 GMT+0000 (UTC) 02:22:36
3533.33 none timeout 0/0 N/A N/A Sun Jun 28 2020 02:06:02 GMT+0000 (UTC) 02:24:31
3533.34 none timeout 0/0 N/A N/A Sun Jun 28 2020 02:06:02 GMT+0000 (UTC) 02:21:50
3533.35 none failed 1707/1708 N/A N/A Sun Jun 28 2020 02:06:02 GMT+0000 (UTC) 02:16:56


Need help with Shippable? File an Issue


[ master ] Build SUCCEEDED for zephyrproject-rtos/test_results ( zephyr-v2.3.0-618-ga53c813ac5: stm32 results Non reg result analysis on last run: (verdicts: T/p: Passed, F/f: Failed, t:timeout) samples/subsys/nvs/sample.nvs.basic, disco_l475_iot1 (instable: pttpttptttpttpttt) tests/kernel/mem_protect/userspace/kernel.memory_protection.userspace, nucleo_l4r5zi tests/kernel/timer/timer_api/kernel.timer, nucleo_f103rb tests/net/utils/net.util, nucleo_f429zi tests/net/utils/net.util, nucleo_f746zg tests/posix/common/portability.posix.common.newlib, nucleo_wb55rg Total: 18 test(s) failed out of 1799 tests run 5 regression(s) on stable test Signed-off-by: Erwan Gouriou <erwan.gouriou@linaro.org> ) on Shippable.com #builds

Shippable.com <noreply@...>
 

SHIPPABLE BUILD REPORT

107
test_results
Branch : master Sha : e88bee4aa8
Builder : Erwan Gouriou Triggered By : Anas Nashif
Custom Environment Variables:
JOB_TRIGGERED_BY_NAME="create_test_commit"
JOB_TRIGGERED_BY_ID="125148"
# Runtime Status Tests Branch Coverage Sequence Coverage Triggered at Duration
107.1 none succeeded 0/0 N/A N/A Sun Jun 28 2020 04:07:34 GMT+0000 (UTC) 00:23:57
107.2 none succeeded 0/0 N/A N/A Sun Jun 28 2020 04:07:34 GMT+0000 (UTC) 00:18:58
107.3 none succeeded 0/0 N/A N/A Sun Jun 28 2020 04:07:34 GMT+0000 (UTC) 00:20:02
107.4 none succeeded 0/0 N/A N/A Sun Jun 28 2020 04:07:34 GMT+0000 (UTC) 00:22:17
107.5 none succeeded 0/0 N/A N/A Sun Jun 28 2020 04:07:34 GMT+0000 (UTC) 00:23:83
107.6 none succeeded 0/0 N/A N/A Sun Jun 28 2020 04:07:34 GMT+0000 (UTC) 00:23:90
107.7 none succeeded 0/0 N/A N/A Sun Jun 28 2020 04:07:34 GMT+0000 (UTC) 00:28:91
107.8 none succeeded 0/0 N/A N/A Sun Jun 28 2020 04:07:34 GMT+0000 (UTC) 00:26:62
107.9 none succeeded 0/0 N/A N/A Sun Jun 28 2020 04:07:34 GMT+0000 (UTC) 01:34:56
107.10 none succeeded 0/0 N/A N/A Sun Jun 28 2020 04:07:35 GMT+0000 (UTC) 01:31:45


Need help with Shippable? File an Issue


[ master ] Build TIMEOUT for zephyrproject-rtos/ci-test ( ci: Update sdk to 0.11.3 Update sdk to 0.11.3 release and update docker image to get that SDK version. Signed-off-by: Kumar Gala <kumar.gala@linaro.org> ) on Shippable.com #builds

Shippable.com <noreply@...>
 

SHIPPABLE BUILD REPORT

3532
ci-test
Branch : master Sha : 5f9e0cfc3c
Builder : Kumar Gala Triggered By : Kumar Gala
Custom Environment Variables:
JOB_TRIGGERED_BY_NAME="daily-verify"
JOB_TRIGGERED_BY_ID="23790"
# Runtime Status Tests Branch Coverage Sequence Coverage Triggered at Duration
3532.1 none succeeded 1483/1709 N/A N/A Sat Jun 27 2020 02:05:15 GMT+0000 (UTC) 02:05:00
3532.2 none failed 843/1709 N/A N/A Sat Jun 27 2020 02:05:15 GMT+0000 (UTC) 01:79:44
3532.3 none timeout 0/0 N/A N/A Sat Jun 27 2020 02:05:15 GMT+0000 (UTC) 02:21:42
3532.4 none timeout 0/0 N/A N/A Sat Jun 27 2020 02:05:15 GMT+0000 (UTC) 02:21:42
3532.5 none succeeded 1701/1708 N/A N/A Sat Jun 27 2020 02:05:15 GMT+0000 (UTC) 02:09:37
3532.6 none timeout 1706/1708 N/A N/A Sat Jun 27 2020 02:05:15 GMT+0000 (UTC) 02:21:41
3532.7 none succeeded 1196/1708 N/A N/A Sat Jun 27 2020 02:05:15 GMT+0000 (UTC) 02:19:29
3532.8 none failed 924/1708 N/A N/A Sat Jun 27 2020 02:05:15 GMT+0000 (UTC) 01:83:60
3532.9 none failed 1475/1708 N/A N/A Sat Jun 27 2020 02:05:15 GMT+0000 (UTC) 02:20:13
3532.10 none timeout 0/0 N/A N/A Sat Jun 27 2020 02:05:15 GMT+0000 (UTC) 02:21:39
3532.11 none timeout 0/0 N/A N/A Sat Jun 27 2020 02:05:15 GMT+0000 (UTC) 02:21:38
3532.12 none timeout 0/0 N/A N/A Sat Jun 27 2020 02:05:15 GMT+0000 (UTC) 02:21:38
3532.13 none succeeded 1375/1708 N/A N/A Sat Jun 27 2020 02:05:15 GMT+0000 (UTC) 02:16:68
3532.14 none succeeded 1304/1708 N/A N/A Sat Jun 27 2020 02:05:16 GMT+0000 (UTC) 02:15:06
3532.15 none succeeded 1125/1708 N/A N/A Sat Jun 27 2020 02:05:16 GMT+0000 (UTC) 02:90:01
3532.16 none timeout 1427/1708 N/A N/A Sat Jun 27 2020 02:05:16 GMT+0000 (UTC) 02:21:35
3532.17 none succeeded 1207/1708 N/A N/A Sat Jun 27 2020 02:05:16 GMT+0000 (UTC) 02:10:96
3532.18 none succeeded 1683/1708 N/A N/A Sat Jun 27 2020 02:05:16 GMT+0000 (UTC) 02:19:58
3532.19 none succeeded 1181/1708 N/A N/A Sat Jun 27 2020 02:05:16 GMT+0000 (UTC) 02:03:64
3532.20 none succeeded 1677/1708 N/A N/A Sat Jun 27 2020 02:05:16 GMT+0000 (UTC) 02:21:32
3532.21 none timeout 0/0 N/A N/A Sat Jun 27 2020 02:05:16 GMT+0000 (UTC) 02:21:33
3532.22 none succeeded 1282/1708 N/A N/A Sat Jun 27 2020 02:05:16 GMT+0000 (UTC) 02:16:41
3532.23 none succeeded 1275/1708 N/A N/A Sat Jun 27 2020 02:05:16 GMT+0000 (UTC) 02:14:22
3532.24 none succeeded 1337/1708 N/A N/A Sat Jun 27 2020 02:05:16 GMT+0000 (UTC) 02:17:23
3532.25 none timeout 0/0 N/A N/A Sat Jun 27 2020 02:05:16 GMT+0000 (UTC) 02:21:31
3532.26 none timeout 0/0 N/A N/A Sat Jun 27 2020 02:05:16 GMT+0000 (UTC) 02:21:30
3532.27 none succeeded 1101/1708 N/A N/A Sat Jun 27 2020 02:05:16 GMT+0000 (UTC) 02:09:25
3532.28 none timeout 0/0 N/A N/A Sat Jun 27 2020 02:05:16 GMT+0000 (UTC) 02:20:29
3532.29 none succeeded 1411/1708 N/A N/A Sat Jun 27 2020 02:05:17 GMT+0000 (UTC) 02:07:97
3532.30 none timeout 0/0 N/A N/A Sat Jun 27 2020 02:05:17 GMT+0000 (UTC) 02:20:28
3532.31 none timeout 0/0 N/A N/A Sat Jun 27 2020 02:05:17 GMT+0000 (UTC) 02:22:97
3532.32 none timeout 0/0 N/A N/A Sat Jun 27 2020 02:05:17 GMT+0000 (UTC) 02:23:79
3532.33 none timeout 0/0 N/A N/A Sat Jun 27 2020 02:05:17 GMT+0000 (UTC) 02:21:36
3532.34 none timeout 0/0 N/A N/A Sat Jun 27 2020 02:05:17 GMT+0000 (UTC) 02:23:71
3532.35 none failed 1707/1708 N/A N/A Sat Jun 27 2020 02:05:17 GMT+0000 (UTC) 02:18:50


Need help with Shippable? File an Issue


[ master ] Build FAILED for zephyrproject-rtos/test_results ( zephyr-v2.3.0-618-ga53c813ac5: stm32 results Non reg result analysis on last run: (verdicts: T/p: Passed, F/f: Failed, t:timeout) samples/subsys/nvs/sample.nvs.basic, disco_l475_iot1 (instable: pttpttptttpttpttt) tests/kernel/mem_protect/userspace/kernel.memory_protection.userspace, nucleo_l4r5zi tests/kernel/timer/timer_api/kernel.timer, nucleo_f103rb tests/net/utils/net.util, nucleo_f429zi tests/net/utils/net.util, nucleo_f746zg tests/posix/common/portability.posix.common.newlib, nucleo_wb55rg Total: 18 test(s) failed out of 1799 tests run 5 regression(s) on stable test Signed-off-by: Erwan Gouriou <erwan.gouriou@linaro.org> ) on Shippable.com #builds

Shippable.com <noreply@...>
 

SHIPPABLE BUILD REPORT

106
test_results
Branch : master Sha : e88bee4aa8
Builder : Erwan Gouriou Triggered By : Anas Nashif
Custom Environment Variables:
JOB_TRIGGERED_BY_NAME="create_test_commit"
JOB_TRIGGERED_BY_ID="125148"
# Runtime Status Tests Branch Coverage Sequence Coverage Triggered at Duration
106.1 none succeeded 0/0 N/A N/A Sat Jun 27 2020 04:06:50 GMT+0000 (UTC) 00:22:37
106.2 none succeeded 0/0 N/A N/A Sat Jun 27 2020 04:06:50 GMT+0000 (UTC) 00:19:18
106.3 none succeeded 0/0 N/A N/A Sat Jun 27 2020 04:06:50 GMT+0000 (UTC) 00:17:26
106.4 none succeeded 0/0 N/A N/A Sat Jun 27 2020 04:06:50 GMT+0000 (UTC) 00:19:13
106.5 none succeeded 0/0 N/A N/A Sat Jun 27 2020 04:06:50 GMT+0000 (UTC) 00:18:75
106.6 none succeeded 0/0 N/A N/A Sat Jun 27 2020 04:06:50 GMT+0000 (UTC) 00:17:08
106.7 none failed 0/0 N/A N/A Sat Jun 27 2020 04:06:50 GMT+0000 (UTC) 00:25:84
106.8 none succeeded 0/0 N/A N/A Sat Jun 27 2020 04:06:50 GMT+0000 (UTC) 00:21:72
106.9 none succeeded 0/0 N/A N/A Sat Jun 27 2020 04:06:50 GMT+0000 (UTC) 00:28:94
106.10 none succeeded 0/0 N/A N/A Sat Jun 27 2020 04:06:50 GMT+0000 (UTC) 00:24:64


Need help with Shippable? File an Issue