Date   

[ master ] Build FAILED for zephyrproject-rtos/test_results ( tests: reel board test results Testing CI system, run tests on hardware reel board v1 Signed-off-by: Maksim Masalski <maksim.masalski@intel.com> ) on Shippable.com #builds

Shippable.com <noreply@...>
 

SHIPPABLE BUILD REPORT

78
test_results
Branch : master Sha : a145b3b290
Builder : Maksim Masalski Triggered By : Anas Nashif
Custom Environment Variables:
JOB_TRIGGERED_BY_NAME="create_test_commit"
JOB_TRIGGERED_BY_ID="125148"
# Runtime Status Tests Branch Coverage Sequence Coverage Triggered at Duration
78.1 none succeeded 838/971 N/A N/A Thu Jun 04 2020 04:07:18 GMT+0000 (UTC) 01:48:02
78.2 none unstable 1654/2274 N/A N/A Thu Jun 04 2020 04:07:18 GMT+0000 (UTC) 01:56:55
78.3 none failed 2866/4786 N/A N/A Thu Jun 04 2020 04:07:18 GMT+0000 (UTC) 04:31:61
78.4 none failed 5581/6130 N/A N/A Thu Jun 04 2020 04:07:18 GMT+0000 (UTC) 04:69:68
78.5 none succeeded 5900/5946 N/A N/A Thu Jun 04 2020 04:07:18 GMT+0000 (UTC) 01:87:96


Need help with Shippable? File an Issue


[ master ] Build TIMEOUT for zephyrproject-rtos/ci-test ( ci: Update sdk to 0.11.3 Update sdk to 0.11.3 release and update docker image to get that SDK version. Signed-off-by: Kumar Gala <kumar.gala@linaro.org> ) on Shippable.com #builds

Shippable.com <noreply@...>
 

SHIPPABLE BUILD REPORT

3509
ci-test
Branch : master Sha : 5f9e0cfc3c
Builder : Kumar Gala Triggered By : Kumar Gala
Custom Environment Variables:
JOB_TRIGGERED_BY_NAME="daily-verify"
JOB_TRIGGERED_BY_ID="23790"
# Runtime Status Tests Branch Coverage Sequence Coverage Triggered at Duration
3509.1 none succeeded 1367/1585 N/A N/A Thu Jun 04 2020 02:05:22 GMT+0000 (UTC) 01:85:23
3509.2 none succeeded 912/1585 N/A N/A Thu Jun 04 2020 02:05:22 GMT+0000 (UTC) 01:73:09
3509.3 none timeout 0/0 N/A N/A Thu Jun 04 2020 02:05:22 GMT+0000 (UTC) 02:25:74
3509.4 none timeout 0/0 N/A N/A Thu Jun 04 2020 02:05:22 GMT+0000 (UTC) 02:25:74
3509.5 none succeeded 1578/1585 N/A N/A Thu Jun 04 2020 02:05:22 GMT+0000 (UTC) 02:98:82
3509.6 none succeeded 1583/1585 N/A N/A Thu Jun 04 2020 02:05:23 GMT+0000 (UTC) 02:06:33
3509.7 none succeeded 1186/1585 N/A N/A Thu Jun 04 2020 02:05:23 GMT+0000 (UTC) 02:00:75
3509.8 none succeeded 787/1585 N/A N/A Thu Jun 04 2020 02:05:23 GMT+0000 (UTC) 01:67:11
3509.9 none succeeded 1344/1585 N/A N/A Thu Jun 04 2020 02:05:23 GMT+0000 (UTC) 02:98:82
3509.10 none succeeded 1400/1585 N/A N/A Thu Jun 04 2020 02:05:23 GMT+0000 (UTC) 02:04:30
3509.11 none succeeded 1452/1585 N/A N/A Thu Jun 04 2020 02:05:23 GMT+0000 (UTC) 02:07:14
3509.12 none succeeded 1432/1585 N/A N/A Thu Jun 04 2020 02:05:23 GMT+0000 (UTC) 02:18:67
3509.13 none succeeded 1283/1585 N/A N/A Thu Jun 04 2020 02:05:23 GMT+0000 (UTC) 01:88:74
3509.14 none succeeded 1177/1585 N/A N/A Thu Jun 04 2020 02:05:23 GMT+0000 (UTC) 02:99:48
3509.15 none succeeded 1044/1585 N/A N/A Thu Jun 04 2020 02:05:23 GMT+0000 (UTC) 02:91:47
3509.16 none succeeded 1274/1585 N/A N/A Thu Jun 04 2020 02:05:23 GMT+0000 (UTC) 02:91:65
3509.17 none succeeded 1095/1585 N/A N/A Thu Jun 04 2020 02:05:23 GMT+0000 (UTC) 02:92:32
3509.18 none succeeded 1540/1585 N/A N/A Thu Jun 04 2020 02:05:23 GMT+0000 (UTC) 02:99:33
3509.19 none succeeded 1082/1585 N/A N/A Thu Jun 04 2020 02:05:23 GMT+0000 (UTC) 01:82:93
3509.20 none succeeded 1585/1585 N/A N/A Thu Jun 04 2020 02:05:23 GMT+0000 (UTC) 02:01:57
3509.21 none succeeded 1533/1585 N/A N/A Thu Jun 04 2020 02:05:23 GMT+0000 (UTC) 02:06:59
3509.22 none succeeded 1089/1585 N/A N/A Thu Jun 04 2020 02:05:24 GMT+0000 (UTC) 02:93:03
3509.23 none succeeded 1255/1585 N/A N/A Thu Jun 04 2020 02:05:24 GMT+0000 (UTC) 02:94:23
3509.24 none succeeded 1264/1585 N/A N/A Thu Jun 04 2020 02:05:24 GMT+0000 (UTC) 02:98:68
3509.25 none succeeded 1574/1584 N/A N/A Thu Jun 04 2020 02:05:24 GMT+0000 (UTC) 02:20:88
3509.26 none timeout 1568/1584 N/A N/A Thu Jun 04 2020 02:05:24 GMT+0000 (UTC) 02:24:63
3509.27 none succeeded 991/1584 N/A N/A Thu Jun 04 2020 02:05:24 GMT+0000 (UTC) 01:81:32
3509.28 none succeeded 1355/1584 N/A N/A Thu Jun 04 2020 02:05:24 GMT+0000 (UTC) 02:99:18
3509.29 none succeeded 1299/1584 N/A N/A Thu Jun 04 2020 02:05:24 GMT+0000 (UTC) 01:88:95
3509.30 none succeeded 1576/1584 N/A N/A Thu Jun 04 2020 02:05:24 GMT+0000 (UTC) 02:06:54
3509.31 none succeeded 1575/1584 N/A N/A Thu Jun 04 2020 02:05:24 GMT+0000 (UTC) 02:08:09
3509.32 none timeout 0/0 N/A N/A Thu Jun 04 2020 02:05:24 GMT+0000 (UTC) 02:21:36
3509.33 none timeout 0/0 N/A N/A Thu Jun 04 2020 02:05:24 GMT+0000 (UTC) 02:23:67
3509.34 none succeeded 1575/1584 N/A N/A Thu Jun 04 2020 02:05:24 GMT+0000 (UTC) 02:01:75
3509.35 none succeeded 1584/1584 N/A N/A Thu Jun 04 2020 02:05:24 GMT+0000 (UTC) 02:98:73


Need help with Shippable? File an Issue


[ master ] Build FAILED for zephyrproject-rtos/test_results ( tests: reel board test results Testing CI system, run tests on hardware reel board v1 Signed-off-by: Maksim Masalski <maksim.masalski@intel.com> ) on Shippable.com #builds

Shippable.com <noreply@...>
 

SHIPPABLE BUILD REPORT

77
test_results
Branch : master Sha : a145b3b290
Builder : Maksim Masalski Triggered By : Anas Nashif
Custom Environment Variables:
JOB_TRIGGERED_BY_NAME="create_test_commit"
JOB_TRIGGERED_BY_ID="125148"
# Runtime Status Tests Branch Coverage Sequence Coverage Triggered at Duration
77.1 none succeeded 838/971 N/A N/A Wed Jun 03 2020 04:06:14 GMT+0000 (UTC) 01:49:60
77.2 none unstable 1654/2274 N/A N/A Wed Jun 03 2020 04:06:14 GMT+0000 (UTC) 01:56:32
77.3 none failed 2868/4778 N/A N/A Wed Jun 03 2020 04:06:14 GMT+0000 (UTC) 04:29:24
77.4 none unstable 5581/6130 N/A N/A Wed Jun 03 2020 04:06:14 GMT+0000 (UTC) 01:79:15
77.5 none succeeded 5896/5941 N/A N/A Wed Jun 03 2020 04:06:14 GMT+0000 (UTC) 01:86:75


Need help with Shippable? File an Issue


[ master ] Build TIMEOUT for zephyrproject-rtos/ci-test ( ci: Update sdk to 0.11.3 Update sdk to 0.11.3 release and update docker image to get that SDK version. Signed-off-by: Kumar Gala <kumar.gala@linaro.org> ) on Shippable.com #builds

Shippable.com <noreply@...>
 

SHIPPABLE BUILD REPORT

3508
ci-test
Branch : master Sha : 5f9e0cfc3c
Builder : Kumar Gala Triggered By : Kumar Gala
Custom Environment Variables:
JOB_TRIGGERED_BY_NAME="daily-verify"
JOB_TRIGGERED_BY_ID="23790"
# Runtime Status Tests Branch Coverage Sequence Coverage Triggered at Duration
3508.1 none succeeded 1367/1585 N/A N/A Wed Jun 03 2020 02:05:45 GMT+0000 (UTC) 01:89:44
3508.2 none succeeded 912/1585 N/A N/A Wed Jun 03 2020 02:05:45 GMT+0000 (UTC) 01:74:30
3508.3 none timeout 0/0 N/A N/A Wed Jun 03 2020 02:05:46 GMT+0000 (UTC) 02:24:23
3508.4 none timeout 0/0 N/A N/A Wed Jun 03 2020 02:05:46 GMT+0000 (UTC) 02:24:23
3508.5 none succeeded 1578/1585 N/A N/A Wed Jun 03 2020 02:05:46 GMT+0000 (UTC) 02:95:98
3508.6 none succeeded 1583/1585 N/A N/A Wed Jun 03 2020 02:05:46 GMT+0000 (UTC) 02:03:75
3508.7 none succeeded 1186/1585 N/A N/A Wed Jun 03 2020 02:05:46 GMT+0000 (UTC) 02:96:74
3508.8 none succeeded 787/1585 N/A N/A Wed Jun 03 2020 02:05:46 GMT+0000 (UTC) 01:66:58
3508.9 none succeeded 1344/1585 N/A N/A Wed Jun 03 2020 02:05:46 GMT+0000 (UTC) 02:98:06
3508.10 none succeeded 1400/1585 N/A N/A Wed Jun 03 2020 02:05:46 GMT+0000 (UTC) 02:07:96
3508.11 none succeeded 1452/1585 N/A N/A Wed Jun 03 2020 02:05:46 GMT+0000 (UTC) 02:06:46
3508.12 none succeeded 1432/1585 N/A N/A Wed Jun 03 2020 02:05:46 GMT+0000 (UTC) 02:20:76
3508.13 none succeeded 1283/1585 N/A N/A Wed Jun 03 2020 02:05:46 GMT+0000 (UTC) 01:89:37
3508.14 none succeeded 1177/1585 N/A N/A Wed Jun 03 2020 02:05:46 GMT+0000 (UTC) 02:98:98
3508.15 none succeeded 1044/1585 N/A N/A Wed Jun 03 2020 02:05:46 GMT+0000 (UTC) 02:95:82
3508.16 none succeeded 1274/1585 N/A N/A Wed Jun 03 2020 02:05:46 GMT+0000 (UTC) 02:92:97
3508.17 none succeeded 1095/1585 N/A N/A Wed Jun 03 2020 02:05:46 GMT+0000 (UTC) 02:95:73
3508.18 none succeeded 1540/1585 N/A N/A Wed Jun 03 2020 02:05:46 GMT+0000 (UTC) 02:99:56
3508.19 none succeeded 1082/1585 N/A N/A Wed Jun 03 2020 02:05:47 GMT+0000 (UTC) 01:81:83
3508.20 none succeeded 1585/1585 N/A N/A Wed Jun 03 2020 02:05:47 GMT+0000 (UTC) 02:01:41
3508.21 none succeeded 1533/1585 N/A N/A Wed Jun 03 2020 02:05:47 GMT+0000 (UTC) 02:07:15
3508.22 none succeeded 1089/1585 N/A N/A Wed Jun 03 2020 02:05:47 GMT+0000 (UTC) 02:93:91
3508.23 none succeeded 1255/1585 N/A N/A Wed Jun 03 2020 02:05:47 GMT+0000 (UTC) 02:92:38
3508.24 none succeeded 1264/1585 N/A N/A Wed Jun 03 2020 02:05:47 GMT+0000 (UTC) 02:98:82
3508.25 none succeeded 1574/1584 N/A N/A Wed Jun 03 2020 02:05:47 GMT+0000 (UTC) 02:21:57
3508.26 none succeeded 1568/1584 N/A N/A Wed Jun 03 2020 02:05:47 GMT+0000 (UTC) 02:18:09
3508.27 none succeeded 991/1584 N/A N/A Wed Jun 03 2020 02:05:47 GMT+0000 (UTC) 01:81:80
3508.28 none succeeded 1355/1584 N/A N/A Wed Jun 03 2020 02:05:47 GMT+0000 (UTC) 02:01:44
3508.29 none succeeded 1299/1584 N/A N/A Wed Jun 03 2020 02:05:47 GMT+0000 (UTC) 01:89:61
3508.30 none succeeded 1576/1584 N/A N/A Wed Jun 03 2020 02:05:47 GMT+0000 (UTC) 02:07:30
3508.31 none succeeded 1575/1584 N/A N/A Wed Jun 03 2020 02:05:47 GMT+0000 (UTC) 02:08:83
3508.32 none timeout 0/0 N/A N/A Wed Jun 03 2020 02:05:47 GMT+0000 (UTC) 02:25:78
3508.33 none timeout 0/0 N/A N/A Wed Jun 03 2020 02:05:47 GMT+0000 (UTC) 02:22:28
3508.34 none succeeded 1575/1584 N/A N/A Wed Jun 03 2020 02:05:47 GMT+0000 (UTC) 02:03:51
3508.35 none succeeded 1584/1584 N/A N/A Wed Jun 03 2020 02:05:47 GMT+0000 (UTC) 02:97:27


Need help with Shippable? File an Issue


[ master ] Build FAILED for zephyrproject-rtos/test_results ( tests: reel board test results Testing CI system, run tests on hardware reel board v1 Signed-off-by: Maksim Masalski <maksim.masalski@intel.com> ) on Shippable.com #builds

Shippable.com <noreply@...>
 

SHIPPABLE BUILD REPORT

76
test_results
Branch : master Sha : a145b3b290
Builder : Maksim Masalski Triggered By : Anas Nashif
Custom Environment Variables:
JOB_TRIGGERED_BY_NAME="create_test_commit"
JOB_TRIGGERED_BY_ID="125148"
# Runtime Status Tests Branch Coverage Sequence Coverage Triggered at Duration
76.1 none succeeded 838/971 N/A N/A Tue Jun 02 2020 04:07:05 GMT+0000 (UTC) 01:48:04
76.2 none failed 1653/2274 N/A N/A Tue Jun 02 2020 04:07:05 GMT+0000 (UTC) 03:73:98
76.3 none unstable 2869/4778 N/A N/A Tue Jun 02 2020 04:07:05 GMT+0000 (UTC) 01:66:82
76.4 none failed 5546/6096 N/A N/A Tue Jun 02 2020 04:07:05 GMT+0000 (UTC) 05:70:00
76.5 none unstable 5894/5940 N/A N/A Tue Jun 02 2020 04:07:05 GMT+0000 (UTC) 01:87:16


Need help with Shippable? File an Issue


[ master ] Build TIMEOUT for zephyrproject-rtos/ci-test ( ci: Update sdk to 0.11.3 Update sdk to 0.11.3 release and update docker image to get that SDK version. Signed-off-by: Kumar Gala <kumar.gala@linaro.org> ) on Shippable.com #builds

Shippable.com <noreply@...>
 

SHIPPABLE BUILD REPORT

3507
ci-test
Branch : master Sha : 5f9e0cfc3c
Builder : Kumar Gala Triggered By : Kumar Gala
Custom Environment Variables:
JOB_TRIGGERED_BY_NAME="daily-verify"
JOB_TRIGGERED_BY_ID="23790"
# Runtime Status Tests Branch Coverage Sequence Coverage Triggered at Duration
3507.1 none succeeded 1367/1585 N/A N/A Tue Jun 02 2020 02:05:35 GMT+0000 (UTC) 01:90:83
3507.2 none succeeded 912/1585 N/A N/A Tue Jun 02 2020 02:05:35 GMT+0000 (UTC) 01:75:73
3507.3 none timeout 0/0 N/A N/A Tue Jun 02 2020 02:05:35 GMT+0000 (UTC) 02:24:17
3507.4 none timeout 0/0 N/A N/A Tue Jun 02 2020 02:05:35 GMT+0000 (UTC) 02:24:17
3507.5 none succeeded 1578/1585 N/A N/A Tue Jun 02 2020 02:05:35 GMT+0000 (UTC) 02:96:52
3507.6 none succeeded 1583/1585 N/A N/A Tue Jun 02 2020 02:05:35 GMT+0000 (UTC) 02:12:48
3507.7 none succeeded 1186/1585 N/A N/A Tue Jun 02 2020 02:05:35 GMT+0000 (UTC) 02:98:70
3507.8 none succeeded 787/1585 N/A N/A Tue Jun 02 2020 02:05:35 GMT+0000 (UTC) 01:65:92
3507.9 none succeeded 1344/1585 N/A N/A Tue Jun 02 2020 02:05:35 GMT+0000 (UTC) 02:98:67
3507.10 none succeeded 1400/1585 N/A N/A Tue Jun 02 2020 02:05:35 GMT+0000 (UTC) 02:03:99
3507.11 none succeeded 1452/1585 N/A N/A Tue Jun 02 2020 02:05:35 GMT+0000 (UTC) 02:10:00
3507.12 none succeeded 1432/1585 N/A N/A Tue Jun 02 2020 02:05:35 GMT+0000 (UTC) 02:14:30
3507.13 none succeeded 1283/1585 N/A N/A Tue Jun 02 2020 02:05:36 GMT+0000 (UTC) 01:87:29
3507.14 none failed 0/0 N/A N/A Tue Jun 02 2020 02:05:36 GMT+0000 (UTC) 00:06:69
3507.15 none succeeded 1044/1585 N/A N/A Tue Jun 02 2020 02:05:36 GMT+0000 (UTC) 01:88:92
3507.16 none succeeded 1274/1585 N/A N/A Tue Jun 02 2020 02:05:36 GMT+0000 (UTC) 02:91:71
3507.17 none succeeded 1095/1585 N/A N/A Tue Jun 02 2020 02:05:36 GMT+0000 (UTC) 02:93:02
3507.18 none succeeded 1540/1585 N/A N/A Tue Jun 02 2020 02:05:36 GMT+0000 (UTC) 02:99:24
3507.19 none succeeded 1082/1585 N/A N/A Tue Jun 02 2020 02:05:36 GMT+0000 (UTC) 01:81:44
3507.20 none succeeded 1585/1585 N/A N/A Tue Jun 02 2020 02:05:36 GMT+0000 (UTC) 02:02:36
3507.21 none succeeded 1533/1585 N/A N/A Tue Jun 02 2020 02:05:36 GMT+0000 (UTC) 02:02:00
3507.22 none succeeded 1089/1585 N/A N/A Tue Jun 02 2020 02:05:36 GMT+0000 (UTC) 01:90:74
3507.23 none succeeded 1255/1585 N/A N/A Tue Jun 02 2020 02:05:36 GMT+0000 (UTC) 01:87:21
3507.24 none succeeded 1264/1585 N/A N/A Tue Jun 02 2020 02:05:36 GMT+0000 (UTC) 02:92:35
3507.25 none timeout 0/0 N/A N/A Tue Jun 02 2020 02:05:36 GMT+0000 (UTC) 02:22:07
3507.26 none succeeded 1568/1584 N/A N/A Tue Jun 02 2020 02:05:36 GMT+0000 (UTC) 02:21:37
3507.27 none succeeded 991/1584 N/A N/A Tue Jun 02 2020 02:05:36 GMT+0000 (UTC) 01:81:50
3507.28 none succeeded 1355/1584 N/A N/A Tue Jun 02 2020 02:05:36 GMT+0000 (UTC) 02:97:15
3507.29 none succeeded 1299/1584 N/A N/A Tue Jun 02 2020 02:05:36 GMT+0000 (UTC) 02:93:96
3507.30 none succeeded 1576/1584 N/A N/A Tue Jun 02 2020 02:05:37 GMT+0000 (UTC) 02:09:68
3507.31 none succeeded 1575/1584 N/A N/A Tue Jun 02 2020 02:05:37 GMT+0000 (UTC) 02:07:90
3507.32 none timeout 0/0 N/A N/A Tue Jun 02 2020 02:05:37 GMT+0000 (UTC) 02:24:28
3507.33 none timeout 0/0 N/A N/A Tue Jun 02 2020 02:05:37 GMT+0000 (UTC) 02:23:59
3507.34 none succeeded 1575/1584 N/A N/A Tue Jun 02 2020 02:05:37 GMT+0000 (UTC) 02:11:57
3507.35 none succeeded 1584/1584 N/A N/A Tue Jun 02 2020 02:05:37 GMT+0000 (UTC) 02:97:46


Need help with Shippable? File an Issue


[ master ] Build FAILED for zephyrproject-rtos/test_results ( tests: reel board test results Testing CI system, run tests on hardware reel board v1 Signed-off-by: Maksim Masalski <maksim.masalski@intel.com> ) on Shippable.com #builds

Shippable.com <noreply@...>
 

SHIPPABLE BUILD REPORT

75
test_results
Branch : master Sha : a145b3b290
Builder : Maksim Masalski Triggered By : Anas Nashif
Custom Environment Variables:
JOB_TRIGGERED_BY_NAME="create_test_commit"
JOB_TRIGGERED_BY_ID="125148"
# Runtime Status Tests Branch Coverage Sequence Coverage Triggered at Duration
75.1 none succeeded 838/971 N/A N/A Mon Jun 01 2020 04:06:36 GMT+0000 (UTC) 01:50:71
75.2 none unstable 1654/2274 N/A N/A Mon Jun 01 2020 04:06:36 GMT+0000 (UTC) 01:56:39
75.3 none failed 2869/4778 N/A N/A Mon Jun 01 2020 04:06:36 GMT+0000 (UTC) 04:28:04
75.4 none unstable 5552/6102 N/A N/A Mon Jun 01 2020 04:06:36 GMT+0000 (UTC) 01:81:46
75.5 none succeeded 5895/5940 N/A N/A Mon Jun 01 2020 04:06:36 GMT+0000 (UTC) 01:88:91


Need help with Shippable? File an Issue


[ master ] Build TIMEOUT for zephyrproject-rtos/ci-test ( ci: Update sdk to 0.11.3 Update sdk to 0.11.3 release and update docker image to get that SDK version. Signed-off-by: Kumar Gala <kumar.gala@linaro.org> ) on Shippable.com #builds

Shippable.com <noreply@...>
 

SHIPPABLE BUILD REPORT

3506
ci-test
Branch : master Sha : 5f9e0cfc3c
Builder : Kumar Gala Triggered By : Kumar Gala
Custom Environment Variables:
JOB_TRIGGERED_BY_NAME="daily-verify"
JOB_TRIGGERED_BY_ID="23790"
# Runtime Status Tests Branch Coverage Sequence Coverage Triggered at Duration
3506.1 none succeeded 1367/1585 N/A N/A Mon Jun 01 2020 02:06:02 GMT+0000 (UTC) 01:87:31
3506.2 none succeeded 912/1585 N/A N/A Mon Jun 01 2020 02:06:02 GMT+0000 (UTC) 01:73:84
3506.3 none timeout 0/0 N/A N/A Mon Jun 01 2020 02:06:02 GMT+0000 (UTC) 02:23:51
3506.4 none timeout 0/0 N/A N/A Mon Jun 01 2020 02:06:02 GMT+0000 (UTC) 02:22:50
3506.5 none succeeded 1578/1585 N/A N/A Mon Jun 01 2020 02:06:02 GMT+0000 (UTC) 02:96:30
3506.6 none succeeded 1583/1585 N/A N/A Mon Jun 01 2020 02:06:02 GMT+0000 (UTC) 02:07:15
3506.7 none succeeded 1186/1585 N/A N/A Mon Jun 01 2020 02:06:02 GMT+0000 (UTC) 02:98:08
3506.8 none succeeded 787/1585 N/A N/A Mon Jun 01 2020 02:06:02 GMT+0000 (UTC) 01:65:79
3506.9 none succeeded 1344/1585 N/A N/A Mon Jun 01 2020 02:06:02 GMT+0000 (UTC) 02:99:64
3506.10 none succeeded 1400/1585 N/A N/A Mon Jun 01 2020 02:06:02 GMT+0000 (UTC) 02:12:43
3506.11 none succeeded 1452/1585 N/A N/A Mon Jun 01 2020 02:06:02 GMT+0000 (UTC) 02:08:92
3506.12 none succeeded 1432/1585 N/A N/A Mon Jun 01 2020 02:06:03 GMT+0000 (UTC) 02:12:37
3506.13 none succeeded 1283/1585 N/A N/A Mon Jun 01 2020 02:06:03 GMT+0000 (UTC) 02:91:50
3506.14 none succeeded 1177/1585 N/A N/A Mon Jun 01 2020 02:06:03 GMT+0000 (UTC) 02:99:44
3506.15 none succeeded 1044/1585 N/A N/A Mon Jun 01 2020 02:06:03 GMT+0000 (UTC) 01:89:37
3506.16 none succeeded 1274/1585 N/A N/A Mon Jun 01 2020 02:06:03 GMT+0000 (UTC) 02:92:21
3506.17 none succeeded 1095/1585 N/A N/A Mon Jun 01 2020 02:06:03 GMT+0000 (UTC) 02:94:66
3506.18 none succeeded 1540/1585 N/A N/A Mon Jun 01 2020 02:06:03 GMT+0000 (UTC) 02:01:52
3506.19 none succeeded 1082/1585 N/A N/A Mon Jun 01 2020 02:06:03 GMT+0000 (UTC) 01:83:51
3506.20 none succeeded 1585/1585 N/A N/A Mon Jun 01 2020 02:06:03 GMT+0000 (UTC) 02:01:84
3506.21 none succeeded 1533/1585 N/A N/A Mon Jun 01 2020 02:06:03 GMT+0000 (UTC) 02:07:91
3506.22 none succeeded 1089/1585 N/A N/A Mon Jun 01 2020 02:06:03 GMT+0000 (UTC) 02:94:16
3506.23 none succeeded 1255/1585 N/A N/A Mon Jun 01 2020 02:06:03 GMT+0000 (UTC) 02:92:32
3506.24 none succeeded 1264/1585 N/A N/A Mon Jun 01 2020 02:06:03 GMT+0000 (UTC) 02:96:74
3506.25 none succeeded 1574/1584 N/A N/A Mon Jun 01 2020 02:06:03 GMT+0000 (UTC) 02:19:44
3506.26 none timeout 1568/1584 N/A N/A Mon Jun 01 2020 02:06:03 GMT+0000 (UTC) 02:22:38
3506.27 none succeeded 991/1584 N/A N/A Mon Jun 01 2020 02:06:03 GMT+0000 (UTC) 01:89:36
3506.28 none succeeded 1355/1584 N/A N/A Mon Jun 01 2020 02:06:03 GMT+0000 (UTC) 02:02:39
3506.29 none succeeded 1299/1584 N/A N/A Mon Jun 01 2020 02:06:04 GMT+0000 (UTC) 02:03:72
3506.30 none succeeded 1576/1584 N/A N/A Mon Jun 01 2020 02:06:04 GMT+0000 (UTC) 02:11:35
3506.31 none succeeded 1575/1584 N/A N/A Mon Jun 01 2020 02:06:04 GMT+0000 (UTC) 02:06:81
3506.32 none timeout 0/0 N/A N/A Mon Jun 01 2020 02:06:04 GMT+0000 (UTC) 02:24:62
3506.33 none timeout 0/0 N/A N/A Mon Jun 01 2020 02:06:04 GMT+0000 (UTC) 02:24:66
3506.34 none succeeded 1575/1584 N/A N/A Mon Jun 01 2020 02:06:04 GMT+0000 (UTC) 02:04:44
3506.35 none succeeded 1584/1584 N/A N/A Mon Jun 01 2020 02:06:04 GMT+0000 (UTC) 02:98:64


Need help with Shippable? File an Issue


[ master ] Build UNSTABLE for zephyrproject-rtos/test_results ( tests: reel board test results Testing CI system, run tests on hardware reel board v1 Signed-off-by: Maksim Masalski <maksim.masalski@intel.com> ) on Shippable.com #builds

Shippable.com <noreply@...>
 

SHIPPABLE BUILD REPORT

74
test_results
Branch : master Sha : a145b3b290
Builder : Maksim Masalski Triggered By : Anas Nashif
Custom Environment Variables:
JOB_TRIGGERED_BY_NAME="create_test_commit"
JOB_TRIGGERED_BY_ID="125148"
# Runtime Status Tests Branch Coverage Sequence Coverage Triggered at Duration
74.1 none succeeded 838/971 N/A N/A Sun May 31 2020 04:06:49 GMT+0000 (UTC) 01:51:44
74.2 none unstable 1654/2274 N/A N/A Sun May 31 2020 04:06:49 GMT+0000 (UTC) 01:56:62
74.3 none unstable 2869/4778 N/A N/A Sun May 31 2020 04:06:49 GMT+0000 (UTC) 01:67:20
74.4 none unstable 5551/6102 N/A N/A Sun May 31 2020 04:06:49 GMT+0000 (UTC) 01:81:47
74.5 none unstable 5895/5941 N/A N/A Sun May 31 2020 04:06:49 GMT+0000 (UTC) 01:88:97


Need help with Shippable? File an Issue


[ master ] Build TIMEOUT for zephyrproject-rtos/ci-test ( ci: Update sdk to 0.11.3 Update sdk to 0.11.3 release and update docker image to get that SDK version. Signed-off-by: Kumar Gala <kumar.gala@linaro.org> ) on Shippable.com #builds

Shippable.com <noreply@...>
 

SHIPPABLE BUILD REPORT

3505
ci-test
Branch : master Sha : 5f9e0cfc3c
Builder : Kumar Gala Triggered By : Kumar Gala
Custom Environment Variables:
JOB_TRIGGERED_BY_NAME="daily-verify"
JOB_TRIGGERED_BY_ID="23790"
# Runtime Status Tests Branch Coverage Sequence Coverage Triggered at Duration
3505.1 none succeeded 1367/1585 N/A N/A Sun May 31 2020 02:05:20 GMT+0000 (UTC) 01:89:46
3505.2 none succeeded 912/1585 N/A N/A Sun May 31 2020 02:05:20 GMT+0000 (UTC) 01:75:84
3505.3 none timeout 0/0 N/A N/A Sun May 31 2020 02:05:20 GMT+0000 (UTC) 02:23:73
3505.4 none timeout 0/0 N/A N/A Sun May 31 2020 02:05:20 GMT+0000 (UTC) 02:23:73
3505.5 none succeeded 1578/1585 N/A N/A Sun May 31 2020 02:05:20 GMT+0000 (UTC) 02:97:16
3505.6 none succeeded 1583/1585 N/A N/A Sun May 31 2020 02:05:20 GMT+0000 (UTC) 02:06:34
3505.7 none succeeded 1186/1585 N/A N/A Sun May 31 2020 02:05:20 GMT+0000 (UTC) 02:99:56
3505.8 none succeeded 787/1585 N/A N/A Sun May 31 2020 02:05:20 GMT+0000 (UTC) 01:65:26
3505.9 none succeeded 1344/1585 N/A N/A Sun May 31 2020 02:05:20 GMT+0000 (UTC) 02:04:27
3505.10 none succeeded 1400/1585 N/A N/A Sun May 31 2020 02:05:21 GMT+0000 (UTC) 02:02:33
3505.11 none succeeded 1452/1585 N/A N/A Sun May 31 2020 02:05:21 GMT+0000 (UTC) 02:06:76
3505.12 none succeeded 1432/1585 N/A N/A Sun May 31 2020 02:05:21 GMT+0000 (UTC) 02:13:68
3505.13 none succeeded 1283/1585 N/A N/A Sun May 31 2020 02:05:21 GMT+0000 (UTC) 02:93:01
3505.14 none succeeded 1177/1585 N/A N/A Sun May 31 2020 02:05:21 GMT+0000 (UTC) 02:00:86
3505.15 none succeeded 1044/1585 N/A N/A Sun May 31 2020 02:05:21 GMT+0000 (UTC) 01:88:74
3505.16 none succeeded 1274/1585 N/A N/A Sun May 31 2020 02:05:21 GMT+0000 (UTC) 02:91:37
3505.17 none succeeded 1095/1585 N/A N/A Sun May 31 2020 02:05:21 GMT+0000 (UTC) 02:97:20
3505.18 none succeeded 1540/1585 N/A N/A Sun May 31 2020 02:05:21 GMT+0000 (UTC) 02:99:47
3505.19 none failed 0/0 N/A N/A Sun May 31 2020 02:05:21 GMT+0000 (UTC) 00:07:94
3505.20 none succeeded 1585/1585 N/A N/A Sun May 31 2020 02:05:21 GMT+0000 (UTC) 02:00:10
3505.21 none succeeded 1533/1585 N/A N/A Sun May 31 2020 02:05:21 GMT+0000 (UTC) 02:08:65
3505.22 none succeeded 1089/1585 N/A N/A Sun May 31 2020 02:05:21 GMT+0000 (UTC) 02:94:17
3505.23 none succeeded 1255/1585 N/A N/A Sun May 31 2020 02:05:21 GMT+0000 (UTC) 02:92:16
3505.24 none succeeded 1264/1585 N/A N/A Sun May 31 2020 02:05:21 GMT+0000 (UTC) 02:96:79
3505.25 none succeeded 1574/1584 N/A N/A Sun May 31 2020 02:05:21 GMT+0000 (UTC) 02:22:46
3505.26 none timeout 0/0 N/A N/A Sun May 31 2020 02:05:22 GMT+0000 (UTC) 02:21:56
3505.27 none succeeded 991/1584 N/A N/A Sun May 31 2020 02:05:22 GMT+0000 (UTC) 01:85:17
3505.28 none succeeded 1355/1584 N/A N/A Sun May 31 2020 02:05:22 GMT+0000 (UTC) 02:99:11
3505.29 none succeeded 1299/1584 N/A N/A Sun May 31 2020 02:05:22 GMT+0000 (UTC) 02:91:44
3505.30 none succeeded 1576/1584 N/A N/A Sun May 31 2020 02:05:22 GMT+0000 (UTC) 02:06:64
3505.31 none succeeded 1575/1584 N/A N/A Sun May 31 2020 02:05:22 GMT+0000 (UTC) 02:08:02
3505.32 none timeout 0/0 N/A N/A Sun May 31 2020 02:05:22 GMT+0000 (UTC) 02:22:16
3505.33 none timeout 0/0 N/A N/A Sun May 31 2020 02:05:22 GMT+0000 (UTC) 02:23:76
3505.34 none succeeded 1575/1584 N/A N/A Sun May 31 2020 02:05:22 GMT+0000 (UTC) 02:99:50
3505.35 none succeeded 1584/1584 N/A N/A Sun May 31 2020 02:05:22 GMT+0000 (UTC) 02:97:09


Need help with Shippable? File an Issue


[ master ] Build FAILED for zephyrproject-rtos/test_results ( tests: reel board test results Testing CI system, run tests on hardware reel board v1 Signed-off-by: Maksim Masalski <maksim.masalski@intel.com> ) on Shippable.com #builds

Shippable.com <noreply@...>
 

SHIPPABLE BUILD REPORT

73
test_results
Branch : master Sha : a145b3b290
Builder : Maksim Masalski Triggered By : Anas Nashif
Custom Environment Variables:
JOB_TRIGGERED_BY_NAME="create_test_commit"
JOB_TRIGGERED_BY_ID="125148"
# Runtime Status Tests Branch Coverage Sequence Coverage Triggered at Duration
73.1 none succeeded 838/971 N/A N/A Sat May 30 2020 04:07:37 GMT+0000 (UTC) 01:49:22
73.2 none unstable 1654/2274 N/A N/A Sat May 30 2020 04:07:37 GMT+0000 (UTC) 01:56:73
73.3 none failed 2868/4778 N/A N/A Sat May 30 2020 04:07:37 GMT+0000 (UTC) 04:31:65
73.4 none unstable 5549/6100 N/A N/A Sat May 30 2020 04:07:37 GMT+0000 (UTC) 01:78:60
73.5 none failed 5895/5941 N/A N/A Sat May 30 2020 04:07:37 GMT+0000 (UTC) 05:84:23


Need help with Shippable? File an Issue


[ master ] Build TIMEOUT for zephyrproject-rtos/ci-test ( ci: Update sdk to 0.11.3 Update sdk to 0.11.3 release and update docker image to get that SDK version. Signed-off-by: Kumar Gala <kumar.gala@linaro.org> ) on Shippable.com #builds

Shippable.com <noreply@...>
 

SHIPPABLE BUILD REPORT

3504
ci-test
Branch : master Sha : 5f9e0cfc3c
Builder : Kumar Gala Triggered By : Kumar Gala
Custom Environment Variables:
JOB_TRIGGERED_BY_NAME="daily-verify"
JOB_TRIGGERED_BY_ID="23790"
# Runtime Status Tests Branch Coverage Sequence Coverage Triggered at Duration
3504.1 none succeeded 1367/1585 N/A N/A Sat May 30 2020 02:05:20 GMT+0000 (UTC) 01:89:15
3504.2 none succeeded 912/1585 N/A N/A Sat May 30 2020 02:05:20 GMT+0000 (UTC) 01:73:96
3504.3 none timeout 0/0 N/A N/A Sat May 30 2020 02:05:20 GMT+0000 (UTC) 02:23:66
3504.4 none timeout 0/0 N/A N/A Sat May 30 2020 02:05:20 GMT+0000 (UTC) 02:23:65
3504.5 none succeeded 1578/1585 N/A N/A Sat May 30 2020 02:05:20 GMT+0000 (UTC) 02:97:92
3504.6 none succeeded 1583/1585 N/A N/A Sat May 30 2020 02:05:20 GMT+0000 (UTC) 02:03:78
3504.7 none succeeded 1186/1585 N/A N/A Sat May 30 2020 02:05:20 GMT+0000 (UTC) 02:97:09
3504.8 none succeeded 787/1585 N/A N/A Sat May 30 2020 02:05:20 GMT+0000 (UTC) 01:64:67
3504.9 none succeeded 1344/1585 N/A N/A Sat May 30 2020 02:05:20 GMT+0000 (UTC) 02:98:90
3504.10 none succeeded 1400/1585 N/A N/A Sat May 30 2020 02:05:20 GMT+0000 (UTC) 02:03:92
3504.11 none succeeded 1452/1585 N/A N/A Sat May 30 2020 02:05:20 GMT+0000 (UTC) 02:07:05
3504.12 none succeeded 1432/1585 N/A N/A Sat May 30 2020 02:05:20 GMT+0000 (UTC) 02:12:36
3504.13 none succeeded 1283/1585 N/A N/A Sat May 30 2020 02:05:20 GMT+0000 (UTC) 01:86:68
3504.14 none succeeded 1177/1585 N/A N/A Sat May 30 2020 02:05:20 GMT+0000 (UTC) 02:97:09
3504.15 none succeeded 1044/1585 N/A N/A Sat May 30 2020 02:05:21 GMT+0000 (UTC) 01:87:26
3504.16 none succeeded 1274/1585 N/A N/A Sat May 30 2020 02:05:21 GMT+0000 (UTC) 01:86:65
3504.17 none succeeded 1095/1585 N/A N/A Sat May 30 2020 02:05:21 GMT+0000 (UTC) 01:88:97
3504.18 none succeeded 1540/1585 N/A N/A Sat May 30 2020 02:05:21 GMT+0000 (UTC) 02:04:15
3504.19 none succeeded 1082/1585 N/A N/A Sat May 30 2020 02:05:21 GMT+0000 (UTC) 01:77:45
3504.20 none succeeded 1585/1585 N/A N/A Sat May 30 2020 02:05:21 GMT+0000 (UTC) 02:02:94
3504.21 none succeeded 1533/1585 N/A N/A Sat May 30 2020 02:05:21 GMT+0000 (UTC) 02:03:77
3504.22 none succeeded 1089/1585 N/A N/A Sat May 30 2020 02:05:21 GMT+0000 (UTC) 02:91:48
3504.23 none succeeded 1255/1585 N/A N/A Sat May 30 2020 02:05:21 GMT+0000 (UTC) 01:90:79
3504.24 none succeeded 1264/1585 N/A N/A Sat May 30 2020 02:05:21 GMT+0000 (UTC) 02:92:00
3504.25 none succeeded 1574/1584 N/A N/A Sat May 30 2020 02:05:21 GMT+0000 (UTC) 02:13:81
3504.26 none succeeded 1568/1584 N/A N/A Sat May 30 2020 02:05:21 GMT+0000 (UTC) 02:21:44
3504.27 none succeeded 991/1584 N/A N/A Sat May 30 2020 02:05:21 GMT+0000 (UTC) 01:80:20
3504.28 none succeeded 1355/1584 N/A N/A Sat May 30 2020 02:05:21 GMT+0000 (UTC) 02:99:25
3504.29 none succeeded 1299/1584 N/A N/A Sat May 30 2020 02:05:21 GMT+0000 (UTC) 01:89:66
3504.30 none succeeded 1576/1584 N/A N/A Sat May 30 2020 02:05:21 GMT+0000 (UTC) 02:06:44
3504.31 none succeeded 1575/1584 N/A N/A Sat May 30 2020 02:05:21 GMT+0000 (UTC) 02:05:14
3504.32 none timeout 0/0 N/A N/A Sat May 30 2020 02:05:22 GMT+0000 (UTC) 02:24:68
3504.33 none timeout 0/0 N/A N/A Sat May 30 2020 02:05:22 GMT+0000 (UTC) 02:21:88
3504.34 none succeeded 1575/1584 N/A N/A Sat May 30 2020 02:05:22 GMT+0000 (UTC) 02:99:53
3504.35 none succeeded 1584/1584 N/A N/A Sat May 30 2020 02:05:22 GMT+0000 (UTC) 02:96:78


Need help with Shippable? File an Issue


[ master ] Build FAILED for zephyrproject-rtos/test_results ( tests: reel board test results Testing CI system, run tests on hardware reel board v1 Signed-off-by: Maksim Masalski <maksim.masalski@intel.com> ) on Shippable.com #builds

Shippable.com <noreply@...>
 

SHIPPABLE BUILD REPORT

72
test_results
Branch : master Sha : a145b3b290
Builder : Maksim Masalski Triggered By : Anas Nashif
Custom Environment Variables:
JOB_TRIGGERED_BY_NAME="create_test_commit"
JOB_TRIGGERED_BY_ID="125148"
# Runtime Status Tests Branch Coverage Sequence Coverage Triggered at Duration
72.1 none succeeded 838/971 N/A N/A Fri May 29 2020 04:06:49 GMT+0000 (UTC) 01:50:04
72.2 none unstable 1654/2274 N/A N/A Fri May 29 2020 04:06:49 GMT+0000 (UTC) 01:54:63
72.3 none failed 2868/4778 N/A N/A Fri May 29 2020 04:06:49 GMT+0000 (UTC) 04:33:70
72.4 none unstable 5549/6100 N/A N/A Fri May 29 2020 04:06:49 GMT+0000 (UTC) 01:79:43
72.5 none unstable 5895/5941 N/A N/A Fri May 29 2020 04:06:49 GMT+0000 (UTC) 01:89:47


Need help with Shippable? File an Issue


[ master ] Build TIMEOUT for zephyrproject-rtos/ci-test ( ci: Update sdk to 0.11.3 Update sdk to 0.11.3 release and update docker image to get that SDK version. Signed-off-by: Kumar Gala <kumar.gala@linaro.org> ) on Shippable.com #builds

Shippable.com <noreply@...>
 

SHIPPABLE BUILD REPORT

3503
ci-test
Branch : master Sha : 5f9e0cfc3c
Builder : Kumar Gala Triggered By : Kumar Gala
Custom Environment Variables:
JOB_TRIGGERED_BY_NAME="daily-verify"
JOB_TRIGGERED_BY_ID="23790"
# Runtime Status Tests Branch Coverage Sequence Coverage Triggered at Duration
3503.1 none succeeded 1367/1585 N/A N/A Fri May 29 2020 02:06:03 GMT+0000 (UTC) 01:90:94
3503.2 none succeeded 912/1585 N/A N/A Fri May 29 2020 02:06:03 GMT+0000 (UTC) 01:74:28
3503.3 none timeout 0/0 N/A N/A Fri May 29 2020 02:06:03 GMT+0000 (UTC) 02:22:00
3503.4 none timeout 0/0 N/A N/A Fri May 29 2020 02:06:03 GMT+0000 (UTC) 02:22:99
3503.5 none succeeded 1578/1585 N/A N/A Fri May 29 2020 02:06:03 GMT+0000 (UTC) 02:98:56
3503.6 none succeeded 1583/1585 N/A N/A Fri May 29 2020 02:06:03 GMT+0000 (UTC) 02:03:99
3503.7 none succeeded 1186/1585 N/A N/A Fri May 29 2020 02:06:03 GMT+0000 (UTC) 02:97:42
3503.8 none succeeded 787/1585 N/A N/A Fri May 29 2020 02:06:03 GMT+0000 (UTC) 01:65:94
3503.9 none succeeded 1344/1585 N/A N/A Fri May 29 2020 02:06:03 GMT+0000 (UTC) 02:05:91
3503.10 none succeeded 1400/1585 N/A N/A Fri May 29 2020 02:06:03 GMT+0000 (UTC) 02:05:03
3503.11 none succeeded 1452/1585 N/A N/A Fri May 29 2020 02:06:03 GMT+0000 (UTC) 02:07:45
3503.12 none succeeded 1432/1585 N/A N/A Fri May 29 2020 02:06:03 GMT+0000 (UTC) 02:11:44
3503.13 none succeeded 1283/1585 N/A N/A Fri May 29 2020 02:06:03 GMT+0000 (UTC) 02:90:00
3503.14 none succeeded 1177/1585 N/A N/A Fri May 29 2020 02:06:03 GMT+0000 (UTC) 02:08:82
3503.15 none succeeded 1044/1585 N/A N/A Fri May 29 2020 02:06:03 GMT+0000 (UTC) 01:90:83
3503.16 none succeeded 1274/1585 N/A N/A Fri May 29 2020 02:06:03 GMT+0000 (UTC) 02:91:30
3503.17 none succeeded 1095/1585 N/A N/A Fri May 29 2020 02:06:03 GMT+0000 (UTC) 02:93:81
3503.18 none succeeded 1540/1585 N/A N/A Fri May 29 2020 02:06:03 GMT+0000 (UTC) 02:98:55
3503.19 none succeeded 1082/1585 N/A N/A Fri May 29 2020 02:06:04 GMT+0000 (UTC) 01:81:76
3503.20 none succeeded 1585/1585 N/A N/A Fri May 29 2020 02:06:04 GMT+0000 (UTC) 02:01:47
3503.21 none succeeded 1533/1585 N/A N/A Fri May 29 2020 02:06:04 GMT+0000 (UTC) 02:07:04
3503.22 none succeeded 1089/1585 N/A N/A Fri May 29 2020 02:06:04 GMT+0000 (UTC) 02:94:17
3503.23 none succeeded 1255/1585 N/A N/A Fri May 29 2020 02:06:04 GMT+0000 (UTC) 02:94:44
3503.24 none succeeded 1264/1585 N/A N/A Fri May 29 2020 02:06:04 GMT+0000 (UTC) 02:04:49
3503.25 none succeeded 1574/1584 N/A N/A Fri May 29 2020 02:06:04 GMT+0000 (UTC) 02:15:17
3503.26 none timeout 0/0 N/A N/A Fri May 29 2020 02:06:04 GMT+0000 (UTC) 02:22:34
3503.27 none succeeded 991/1584 N/A N/A Fri May 29 2020 02:06:04 GMT+0000 (UTC) 01:83:97
3503.28 none succeeded 1355/1584 N/A N/A Fri May 29 2020 02:06:04 GMT+0000 (UTC) 02:97:24
3503.29 none succeeded 1299/1584 N/A N/A Fri May 29 2020 02:06:04 GMT+0000 (UTC) 02:95:15
3503.30 none succeeded 1576/1584 N/A N/A Fri May 29 2020 02:06:04 GMT+0000 (UTC) 02:06:58
3503.31 none succeeded 1575/1584 N/A N/A Fri May 29 2020 02:06:04 GMT+0000 (UTC) 02:15:23
3503.32 none timeout 0/0 N/A N/A Fri May 29 2020 02:06:04 GMT+0000 (UTC) 02:23:73
3503.33 none timeout 0/0 N/A N/A Fri May 29 2020 02:06:04 GMT+0000 (UTC) 02:20:10
3503.34 none succeeded 1575/1584 N/A N/A Fri May 29 2020 02:06:04 GMT+0000 (UTC) 02:02:35
3503.35 none succeeded 1584/1584 N/A N/A Fri May 29 2020 02:06:04 GMT+0000 (UTC) 02:98:50


Need help with Shippable? File an Issue


[ master ] Build UNSTABLE for zephyrproject-rtos/test_results ( tests: reel board test results Testing CI system, run tests on hardware reel board v1 Signed-off-by: Maksim Masalski <maksim.masalski@intel.com> ) on Shippable.com #builds

Shippable.com <noreply@...>
 

SHIPPABLE BUILD REPORT

71
test_results
Branch : master Sha : a145b3b290
Builder : Maksim Masalski Triggered By : Anas Nashif
Custom Environment Variables:
JOB_TRIGGERED_BY_NAME="create_test_commit"
JOB_TRIGGERED_BY_ID="125148"
# Runtime Status Tests Branch Coverage Sequence Coverage Triggered at Duration
71.1 none succeeded 838/971 N/A N/A Thu May 28 2020 04:07:01 GMT+0000 (UTC) 01:48:51
71.2 none unstable 1654/2272 N/A N/A Thu May 28 2020 04:07:01 GMT+0000 (UTC) 01:55:15
71.3 none succeeded 2864/4774 N/A N/A Thu May 28 2020 04:07:01 GMT+0000 (UTC) 01:66:54
71.4 none unstable 5552/6102 N/A N/A Thu May 28 2020 04:07:01 GMT+0000 (UTC) 01:78:72
71.5 none unstable 5895/5941 N/A N/A Thu May 28 2020 04:07:01 GMT+0000 (UTC) 01:87:98


Need help with Shippable? File an Issue


[ master ] Build TIMEOUT for zephyrproject-rtos/ci-test ( ci: Update sdk to 0.11.3 Update sdk to 0.11.3 release and update docker image to get that SDK version. Signed-off-by: Kumar Gala <kumar.gala@linaro.org> ) on Shippable.com #builds

Shippable.com <noreply@...>
 

SHIPPABLE BUILD REPORT

3502
ci-test
Branch : master Sha : 5f9e0cfc3c
Builder : Kumar Gala Triggered By : Kumar Gala
Custom Environment Variables:
JOB_TRIGGERED_BY_NAME="daily-verify"
JOB_TRIGGERED_BY_ID="23790"
# Runtime Status Tests Branch Coverage Sequence Coverage Triggered at Duration
3502.1 none succeeded 1367/1585 N/A N/A Thu May 28 2020 02:05:24 GMT+0000 (UTC) 01:89:43
3502.2 none succeeded 912/1585 N/A N/A Thu May 28 2020 02:05:24 GMT+0000 (UTC) 01:74:17
3502.3 none timeout 0/0 N/A N/A Thu May 28 2020 02:05:24 GMT+0000 (UTC) 02:22:06
3502.4 none timeout 0/0 N/A N/A Thu May 28 2020 02:05:24 GMT+0000 (UTC) 02:22:06
3502.5 none succeeded 1578/1585 N/A N/A Thu May 28 2020 02:05:24 GMT+0000 (UTC) 02:97:25
3502.6 none succeeded 1583/1585 N/A N/A Thu May 28 2020 02:05:24 GMT+0000 (UTC) 02:05:02
3502.7 none succeeded 1186/1585 N/A N/A Thu May 28 2020 02:05:24 GMT+0000 (UTC) 02:00:06
3502.8 none succeeded 787/1585 N/A N/A Thu May 28 2020 02:05:24 GMT+0000 (UTC) 01:65:25
3502.9 none succeeded 1344/1585 N/A N/A Thu May 28 2020 02:05:25 GMT+0000 (UTC) 02:99:23
3502.10 none succeeded 1400/1585 N/A N/A Thu May 28 2020 02:05:25 GMT+0000 (UTC) 02:03:07
3502.11 none succeeded 1452/1585 N/A N/A Thu May 28 2020 02:05:25 GMT+0000 (UTC) 02:08:56
3502.12 none succeeded 1432/1585 N/A N/A Thu May 28 2020 02:05:25 GMT+0000 (UTC) 02:12:33
3502.13 none succeeded 1283/1585 N/A N/A Thu May 28 2020 02:05:25 GMT+0000 (UTC) 01:88:58
3502.14 none succeeded 1177/1585 N/A N/A Thu May 28 2020 02:05:25 GMT+0000 (UTC) 02:99:42
3502.15 none succeeded 1044/1585 N/A N/A Thu May 28 2020 02:05:25 GMT+0000 (UTC) 01:89:13
3502.16 none succeeded 1274/1585 N/A N/A Thu May 28 2020 02:05:25 GMT+0000 (UTC) 02:94:61
3502.17 none succeeded 1095/1585 N/A N/A Thu May 28 2020 02:05:25 GMT+0000 (UTC) 02:93:91
3502.18 none succeeded 1540/1585 N/A N/A Thu May 28 2020 02:05:25 GMT+0000 (UTC) 02:03:82
3502.19 none succeeded 1082/1585 N/A N/A Thu May 28 2020 02:05:25 GMT+0000 (UTC) 01:82:94
3502.20 none succeeded 1585/1585 N/A N/A Thu May 28 2020 02:05:25 GMT+0000 (UTC) 02:00:98
3502.21 none succeeded 1533/1585 N/A N/A Thu May 28 2020 02:05:25 GMT+0000 (UTC) 02:08:98
3502.22 none succeeded 1089/1584 N/A N/A Thu May 28 2020 02:05:25 GMT+0000 (UTC) 02:92:19
3502.23 none succeeded 1254/1584 N/A N/A Thu May 28 2020 02:05:25 GMT+0000 (UTC) 02:95:26
3502.24 none succeeded 1263/1584 N/A N/A Thu May 28 2020 02:05:25 GMT+0000 (UTC) 02:95:04
3502.25 none succeeded 1574/1584 N/A N/A Thu May 28 2020 02:05:25 GMT+0000 (UTC) 02:19:19
3502.26 none timeout 0/0 N/A N/A Thu May 28 2020 02:05:25 GMT+0000 (UTC) 02:22:95
3502.27 none succeeded 991/1584 N/A N/A Thu May 28 2020 02:05:26 GMT+0000 (UTC) 01:86:59
3502.28 none succeeded 1355/1584 N/A N/A Thu May 28 2020 02:05:26 GMT+0000 (UTC) 02:03:76
3502.29 none succeeded 1301/1584 N/A N/A Thu May 28 2020 02:05:26 GMT+0000 (UTC) 02:93:98
3502.30 none succeeded 1574/1584 N/A N/A Thu May 28 2020 02:05:26 GMT+0000 (UTC) 02:10:95
3502.31 none succeeded 1575/1584 N/A N/A Thu May 28 2020 02:05:26 GMT+0000 (UTC) 02:07:24
3502.32 none timeout 0/0 N/A N/A Thu May 28 2020 02:05:26 GMT+0000 (UTC) 02:23:84
3502.33 none timeout 0/0 N/A N/A Thu May 28 2020 02:05:26 GMT+0000 (UTC) 02:20:01
3502.34 none succeeded 1575/1584 N/A N/A Thu May 28 2020 02:05:26 GMT+0000 (UTC) 02:02:22
3502.35 none succeeded 1584/1584 N/A N/A Thu May 28 2020 02:05:26 GMT+0000 (UTC) 02:97:49


Need help with Shippable? File an Issue


[ master ] Build FAILED for zephyrproject-rtos/test_results ( tests: reel board test results Testing CI system, run tests on hardware reel board v1 Signed-off-by: Maksim Masalski <maksim.masalski@intel.com> ) on Shippable.com #builds

Shippable.com <noreply@...>
 

SHIPPABLE BUILD REPORT

70
test_results
Branch : master Sha : a145b3b290
Builder : Maksim Masalski Triggered By : Anas Nashif
Custom Environment Variables:
JOB_TRIGGERED_BY_NAME="create_test_commit"
JOB_TRIGGERED_BY_ID="125148"
# Runtime Status Tests Branch Coverage Sequence Coverage Triggered at Duration
70.1 none succeeded 833/974 N/A N/A Wed May 27 2020 04:07:39 GMT+0000 (UTC) 01:48:02
70.2 none unstable 1653/2270 N/A N/A Wed May 27 2020 04:07:39 GMT+0000 (UTC) 01:55:21
70.3 none unstable 2869/4758 N/A N/A Wed May 27 2020 04:07:39 GMT+0000 (UTC) 01:66:89
70.4 none failed 5547/6095 N/A N/A Wed May 27 2020 04:07:39 GMT+0000 (UTC) 04:69:12
70.5 none unstable 5889/5935 N/A N/A Wed May 27 2020 04:07:39 GMT+0000 (UTC) 01:86:56


Need help with Shippable? File an Issue


[ master ] Build TIMEOUT for zephyrproject-rtos/ci-test ( ci: Update sdk to 0.11.3 Update sdk to 0.11.3 release and update docker image to get that SDK version. Signed-off-by: Kumar Gala <kumar.gala@linaro.org> ) on Shippable.com #builds

Shippable.com <noreply@...>
 

SHIPPABLE BUILD REPORT

3501
ci-test
Branch : master Sha : 5f9e0cfc3c
Builder : Kumar Gala Triggered By : Kumar Gala
Custom Environment Variables:
JOB_TRIGGERED_BY_NAME="daily-verify"
JOB_TRIGGERED_BY_ID="23790"
# Runtime Status Tests Branch Coverage Sequence Coverage Triggered at Duration
3501.1 none succeeded 1362/1580 N/A N/A Wed May 27 2020 02:06:04 GMT+0000 (UTC) 01:85:73
3501.2 none succeeded 917/1580 N/A N/A Wed May 27 2020 02:06:04 GMT+0000 (UTC) 01:68:91
3501.3 none timeout 0/0 N/A N/A Wed May 27 2020 02:06:04 GMT+0000 (UTC) 02:21:48
3501.4 none timeout 0/0 N/A N/A Wed May 27 2020 02:06:04 GMT+0000 (UTC) 02:21:47
3501.5 none succeeded 1574/1580 N/A N/A Wed May 27 2020 02:06:04 GMT+0000 (UTC) 02:95:92
3501.6 none succeeded 1578/1580 N/A N/A Wed May 27 2020 02:06:04 GMT+0000 (UTC) 02:07:93
3501.7 none succeeded 1042/1580 N/A N/A Wed May 27 2020 02:06:04 GMT+0000 (UTC) 01:89:55
3501.8 none succeeded 910/1580 N/A N/A Wed May 27 2020 02:06:04 GMT+0000 (UTC) 01:71:85
3501.9 none succeeded 1344/1580 N/A N/A Wed May 27 2020 02:06:05 GMT+0000 (UTC) 02:00:83
3501.10 none succeeded 1351/1580 N/A N/A Wed May 27 2020 02:06:05 GMT+0000 (UTC) 02:03:98
3501.11 none succeeded 1493/1580 N/A N/A Wed May 27 2020 02:06:05 GMT+0000 (UTC) 02:09:31
3501.12 none succeeded 1427/1580 N/A N/A Wed May 27 2020 02:06:05 GMT+0000 (UTC) 02:11:64
3501.13 none succeeded 1237/1580 N/A N/A Wed May 27 2020 02:06:05 GMT+0000 (UTC) 01:86:64
3501.14 none succeeded 1217/1580 N/A N/A Wed May 27 2020 02:06:05 GMT+0000 (UTC) 02:08:99
3501.15 none succeeded 1001/1580 N/A N/A Wed May 27 2020 02:06:05 GMT+0000 (UTC) 01:81:84
3501.16 none succeeded 1307/1580 N/A N/A Wed May 27 2020 02:06:05 GMT+0000 (UTC) 02:96:87
3501.17 none succeeded 1051/1580 N/A N/A Wed May 27 2020 02:06:05 GMT+0000 (UTC) 01:88:78
3501.18 none succeeded 1574/1580 N/A N/A Wed May 27 2020 02:06:05 GMT+0000 (UTC) 02:01:49
3501.19 none succeeded 1077/1580 N/A N/A Wed May 27 2020 02:06:05 GMT+0000 (UTC) 01:80:21
3501.20 none succeeded 1580/1580 N/A N/A Wed May 27 2020 02:06:05 GMT+0000 (UTC) 02:03:52
3501.21 none succeeded 1500/1580 N/A N/A Wed May 27 2020 02:06:05 GMT+0000 (UTC) 02:08:54
3501.22 none succeeded 1112/1579 N/A N/A Wed May 27 2020 02:06:05 GMT+0000 (UTC) 02:00:20
3501.23 none succeeded 1252/1579 N/A N/A Wed May 27 2020 02:06:05 GMT+0000 (UTC) 02:97:15
3501.24 none succeeded 1258/1579 N/A N/A Wed May 27 2020 02:06:05 GMT+0000 (UTC) 02:95:27
3501.25 none timeout 1568/1579 N/A N/A Wed May 27 2020 02:06:05 GMT+0000 (UTC) 02:21:35
3501.26 none timeout 1564/1579 N/A N/A Wed May 27 2020 02:06:05 GMT+0000 (UTC) 02:21:35
3501.27 none succeeded 986/1579 N/A N/A Wed May 27 2020 02:06:05 GMT+0000 (UTC) 01:84:57
3501.28 none succeeded 1350/1579 N/A N/A Wed May 27 2020 02:06:06 GMT+0000 (UTC) 02:03:57
3501.29 none succeeded 1294/1579 N/A N/A Wed May 27 2020 02:06:06 GMT+0000 (UTC) 02:92:31
3501.30 none succeeded 1571/1579 N/A N/A Wed May 27 2020 02:06:06 GMT+0000 (UTC) 02:06:87
3501.31 none succeeded 1570/1579 N/A N/A Wed May 27 2020 02:06:06 GMT+0000 (UTC) 02:06:46
3501.32 none timeout 0/0 N/A N/A Wed May 27 2020 02:06:06 GMT+0000 (UTC) 02:24:59
3501.33 none timeout 0/0 N/A N/A Wed May 27 2020 02:06:06 GMT+0000 (UTC) 02:20:18
3501.34 none succeeded 1570/1579 N/A N/A Wed May 27 2020 02:06:06 GMT+0000 (UTC) 02:01:36
3501.35 none succeeded 1579/1579 N/A N/A Wed May 27 2020 02:06:06 GMT+0000 (UTC) 02:97:07


Need help with Shippable? File an Issue


[ master ] Build FAILED for zephyrproject-rtos/test_results ( tests: reel board test results Testing CI system, run tests on hardware reel board v1 Signed-off-by: Maksim Masalski <maksim.masalski@intel.com> ) on Shippable.com #builds

Shippable.com <noreply@...>
 

SHIPPABLE BUILD REPORT

69
test_results
Branch : master Sha : a145b3b290
Builder : Maksim Masalski Triggered By : Anas Nashif
Custom Environment Variables:
JOB_TRIGGERED_BY_NAME="create_test_commit"
JOB_TRIGGERED_BY_ID="125148"
# Runtime Status Tests Branch Coverage Sequence Coverage Triggered at Duration
69.1 none succeeded 833/972 N/A N/A Tue May 26 2020 04:07:13 GMT+0000 (UTC) 01:49:69
69.2 none unstable 1653/2270 N/A N/A Tue May 26 2020 04:07:13 GMT+0000 (UTC) 01:56:73
69.3 none failed 2858/4751 N/A N/A Tue May 26 2020 04:07:13 GMT+0000 (UTC) 04:29:22
69.4 none unstable 5545/6095 N/A N/A Tue May 26 2020 04:07:13 GMT+0000 (UTC) 01:79:58
69.5 none unstable 5881/5925 N/A N/A Tue May 26 2020 04:07:13 GMT+0000 (UTC) 01:86:55


Need help with Shippable? File an Issue


[ master ] Build TIMEOUT for zephyrproject-rtos/ci-test ( ci: Update sdk to 0.11.3 Update sdk to 0.11.3 release and update docker image to get that SDK version. Signed-off-by: Kumar Gala <kumar.gala@linaro.org> ) on Shippable.com #builds

Shippable.com <noreply@...>
 

SHIPPABLE BUILD REPORT

3500
ci-test
Branch : master Sha : 5f9e0cfc3c
Builder : Kumar Gala Triggered By : Kumar Gala
Custom Environment Variables:
JOB_TRIGGERED_BY_NAME="daily-verify"
JOB_TRIGGERED_BY_ID="23790"
# Runtime Status Tests Branch Coverage Sequence Coverage Triggered at Duration
3500.1 none succeeded 1362/1580 N/A N/A Tue May 26 2020 02:05:43 GMT+0000 (UTC) 02:95:02
3500.2 none succeeded 917/1580 N/A N/A Tue May 26 2020 02:05:43 GMT+0000 (UTC) 01:74:62
3500.3 none timeout 0/0 N/A N/A Tue May 26 2020 02:05:43 GMT+0000 (UTC) 02:21:38
3500.4 none timeout 0/0 N/A N/A Tue May 26 2020 02:05:43 GMT+0000 (UTC) 02:21:38
3500.5 none succeeded 1574/1580 N/A N/A Tue May 26 2020 02:05:43 GMT+0000 (UTC) 02:97:41
3500.6 none succeeded 1578/1580 N/A N/A Tue May 26 2020 02:05:43 GMT+0000 (UTC) 02:06:69
3500.7 none succeeded 1042/1580 N/A N/A Tue May 26 2020 02:05:43 GMT+0000 (UTC) 01:89:48
3500.8 none succeeded 910/1580 N/A N/A Tue May 26 2020 02:05:43 GMT+0000 (UTC) 01:71:59
3500.9 none succeeded 1344/1580 N/A N/A Tue May 26 2020 02:05:43 GMT+0000 (UTC) 02:98:54
3500.10 none succeeded 1351/1580 N/A N/A Tue May 26 2020 02:05:43 GMT+0000 (UTC) 02:02:46
3500.11 none succeeded 1493/1580 N/A N/A Tue May 26 2020 02:05:43 GMT+0000 (UTC) 02:11:32
3500.12 none succeeded 1427/1580 N/A N/A Tue May 26 2020 02:05:43 GMT+0000 (UTC) 02:11:66
3500.13 none succeeded 1237/1580 N/A N/A Tue May 26 2020 02:05:43 GMT+0000 (UTC) 02:93:55
3500.14 none succeeded 1217/1580 N/A N/A Tue May 26 2020 02:05:43 GMT+0000 (UTC) 02:04:27
3500.15 none succeeded 1001/1580 N/A N/A Tue May 26 2020 02:05:43 GMT+0000 (UTC) 01:83:54
3500.16 none succeeded 1307/1580 N/A N/A Tue May 26 2020 02:05:43 GMT+0000 (UTC) 02:96:58
3500.17 none succeeded 1051/1580 N/A N/A Tue May 26 2020 02:05:44 GMT+0000 (UTC) 01:88:03
3500.18 none succeeded 1574/1580 N/A N/A Tue May 26 2020 02:05:44 GMT+0000 (UTC) 02:00:11
3500.19 none succeeded 1076/1579 N/A N/A Tue May 26 2020 02:05:44 GMT+0000 (UTC) 01:80:99
3500.20 none succeeded 1579/1579 N/A N/A Tue May 26 2020 02:05:44 GMT+0000 (UTC) 02:01:89
3500.21 none succeeded 1501/1579 N/A N/A Tue May 26 2020 02:05:44 GMT+0000 (UTC) 02:06:35
3500.22 none succeeded 1110/1579 N/A N/A Tue May 26 2020 02:05:44 GMT+0000 (UTC) 02:93:61
3500.23 none succeeded 1252/1579 N/A N/A Tue May 26 2020 02:05:44 GMT+0000 (UTC) 02:00:82
3500.24 none succeeded 1258/1579 N/A N/A Tue May 26 2020 02:05:44 GMT+0000 (UTC) 02:96:68
3500.25 none succeeded 1568/1579 N/A N/A Tue May 26 2020 02:05:44 GMT+0000 (UTC) 02:18:08
3500.26 none succeeded 1564/1579 N/A N/A Tue May 26 2020 02:05:44 GMT+0000 (UTC) 02:20:08
3500.27 none succeeded 986/1579 N/A N/A Tue May 26 2020 02:05:44 GMT+0000 (UTC) 01:82:94
3500.28 none succeeded 1350/1579 N/A N/A Tue May 26 2020 02:05:44 GMT+0000 (UTC) 02:00:73
3500.29 none succeeded 1294/1579 N/A N/A Tue May 26 2020 02:05:44 GMT+0000 (UTC) 02:91:53
3500.30 none succeeded 1571/1579 N/A N/A Tue May 26 2020 02:05:44 GMT+0000 (UTC) 02:08:99
3500.31 none succeeded 1570/1579 N/A N/A Tue May 26 2020 02:05:44 GMT+0000 (UTC) 02:06:61
3500.32 none timeout 0/0 N/A N/A Tue May 26 2020 02:05:44 GMT+0000 (UTC) 02:21:77
3500.33 none timeout 0/0 N/A N/A Tue May 26 2020 02:05:45 GMT+0000 (UTC) 02:21:31
3500.34 none succeeded 1570/1579 N/A N/A Tue May 26 2020 02:05:45 GMT+0000 (UTC) 02:01:83
3500.35 none succeeded 1579/1579 N/A N/A Tue May 26 2020 02:05:45 GMT+0000 (UTC) 02:97:45


Need help with Shippable? File an Issue