Date   

[ master ] Build FAILED for zephyrproject-rtos/test_results ( tests: reel board test results Testing CI system, run tests on hardware reel board v1 Signed-off-by: Maksim Masalski <maksim.masalski@intel.com> ) on Shippable.com #builds

Shippable.com <noreply@...>
 

SHIPPABLE BUILD REPORT

69
test_results
Branch : master Sha : a145b3b290
Builder : Maksim Masalski Triggered By : Anas Nashif
Custom Environment Variables:
JOB_TRIGGERED_BY_NAME="create_test_commit"
JOB_TRIGGERED_BY_ID="125148"
# Runtime Status Tests Branch Coverage Sequence Coverage Triggered at Duration
69.1 none succeeded 833/972 N/A N/A Tue May 26 2020 04:07:13 GMT+0000 (UTC) 01:49:69
69.2 none unstable 1653/2270 N/A N/A Tue May 26 2020 04:07:13 GMT+0000 (UTC) 01:56:73
69.3 none failed 2858/4751 N/A N/A Tue May 26 2020 04:07:13 GMT+0000 (UTC) 04:29:22
69.4 none unstable 5545/6095 N/A N/A Tue May 26 2020 04:07:13 GMT+0000 (UTC) 01:79:58
69.5 none unstable 5881/5925 N/A N/A Tue May 26 2020 04:07:13 GMT+0000 (UTC) 01:86:55


Need help with Shippable? File an Issue


[ master ] Build TIMEOUT for zephyrproject-rtos/ci-test ( ci: Update sdk to 0.11.3 Update sdk to 0.11.3 release and update docker image to get that SDK version. Signed-off-by: Kumar Gala <kumar.gala@linaro.org> ) on Shippable.com #builds

Shippable.com <noreply@...>
 

SHIPPABLE BUILD REPORT

3500
ci-test
Branch : master Sha : 5f9e0cfc3c
Builder : Kumar Gala Triggered By : Kumar Gala
Custom Environment Variables:
JOB_TRIGGERED_BY_NAME="daily-verify"
JOB_TRIGGERED_BY_ID="23790"
# Runtime Status Tests Branch Coverage Sequence Coverage Triggered at Duration
3500.1 none succeeded 1362/1580 N/A N/A Tue May 26 2020 02:05:43 GMT+0000 (UTC) 02:95:02
3500.2 none succeeded 917/1580 N/A N/A Tue May 26 2020 02:05:43 GMT+0000 (UTC) 01:74:62
3500.3 none timeout 0/0 N/A N/A Tue May 26 2020 02:05:43 GMT+0000 (UTC) 02:21:38
3500.4 none timeout 0/0 N/A N/A Tue May 26 2020 02:05:43 GMT+0000 (UTC) 02:21:38
3500.5 none succeeded 1574/1580 N/A N/A Tue May 26 2020 02:05:43 GMT+0000 (UTC) 02:97:41
3500.6 none succeeded 1578/1580 N/A N/A Tue May 26 2020 02:05:43 GMT+0000 (UTC) 02:06:69
3500.7 none succeeded 1042/1580 N/A N/A Tue May 26 2020 02:05:43 GMT+0000 (UTC) 01:89:48
3500.8 none succeeded 910/1580 N/A N/A Tue May 26 2020 02:05:43 GMT+0000 (UTC) 01:71:59
3500.9 none succeeded 1344/1580 N/A N/A Tue May 26 2020 02:05:43 GMT+0000 (UTC) 02:98:54
3500.10 none succeeded 1351/1580 N/A N/A Tue May 26 2020 02:05:43 GMT+0000 (UTC) 02:02:46
3500.11 none succeeded 1493/1580 N/A N/A Tue May 26 2020 02:05:43 GMT+0000 (UTC) 02:11:32
3500.12 none succeeded 1427/1580 N/A N/A Tue May 26 2020 02:05:43 GMT+0000 (UTC) 02:11:66
3500.13 none succeeded 1237/1580 N/A N/A Tue May 26 2020 02:05:43 GMT+0000 (UTC) 02:93:55
3500.14 none succeeded 1217/1580 N/A N/A Tue May 26 2020 02:05:43 GMT+0000 (UTC) 02:04:27
3500.15 none succeeded 1001/1580 N/A N/A Tue May 26 2020 02:05:43 GMT+0000 (UTC) 01:83:54
3500.16 none succeeded 1307/1580 N/A N/A Tue May 26 2020 02:05:43 GMT+0000 (UTC) 02:96:58
3500.17 none succeeded 1051/1580 N/A N/A Tue May 26 2020 02:05:44 GMT+0000 (UTC) 01:88:03
3500.18 none succeeded 1574/1580 N/A N/A Tue May 26 2020 02:05:44 GMT+0000 (UTC) 02:00:11
3500.19 none succeeded 1076/1579 N/A N/A Tue May 26 2020 02:05:44 GMT+0000 (UTC) 01:80:99
3500.20 none succeeded 1579/1579 N/A N/A Tue May 26 2020 02:05:44 GMT+0000 (UTC) 02:01:89
3500.21 none succeeded 1501/1579 N/A N/A Tue May 26 2020 02:05:44 GMT+0000 (UTC) 02:06:35
3500.22 none succeeded 1110/1579 N/A N/A Tue May 26 2020 02:05:44 GMT+0000 (UTC) 02:93:61
3500.23 none succeeded 1252/1579 N/A N/A Tue May 26 2020 02:05:44 GMT+0000 (UTC) 02:00:82
3500.24 none succeeded 1258/1579 N/A N/A Tue May 26 2020 02:05:44 GMT+0000 (UTC) 02:96:68
3500.25 none succeeded 1568/1579 N/A N/A Tue May 26 2020 02:05:44 GMT+0000 (UTC) 02:18:08
3500.26 none succeeded 1564/1579 N/A N/A Tue May 26 2020 02:05:44 GMT+0000 (UTC) 02:20:08
3500.27 none succeeded 986/1579 N/A N/A Tue May 26 2020 02:05:44 GMT+0000 (UTC) 01:82:94
3500.28 none succeeded 1350/1579 N/A N/A Tue May 26 2020 02:05:44 GMT+0000 (UTC) 02:00:73
3500.29 none succeeded 1294/1579 N/A N/A Tue May 26 2020 02:05:44 GMT+0000 (UTC) 02:91:53
3500.30 none succeeded 1571/1579 N/A N/A Tue May 26 2020 02:05:44 GMT+0000 (UTC) 02:08:99
3500.31 none succeeded 1570/1579 N/A N/A Tue May 26 2020 02:05:44 GMT+0000 (UTC) 02:06:61
3500.32 none timeout 0/0 N/A N/A Tue May 26 2020 02:05:44 GMT+0000 (UTC) 02:21:77
3500.33 none timeout 0/0 N/A N/A Tue May 26 2020 02:05:45 GMT+0000 (UTC) 02:21:31
3500.34 none succeeded 1570/1579 N/A N/A Tue May 26 2020 02:05:45 GMT+0000 (UTC) 02:01:83
3500.35 none succeeded 1579/1579 N/A N/A Tue May 26 2020 02:05:45 GMT+0000 (UTC) 02:97:45


Need help with Shippable? File an Issue


[ master ] Build UNSTABLE for zephyrproject-rtos/test_results ( tests: reel board test results Testing CI system, run tests on hardware reel board v1 Signed-off-by: Maksim Masalski <maksim.masalski@intel.com> ) on Shippable.com #builds

Shippable.com <noreply@...>
 

SHIPPABLE BUILD REPORT

68
test_results
Branch : master Sha : a145b3b290
Builder : Maksim Masalski Triggered By : Anas Nashif
Custom Environment Variables:
JOB_TRIGGERED_BY_NAME="create_test_commit"
JOB_TRIGGERED_BY_ID="125148"
# Runtime Status Tests Branch Coverage Sequence Coverage Triggered at Duration
68.1 none succeeded 833/902 N/A N/A Mon May 25 2020 04:06:12 GMT+0000 (UTC) 01:49:29
68.2 none unstable 1652/1840 N/A N/A Mon May 25 2020 04:06:12 GMT+0000 (UTC) 01:55:28
68.3 none unstable 2800/3091 N/A N/A Mon May 25 2020 04:06:13 GMT+0000 (UTC) 01:67:13
68.4 none unstable 5543/5891 N/A N/A Mon May 25 2020 04:06:13 GMT+0000 (UTC) 01:79:46
68.5 none succeeded 5927/5968 N/A N/A Mon May 25 2020 04:06:13 GMT+0000 (UTC) 01:85:25


Need help with Shippable? File an Issue


[ master ] Build TIMEOUT for zephyrproject-rtos/ci-test ( ci: Update sdk to 0.11.3 Update sdk to 0.11.3 release and update docker image to get that SDK version. Signed-off-by: Kumar Gala <kumar.gala@linaro.org> ) on Shippable.com #builds

Shippable.com <noreply@...>
 

SHIPPABLE BUILD REPORT

3499
ci-test
Branch : master Sha : 5f9e0cfc3c
Builder : Kumar Gala Triggered By : Kumar Gala
Custom Environment Variables:
JOB_TRIGGERED_BY_NAME="daily-verify"
JOB_TRIGGERED_BY_ID="23790"
# Runtime Status Tests Branch Coverage Sequence Coverage Triggered at Duration
3499.1 none succeeded 1355/1573 N/A N/A Mon May 25 2020 02:05:34 GMT+0000 (UTC) 01:86:56
3499.2 none succeeded 924/1573 N/A N/A Mon May 25 2020 02:05:34 GMT+0000 (UTC) 01:74:30
3499.3 none timeout 0/0 N/A N/A Mon May 25 2020 02:05:34 GMT+0000 (UTC) 02:20:24
3499.4 none timeout 0/0 N/A N/A Mon May 25 2020 02:05:35 GMT+0000 (UTC) 02:20:23
3499.5 none succeeded 1567/1573 N/A N/A Mon May 25 2020 02:05:35 GMT+0000 (UTC) 02:96:75
3499.6 none succeeded 1571/1573 N/A N/A Mon May 25 2020 02:05:35 GMT+0000 (UTC) 02:12:01
3499.7 none succeeded 1083/1573 N/A N/A Mon May 25 2020 02:05:35 GMT+0000 (UTC) 02:92:13
3499.8 none succeeded 861/1573 N/A N/A Mon May 25 2020 02:05:35 GMT+0000 (UTC) 01:69:55
3499.9 none succeeded 1333/1573 N/A N/A Mon May 25 2020 02:05:35 GMT+0000 (UTC) 02:97:39
3499.10 none succeeded 1371/1573 N/A N/A Mon May 25 2020 02:05:35 GMT+0000 (UTC) 02:03:98
3499.11 none succeeded 1459/1573 N/A N/A Mon May 25 2020 02:05:35 GMT+0000 (UTC) 02:07:17
3499.12 none succeeded 1421/1573 N/A N/A Mon May 25 2020 02:05:35 GMT+0000 (UTC) 02:14:57
3499.13 none succeeded 1267/1573 N/A N/A Mon May 25 2020 02:05:35 GMT+0000 (UTC) 01:86:55
3499.14 none succeeded 1170/1573 N/A N/A Mon May 25 2020 02:05:35 GMT+0000 (UTC) 02:06:44
3499.15 none succeeded 1036/1573 N/A N/A Mon May 25 2020 02:05:35 GMT+0000 (UTC) 01:88:51
3499.16 none succeeded 1258/1573 N/A N/A Mon May 25 2020 02:05:35 GMT+0000 (UTC) 01:90:78
3499.17 none succeeded 1099/1573 N/A N/A Mon May 25 2020 02:05:35 GMT+0000 (UTC) 02:94:43
3499.18 none succeeded 1512/1573 N/A N/A Mon May 25 2020 02:05:35 GMT+0000 (UTC) 02:97:32
3499.19 none succeeded 1070/1573 N/A N/A Mon May 25 2020 02:05:35 GMT+0000 (UTC) 01:80:23
3499.20 none succeeded 1573/1573 N/A N/A Mon May 25 2020 02:05:35 GMT+0000 (UTC) 02:00:85
3499.21 none succeeded 1545/1573 N/A N/A Mon May 25 2020 02:05:36 GMT+0000 (UTC) 02:04:62
3499.22 none succeeded 1054/1573 N/A N/A Mon May 25 2020 02:05:36 GMT+0000 (UTC) 02:91:56
3499.23 none succeeded 1246/1573 N/A N/A Mon May 25 2020 02:05:36 GMT+0000 (UTC) 02:90:19
3499.24 none succeeded 1252/1573 N/A N/A Mon May 25 2020 02:05:36 GMT+0000 (UTC) 02:95:71
3499.25 none succeeded 1562/1572 N/A N/A Mon May 25 2020 02:05:36 GMT+0000 (UTC) 02:16:46
3499.26 none succeeded 1558/1572 N/A N/A Mon May 25 2020 02:05:36 GMT+0000 (UTC) 02:15:15
3499.27 none succeeded 977/1572 N/A N/A Mon May 25 2020 02:05:36 GMT+0000 (UTC) 01:85:03
3499.28 none succeeded 1343/1572 N/A N/A Mon May 25 2020 02:05:36 GMT+0000 (UTC) 02:94:41
3499.29 none succeeded 1292/1572 N/A N/A Mon May 25 2020 02:05:36 GMT+0000 (UTC) 02:91:33
3499.30 none succeeded 1562/1572 N/A N/A Mon May 25 2020 02:05:36 GMT+0000 (UTC) 02:04:40
3499.31 none succeeded 1560/1572 N/A N/A Mon May 25 2020 02:05:36 GMT+0000 (UTC) 02:00:07
3499.32 none timeout 0/0 N/A N/A Mon May 25 2020 02:05:36 GMT+0000 (UTC) 02:22:94
3499.33 none timeout 0/0 N/A N/A Mon May 25 2020 02:05:36 GMT+0000 (UTC) 02:25:87
3499.34 none succeeded 1565/1572 N/A N/A Mon May 25 2020 02:05:36 GMT+0000 (UTC) 02:97:48
3499.35 none succeeded 1572/1572 N/A N/A Mon May 25 2020 02:05:36 GMT+0000 (UTC) 02:98:81


Need help with Shippable? File an Issue


[ master ] Build UNSTABLE for zephyrproject-rtos/test_results ( tests: reel board test results Testing CI system, run tests on hardware reel board v1 Signed-off-by: Maksim Masalski <maksim.masalski@intel.com> ) on Shippable.com #builds

Shippable.com <noreply@...>
 

SHIPPABLE BUILD REPORT

67
test_results
Branch : master Sha : a145b3b290
Builder : Maksim Masalski Triggered By : Anas Nashif
Custom Environment Variables:
JOB_TRIGGERED_BY_NAME="create_test_commit"
JOB_TRIGGERED_BY_ID="125148"
# Runtime Status Tests Branch Coverage Sequence Coverage Triggered at Duration
67.1 none succeeded 833/902 N/A N/A Sun May 24 2020 04:07:17 GMT+0000 (UTC) 01:48:89
67.2 none unstable 1651/1840 N/A N/A Sun May 24 2020 04:07:17 GMT+0000 (UTC) 01:56:35
67.3 none unstable 2798/3091 N/A N/A Sun May 24 2020 04:07:17 GMT+0000 (UTC) 01:67:04
67.4 none unstable 5543/5891 N/A N/A Sun May 24 2020 04:07:17 GMT+0000 (UTC) 01:78:08
67.5 none unstable 5918/5967 N/A N/A Sun May 24 2020 04:07:18 GMT+0000 (UTC) 01:88:64


Need help with Shippable? File an Issue


[ master ] Build TIMEOUT for zephyrproject-rtos/ci-test ( ci: Update sdk to 0.11.3 Update sdk to 0.11.3 release and update docker image to get that SDK version. Signed-off-by: Kumar Gala <kumar.gala@linaro.org> ) on Shippable.com #builds

Shippable.com <noreply@...>
 

SHIPPABLE BUILD REPORT

3498
ci-test
Branch : master Sha : 5f9e0cfc3c
Builder : Kumar Gala Triggered By : Kumar Gala
Custom Environment Variables:
JOB_TRIGGERED_BY_NAME="daily-verify"
JOB_TRIGGERED_BY_ID="23790"
# Runtime Status Tests Branch Coverage Sequence Coverage Triggered at Duration
3498.1 none succeeded 1354/1572 N/A N/A Sun May 24 2020 02:05:52 GMT+0000 (UTC) 01:89:25
3498.2 none succeeded 925/1572 N/A N/A Sun May 24 2020 02:05:53 GMT+0000 (UTC) 01:74:63
3498.3 none timeout 0/0 N/A N/A Sun May 24 2020 02:05:53 GMT+0000 (UTC) 02:25:82
3498.4 none timeout 0/0 N/A N/A Sun May 24 2020 02:05:53 GMT+0000 (UTC) 02:25:82
3498.5 none succeeded 1566/1572 N/A N/A Sun May 24 2020 02:05:53 GMT+0000 (UTC) 01:85:76
3498.6 none succeeded 1570/1572 N/A N/A Sun May 24 2020 02:05:53 GMT+0000 (UTC) 02:06:50
3498.7 none succeeded 1089/1572 N/A N/A Sun May 24 2020 02:05:53 GMT+0000 (UTC) 02:93:65
3498.8 none succeeded 853/1572 N/A N/A Sun May 24 2020 02:05:53 GMT+0000 (UTC) 01:69:25
3498.9 none succeeded 1332/1572 N/A N/A Sun May 24 2020 02:05:53 GMT+0000 (UTC) 02:98:65
3498.10 none succeeded 1378/1572 N/A N/A Sun May 24 2020 02:05:53 GMT+0000 (UTC) 02:01:76
3498.11 none succeeded 1451/1572 N/A N/A Sun May 24 2020 02:05:53 GMT+0000 (UTC) 02:05:18
3498.12 none succeeded 1420/1572 N/A N/A Sun May 24 2020 02:05:53 GMT+0000 (UTC) 02:12:50
3498.13 none succeeded 1268/1572 N/A N/A Sun May 24 2020 02:05:53 GMT+0000 (UTC) 01:85:85
3498.14 none succeeded 1166/1572 N/A N/A Sun May 24 2020 02:05:53 GMT+0000 (UTC) 02:98:04
3498.15 none succeeded 1056/1572 N/A N/A Sun May 24 2020 02:05:53 GMT+0000 (UTC) 01:90:87
3498.16 none succeeded 1278/1572 N/A N/A Sun May 24 2020 02:05:53 GMT+0000 (UTC) 01:90:93
3498.17 none succeeded 1083/1572 N/A N/A Sun May 24 2020 02:05:53 GMT+0000 (UTC) 02:91:82
3498.18 none succeeded 1525/1571 N/A N/A Sun May 24 2020 02:05:53 GMT+0000 (UTC) 02:99:11
3498.19 none succeeded 1068/1571 N/A N/A Sun May 24 2020 02:05:53 GMT+0000 (UTC) 01:84:64
3498.20 none succeeded 1571/1571 N/A N/A Sun May 24 2020 02:05:54 GMT+0000 (UTC) 02:00:81
3498.21 none succeeded 1536/1571 N/A N/A Sun May 24 2020 02:05:54 GMT+0000 (UTC) 02:05:16
3498.22 none succeeded 1059/1571 N/A N/A Sun May 24 2020 02:05:54 GMT+0000 (UTC) 02:92:19
3498.23 none succeeded 1244/1571 N/A N/A Sun May 24 2020 02:05:54 GMT+0000 (UTC) 02:94:24
3498.24 none succeeded 1250/1571 N/A N/A Sun May 24 2020 02:05:54 GMT+0000 (UTC) 02:97:94
3498.25 none succeeded 1561/1571 N/A N/A Sun May 24 2020 02:05:54 GMT+0000 (UTC) 02:15:28
3498.26 none succeeded 1557/1571 N/A N/A Sun May 24 2020 02:05:54 GMT+0000 (UTC) 02:20:93
3498.27 none succeeded 976/1571 N/A N/A Sun May 24 2020 02:05:54 GMT+0000 (UTC) 01:89:46
3498.28 none succeeded 1342/1571 N/A N/A Sun May 24 2020 02:05:54 GMT+0000 (UTC) 02:99:45
3498.29 none succeeded 1291/1571 N/A N/A Sun May 24 2020 02:05:54 GMT+0000 (UTC) 02:97:12
3498.30 none succeeded 1561/1571 N/A N/A Sun May 24 2020 02:05:54 GMT+0000 (UTC) 02:08:05
3498.31 none succeeded 1559/1571 N/A N/A Sun May 24 2020 02:05:54 GMT+0000 (UTC) 02:00:97
3498.32 none timeout 0/0 N/A N/A Sun May 24 2020 02:05:54 GMT+0000 (UTC) 02:20:20
3498.33 none timeout 0/0 N/A N/A Sun May 24 2020 02:05:54 GMT+0000 (UTC) 02:20:09
3498.34 none succeeded 1564/1571 N/A N/A Sun May 24 2020 02:05:54 GMT+0000 (UTC) 02:91:39
3498.35 none succeeded 1571/1571 N/A N/A Sun May 24 2020 02:05:54 GMT+0000 (UTC) 02:95:77


Need help with Shippable? File an Issue


[ master ] Build FAILED for zephyrproject-rtos/test_results ( tests: reel board test results Testing CI system, run tests on hardware reel board v1 Signed-off-by: Maksim Masalski <maksim.masalski@intel.com> ) on Shippable.com #builds

Shippable.com <noreply@...>
 

SHIPPABLE BUILD REPORT

66
test_results
Branch : master Sha : a145b3b290
Builder : Maksim Masalski Triggered By : Anas Nashif
Custom Environment Variables:
JOB_TRIGGERED_BY_NAME="create_test_commit"
JOB_TRIGGERED_BY_ID="125148"
# Runtime Status Tests Branch Coverage Sequence Coverage Triggered at Duration
66.1 none succeeded 833/902 N/A N/A Sat May 23 2020 04:06:43 GMT+0000 (UTC) 01:48:65
66.2 none unstable 1652/1840 N/A N/A Sat May 23 2020 04:06:43 GMT+0000 (UTC) 01:55:07
66.3 none failed 2799/3091 N/A N/A Sat May 23 2020 04:06:43 GMT+0000 (UTC) 04:24:63
66.4 none unstable 5539/5888 N/A N/A Sat May 23 2020 04:06:44 GMT+0000 (UTC) 01:78:85
66.5 none unstable 5926/5968 N/A N/A Sat May 23 2020 04:06:44 GMT+0000 (UTC) 01:86:45


Need help with Shippable? File an Issue


[ master ] Build TIMEOUT for zephyrproject-rtos/ci-test ( ci: Update sdk to 0.11.3 Update sdk to 0.11.3 release and update docker image to get that SDK version. Signed-off-by: Kumar Gala <kumar.gala@linaro.org> ) on Shippable.com #builds

Shippable.com <noreply@...>
 

SHIPPABLE BUILD REPORT

3497
ci-test
Branch : master Sha : 5f9e0cfc3c
Builder : Kumar Gala Triggered By : Kumar Gala
Custom Environment Variables:
JOB_TRIGGERED_BY_NAME="daily-verify"
JOB_TRIGGERED_BY_ID="23790"
# Runtime Status Tests Branch Coverage Sequence Coverage Triggered at Duration
3497.1 none succeeded 1354/1572 N/A N/A Sat May 23 2020 02:05:14 GMT+0000 (UTC) 01:89:40
3497.2 none succeeded 925/1572 N/A N/A Sat May 23 2020 02:05:14 GMT+0000 (UTC) 01:74:64
3497.3 none timeout 0/0 N/A N/A Sat May 23 2020 02:05:14 GMT+0000 (UTC) 02:25:99
3497.4 none timeout 0/0 N/A N/A Sat May 23 2020 02:05:15 GMT+0000 (UTC) 02:25:98
3497.5 none succeeded 1566/1572 N/A N/A Sat May 23 2020 02:05:15 GMT+0000 (UTC) 02:95:01
3497.6 none succeeded 1570/1572 N/A N/A Sat May 23 2020 02:05:15 GMT+0000 (UTC) 02:06:54
3497.7 none succeeded 1089/1572 N/A N/A Sat May 23 2020 02:05:15 GMT+0000 (UTC) 02:97:22
3497.8 none succeeded 853/1572 N/A N/A Sat May 23 2020 02:05:15 GMT+0000 (UTC) 01:72:99
3497.9 none succeeded 1332/1572 N/A N/A Sat May 23 2020 02:05:15 GMT+0000 (UTC) 02:95:02
3497.10 none succeeded 1378/1572 N/A N/A Sat May 23 2020 02:05:15 GMT+0000 (UTC) 02:03:73
3497.11 none succeeded 1451/1572 N/A N/A Sat May 23 2020 02:05:15 GMT+0000 (UTC) 02:05:71
3497.12 none succeeded 1420/1572 N/A N/A Sat May 23 2020 02:05:15 GMT+0000 (UTC) 02:09:44
3497.13 none succeeded 1268/1572 N/A N/A Sat May 23 2020 02:05:15 GMT+0000 (UTC) 01:85:20
3497.14 none succeeded 1166/1572 N/A N/A Sat May 23 2020 02:05:15 GMT+0000 (UTC) 02:93:72
3497.15 none succeeded 1056/1572 N/A N/A Sat May 23 2020 02:05:15 GMT+0000 (UTC) 01:80:81
3497.16 none succeeded 1278/1572 N/A N/A Sat May 23 2020 02:05:16 GMT+0000 (UTC) 02:01:38
3497.17 none succeeded 1083/1572 N/A N/A Sat May 23 2020 02:05:16 GMT+0000 (UTC) 02:95:79
3497.18 none succeeded 1525/1571 N/A N/A Sat May 23 2020 02:05:16 GMT+0000 (UTC) 02:99:61
3497.19 none succeeded 1068/1571 N/A N/A Sat May 23 2020 02:05:16 GMT+0000 (UTC) 01:72:48
3497.20 none succeeded 1571/1571 N/A N/A Sat May 23 2020 02:05:16 GMT+0000 (UTC) 01:88:93
3497.21 none succeeded 1536/1571 N/A N/A Sat May 23 2020 02:05:16 GMT+0000 (UTC) 02:04:16
3497.22 none succeeded 1059/1571 N/A N/A Sat May 23 2020 02:05:16 GMT+0000 (UTC) 02:92:05
3497.23 none succeeded 1244/1571 N/A N/A Sat May 23 2020 02:05:16 GMT+0000 (UTC) 02:91:67
3497.24 none succeeded 1250/1571 N/A N/A Sat May 23 2020 02:05:16 GMT+0000 (UTC) 02:95:03
3497.25 none succeeded 1561/1571 N/A N/A Sat May 23 2020 02:05:16 GMT+0000 (UTC) 02:03:56
3497.26 none succeeded 1557/1571 N/A N/A Sat May 23 2020 02:05:16 GMT+0000 (UTC) 02:19:11
3497.27 none succeeded 976/1571 N/A N/A Sat May 23 2020 02:05:16 GMT+0000 (UTC) 01:88:62
3497.28 none succeeded 1342/1571 N/A N/A Sat May 23 2020 02:05:16 GMT+0000 (UTC) 02:99:69
3497.29 none succeeded 1291/1571 N/A N/A Sat May 23 2020 02:05:16 GMT+0000 (UTC) 02:94:41
3497.30 none succeeded 1561/1571 N/A N/A Sat May 23 2020 02:05:16 GMT+0000 (UTC) 02:09:32
3497.31 none succeeded 1559/1571 N/A N/A Sat May 23 2020 02:05:16 GMT+0000 (UTC) 02:03:08
3497.32 none timeout 0/0 N/A N/A Sat May 23 2020 02:05:16 GMT+0000 (UTC) 02:22:07
3497.33 none timeout 0/0 N/A N/A Sat May 23 2020 02:05:16 GMT+0000 (UTC) 02:21:35
3497.34 none succeeded 1564/1571 N/A N/A Sat May 23 2020 02:05:16 GMT+0000 (UTC) 02:91:42
3497.35 none succeeded 1571/1571 N/A N/A Sat May 23 2020 02:05:17 GMT+0000 (UTC) 02:95:21


Need help with Shippable? File an Issue


[ master ] Build UNSTABLE for zephyrproject-rtos/test_results ( tests: reel board test results Testing CI system, run tests on hardware reel board v1 Signed-off-by: Maksim Masalski <maksim.masalski@intel.com> ) on Shippable.com #builds

Shippable.com <noreply@...>
 

SHIPPABLE BUILD REPORT

65
test_results
Branch : master Sha : a145b3b290
Builder : Maksim Masalski Triggered By : Anas Nashif
Custom Environment Variables:
JOB_TRIGGERED_BY_NAME="create_test_commit"
JOB_TRIGGERED_BY_ID="125148"
# Runtime Status Tests Branch Coverage Sequence Coverage Triggered at Duration
65.1 none succeeded 833/902 N/A N/A Fri May 22 2020 04:06:40 GMT+0000 (UTC) 01:49:37
65.2 none unstable 1651/1840 N/A N/A Fri May 22 2020 04:06:40 GMT+0000 (UTC) 01:56:35
65.3 none unstable 2800/3091 N/A N/A Fri May 22 2020 04:06:41 GMT+0000 (UTC) 01:66:83
65.4 none unstable 5539/5891 N/A N/A Fri May 22 2020 04:06:41 GMT+0000 (UTC) 01:79:39
65.5 none unstable 5919/5968 N/A N/A Fri May 22 2020 04:06:41 GMT+0000 (UTC) 01:86:70


Need help with Shippable? File an Issue


[ master ] Build TIMEOUT for zephyrproject-rtos/ci-test ( ci: Update sdk to 0.11.3 Update sdk to 0.11.3 release and update docker image to get that SDK version. Signed-off-by: Kumar Gala <kumar.gala@linaro.org> ) on Shippable.com #builds

Shippable.com <noreply@...>
 

SHIPPABLE BUILD REPORT

3496
ci-test
Branch : master Sha : 5f9e0cfc3c
Builder : Kumar Gala Triggered By : Kumar Gala
Custom Environment Variables:
JOB_TRIGGERED_BY_NAME="daily-verify"
JOB_TRIGGERED_BY_ID="23790"
# Runtime Status Tests Branch Coverage Sequence Coverage Triggered at Duration
3496.1 none succeeded 1354/1572 N/A N/A Fri May 22 2020 02:06:02 GMT+0000 (UTC) 01:89:49
3496.2 none succeeded 925/1572 N/A N/A Fri May 22 2020 02:06:02 GMT+0000 (UTC) 01:75:71
3496.3 none timeout 0/0 N/A N/A Fri May 22 2020 02:06:02 GMT+0000 (UTC) 02:23:96
3496.4 none timeout 0/0 N/A N/A Fri May 22 2020 02:06:02 GMT+0000 (UTC) 02:23:96
3496.5 none succeeded 1566/1572 N/A N/A Fri May 22 2020 02:06:02 GMT+0000 (UTC) 02:97:02
3496.6 none succeeded 1570/1572 N/A N/A Fri May 22 2020 02:06:02 GMT+0000 (UTC) 02:06:35
3496.7 none succeeded 1089/1572 N/A N/A Fri May 22 2020 02:06:02 GMT+0000 (UTC) 02:01:54
3496.8 none succeeded 853/1572 N/A N/A Fri May 22 2020 02:06:02 GMT+0000 (UTC) 01:69:26
3496.9 none succeeded 1332/1572 N/A N/A Fri May 22 2020 02:06:02 GMT+0000 (UTC) 01:85:87
3496.10 none succeeded 1378/1572 N/A N/A Fri May 22 2020 02:06:02 GMT+0000 (UTC) 02:05:98
3496.11 none succeeded 1451/1572 N/A N/A Fri May 22 2020 02:06:02 GMT+0000 (UTC) 02:04:46
3496.12 none succeeded 1420/1572 N/A N/A Fri May 22 2020 02:06:02 GMT+0000 (UTC) 02:11:62
3496.13 none succeeded 1268/1572 N/A N/A Fri May 22 2020 02:06:02 GMT+0000 (UTC) 01:85:21
3496.14 none succeeded 1166/1572 N/A N/A Fri May 22 2020 02:06:02 GMT+0000 (UTC) 02:99:39
3496.15 none succeeded 1056/1572 N/A N/A Fri May 22 2020 02:06:02 GMT+0000 (UTC) 02:90:30
3496.16 none succeeded 1278/1572 N/A N/A Fri May 22 2020 02:06:02 GMT+0000 (UTC) 02:94:17
3496.17 none succeeded 1083/1572 N/A N/A Fri May 22 2020 02:06:02 GMT+0000 (UTC) 02:91:71
3496.18 none succeeded 1525/1571 N/A N/A Fri May 22 2020 02:06:03 GMT+0000 (UTC) 02:99:31
3496.19 none succeeded 1068/1571 N/A N/A Fri May 22 2020 02:06:03 GMT+0000 (UTC) 01:80:15
3496.20 none succeeded 1571/1571 N/A N/A Fri May 22 2020 02:06:03 GMT+0000 (UTC) 02:00:28
3496.21 none succeeded 1536/1571 N/A N/A Fri May 22 2020 02:06:03 GMT+0000 (UTC) 02:06:76
3496.22 none succeeded 1059/1571 N/A N/A Fri May 22 2020 02:06:03 GMT+0000 (UTC) 02:92:46
3496.23 none succeeded 1244/1571 N/A N/A Fri May 22 2020 02:06:03 GMT+0000 (UTC) 02:94:41
3496.24 none succeeded 1250/1571 N/A N/A Fri May 22 2020 02:06:03 GMT+0000 (UTC) 02:95:20
3496.25 none succeeded 1561/1571 N/A N/A Fri May 22 2020 02:06:03 GMT+0000 (UTC) 02:23:81
3496.26 none succeeded 1557/1571 N/A N/A Fri May 22 2020 02:06:03 GMT+0000 (UTC) 02:20:18
3496.27 none succeeded 976/1571 N/A N/A Fri May 22 2020 02:06:03 GMT+0000 (UTC) 01:88:59
3496.28 none succeeded 1342/1571 N/A N/A Fri May 22 2020 02:06:03 GMT+0000 (UTC) 02:99:57
3496.29 none succeeded 1291/1571 N/A N/A Fri May 22 2020 02:06:03 GMT+0000 (UTC) 02:93:98
3496.30 none succeeded 1561/1571 N/A N/A Fri May 22 2020 02:06:03 GMT+0000 (UTC) 02:06:85
3496.31 none succeeded 1559/1571 N/A N/A Fri May 22 2020 02:06:03 GMT+0000 (UTC) 02:01:33
3496.32 none timeout 0/0 N/A N/A Fri May 22 2020 02:06:03 GMT+0000 (UTC) 02:24:17
3496.33 none timeout 0/0 N/A N/A Fri May 22 2020 02:06:03 GMT+0000 (UTC) 02:23:72
3496.34 none succeeded 1564/1571 N/A N/A Fri May 22 2020 02:06:03 GMT+0000 (UTC) 01:89:36
3496.35 none succeeded 1571/1571 N/A N/A Fri May 22 2020 02:06:04 GMT+0000 (UTC) 02:96:34


Need help with Shippable? File an Issue


[ master ] Build FAILED for zephyrproject-rtos/test_results ( tests: reel board test results Testing CI system, run tests on hardware reel board v1 Signed-off-by: Maksim Masalski <maksim.masalski@intel.com> ) on Shippable.com #builds

Shippable.com <noreply@...>
 

SHIPPABLE BUILD REPORT

64
test_results
Branch : master Sha : a145b3b290
Builder : Maksim Masalski Triggered By : Anas Nashif
Custom Environment Variables:
JOB_TRIGGERED_BY_NAME="create_test_commit"
JOB_TRIGGERED_BY_ID="125148"
# Runtime Status Tests Branch Coverage Sequence Coverage Triggered at Duration
64.1 none succeeded 833/902 N/A N/A Thu May 21 2020 04:06:32 GMT+0000 (UTC) 01:49:40
64.2 none failed 1650/1840 N/A N/A Thu May 21 2020 04:06:32 GMT+0000 (UTC) 03:73:88
64.3 none unstable 2800/3091 N/A N/A Thu May 21 2020 04:06:32 GMT+0000 (UTC) 01:67:32
64.4 none unstable 5541/5890 N/A N/A Thu May 21 2020 04:06:32 GMT+0000 (UTC) 01:79:20
64.5 none succeeded 5926/5967 N/A N/A Thu May 21 2020 04:06:32 GMT+0000 (UTC) 01:86:78


Need help with Shippable? File an Issue


[ master ] Build TIMEOUT for zephyrproject-rtos/ci-test ( ci: Update sdk to 0.11.3 Update sdk to 0.11.3 release and update docker image to get that SDK version. Signed-off-by: Kumar Gala <kumar.gala@linaro.org> ) on Shippable.com #builds

Shippable.com <noreply@...>
 

SHIPPABLE BUILD REPORT

3495
ci-test
Branch : master Sha : 5f9e0cfc3c
Builder : Kumar Gala Triggered By : Kumar Gala
Custom Environment Variables:
JOB_TRIGGERED_BY_NAME="daily-verify"
JOB_TRIGGERED_BY_ID="23790"
# Runtime Status Tests Branch Coverage Sequence Coverage Triggered at Duration
3495.1 none succeeded 1354/1572 N/A N/A Thu May 21 2020 02:06:07 GMT+0000 (UTC) 01:89:20
3495.2 none succeeded 925/1572 N/A N/A Thu May 21 2020 02:06:07 GMT+0000 (UTC) 01:75:94
3495.3 none timeout 0/0 N/A N/A Thu May 21 2020 02:06:07 GMT+0000 (UTC) 02:23:00
3495.4 none timeout 0/0 N/A N/A Thu May 21 2020 02:06:07 GMT+0000 (UTC) 02:23:00
3495.5 none succeeded 1566/1572 N/A N/A Thu May 21 2020 02:06:07 GMT+0000 (UTC) 02:96:45
3495.6 none succeeded 1570/1572 N/A N/A Thu May 21 2020 02:06:07 GMT+0000 (UTC) 02:07:94
3495.7 none succeeded 1089/1572 N/A N/A Thu May 21 2020 02:06:07 GMT+0000 (UTC) 02:92:43
3495.8 none succeeded 852/1571 N/A N/A Thu May 21 2020 02:06:07 GMT+0000 (UTC) 01:69:23
3495.9 none succeeded 1331/1571 N/A N/A Thu May 21 2020 02:06:08 GMT+0000 (UTC) 02:98:93
3495.10 none succeeded 1377/1571 N/A N/A Thu May 21 2020 02:06:08 GMT+0000 (UTC) 02:05:87
3495.11 none succeeded 1450/1571 N/A N/A Thu May 21 2020 02:06:08 GMT+0000 (UTC) 02:04:50
3495.12 none succeeded 1419/1571 N/A N/A Thu May 21 2020 02:06:08 GMT+0000 (UTC) 02:10:25
3495.13 none succeeded 1269/1571 N/A N/A Thu May 21 2020 02:06:08 GMT+0000 (UTC) 01:86:70
3495.14 none succeeded 1163/1571 N/A N/A Thu May 21 2020 02:06:08 GMT+0000 (UTC) 02:96:83
3495.15 none succeeded 1054/1571 N/A N/A Thu May 21 2020 02:06:08 GMT+0000 (UTC) 01:89:17
3495.16 none succeeded 1278/1571 N/A N/A Thu May 21 2020 02:06:08 GMT+0000 (UTC) 02:98:83
3495.17 none succeeded 1082/1571 N/A N/A Thu May 21 2020 02:06:08 GMT+0000 (UTC) 02:91:62
3495.18 none succeeded 1525/1571 N/A N/A Thu May 21 2020 02:06:08 GMT+0000 (UTC) 02:96:32
3495.19 none succeeded 1068/1571 N/A N/A Thu May 21 2020 02:06:08 GMT+0000 (UTC) 01:81:73
3495.20 none succeeded 1571/1571 N/A N/A Thu May 21 2020 02:06:08 GMT+0000 (UTC) 02:99:22
3495.21 none succeeded 1536/1571 N/A N/A Thu May 21 2020 02:06:08 GMT+0000 (UTC) 02:04:65
3495.22 none succeeded 1059/1571 N/A N/A Thu May 21 2020 02:06:08 GMT+0000 (UTC) 02:99:65
3495.23 none succeeded 1244/1571 N/A N/A Thu May 21 2020 02:06:08 GMT+0000 (UTC) 02:94:26
3495.24 none succeeded 1250/1571 N/A N/A Thu May 21 2020 02:06:08 GMT+0000 (UTC) 02:94:48
3495.25 none succeeded 1561/1571 N/A N/A Thu May 21 2020 02:06:08 GMT+0000 (UTC) 02:14:29
3495.26 none succeeded 1557/1571 N/A N/A Thu May 21 2020 02:06:09 GMT+0000 (UTC) 02:15:79
3495.27 none succeeded 976/1571 N/A N/A Thu May 21 2020 02:06:09 GMT+0000 (UTC) 01:84:20
3495.28 none succeeded 1342/1571 N/A N/A Thu May 21 2020 02:06:09 GMT+0000 (UTC) 02:95:95
3495.29 none failed 0/0 N/A N/A Thu May 21 2020 02:06:09 GMT+0000 (UTC) 00:02:16
3495.30 none succeeded 1561/1571 N/A N/A Thu May 21 2020 02:06:09 GMT+0000 (UTC) 02:04:48
3495.31 none succeeded 1559/1571 N/A N/A Thu May 21 2020 02:06:09 GMT+0000 (UTC) 02:05:97
3495.32 none timeout 0/0 N/A N/A Thu May 21 2020 02:06:09 GMT+0000 (UTC) 02:25:72
3495.33 none timeout 0/0 N/A N/A Thu May 21 2020 02:06:09 GMT+0000 (UTC) 02:23:06
3495.34 none succeeded 1564/1571 N/A N/A Thu May 21 2020 02:06:09 GMT+0000 (UTC) 02:05:24
3495.35 none succeeded 1571/1571 N/A N/A Thu May 21 2020 02:06:09 GMT+0000 (UTC) 02:96:74


Need help with Shippable? File an Issue


[ master ] Build UNSTABLE for zephyrproject-rtos/test_results ( tests: reel board test results Testing CI system, run tests on hardware reel board v1 Signed-off-by: Maksim Masalski <maksim.masalski@intel.com> ) on Shippable.com #builds

Shippable.com <noreply@...>
 

SHIPPABLE BUILD REPORT

63
test_results
Branch : master Sha : a145b3b290
Builder : Maksim Masalski Triggered By : Anas Nashif
Custom Environment Variables:
JOB_TRIGGERED_BY_NAME="create_test_commit"
JOB_TRIGGERED_BY_ID="125148"
# Runtime Status Tests Branch Coverage Sequence Coverage Triggered at Duration
63.1 none succeeded 833/902 N/A N/A Wed May 20 2020 04:06:09 GMT+0000 (UTC) 01:49:48
63.2 none unstable 1652/1840 N/A N/A Wed May 20 2020 04:06:09 GMT+0000 (UTC) 01:57:00
63.3 none unstable 2800/3091 N/A N/A Wed May 20 2020 04:06:09 GMT+0000 (UTC) 01:66:81
63.4 none unstable 5536/5887 N/A N/A Wed May 20 2020 04:06:09 GMT+0000 (UTC) 01:78:85
63.5 none succeeded 5911/5952 N/A N/A Wed May 20 2020 04:06:09 GMT+0000 (UTC) 01:84:59


Need help with Shippable? File an Issue


[ master ] Build TIMEOUT for zephyrproject-rtos/ci-test ( ci: Update sdk to 0.11.3 Update sdk to 0.11.3 release and update docker image to get that SDK version. Signed-off-by: Kumar Gala <kumar.gala@linaro.org> ) on Shippable.com #builds

Shippable.com <noreply@...>
 

SHIPPABLE BUILD REPORT

3494
ci-test
Branch : master Sha : 5f9e0cfc3c
Builder : Kumar Gala Triggered By : Kumar Gala
Custom Environment Variables:
JOB_TRIGGERED_BY_NAME="daily-verify"
JOB_TRIGGERED_BY_ID="23790"
# Runtime Status Tests Branch Coverage Sequence Coverage Triggered at Duration
3494.1 none succeeded 1354/1572 N/A N/A Wed May 20 2020 02:05:36 GMT+0000 (UTC) 01:89:21
3494.2 none succeeded 925/1572 N/A N/A Wed May 20 2020 02:05:36 GMT+0000 (UTC) 01:75:88
3494.3 none timeout 0/0 N/A N/A Wed May 20 2020 02:05:36 GMT+0000 (UTC) 02:23:88
3494.4 none timeout 0/0 N/A N/A Wed May 20 2020 02:05:36 GMT+0000 (UTC) 02:23:87
3494.5 none succeeded 1566/1572 N/A N/A Wed May 20 2020 02:05:36 GMT+0000 (UTC) 02:96:40
3494.6 none succeeded 1570/1572 N/A N/A Wed May 20 2020 02:05:36 GMT+0000 (UTC) 02:05:85
3494.7 none succeeded 1089/1572 N/A N/A Wed May 20 2020 02:05:36 GMT+0000 (UTC) 02:97:20
3494.8 none succeeded 852/1571 N/A N/A Wed May 20 2020 02:05:36 GMT+0000 (UTC) 01:69:60
3494.9 none succeeded 1331/1571 N/A N/A Wed May 20 2020 02:05:36 GMT+0000 (UTC) 02:97:95
3494.10 none succeeded 1377/1571 N/A N/A Wed May 20 2020 02:05:36 GMT+0000 (UTC) 02:04:69
3494.11 none succeeded 1450/1571 N/A N/A Wed May 20 2020 02:05:37 GMT+0000 (UTC) 02:08:53
3494.12 none succeeded 1419/1571 N/A N/A Wed May 20 2020 02:05:37 GMT+0000 (UTC) 02:17:16
3494.13 none succeeded 1269/1571 N/A N/A Wed May 20 2020 02:05:37 GMT+0000 (UTC) 01:86:69
3494.14 none succeeded 1163/1571 N/A N/A Wed May 20 2020 02:05:37 GMT+0000 (UTC) 02:99:11
3494.15 none succeeded 1054/1571 N/A N/A Wed May 20 2020 02:05:37 GMT+0000 (UTC) 01:89:25
3494.16 none succeeded 1278/1571 N/A N/A Wed May 20 2020 02:05:37 GMT+0000 (UTC) 02:92:04
3494.17 none succeeded 1082/1571 N/A N/A Wed May 20 2020 02:05:37 GMT+0000 (UTC) 02:92:35
3494.18 none succeeded 1525/1571 N/A N/A Wed May 20 2020 02:05:37 GMT+0000 (UTC) 02:99:31
3494.19 none succeeded 1068/1571 N/A N/A Wed May 20 2020 02:05:37 GMT+0000 (UTC) 01:80:97
3494.20 none succeeded 1571/1571 N/A N/A Wed May 20 2020 02:05:37 GMT+0000 (UTC) 02:00:89
3494.21 none succeeded 1536/1571 N/A N/A Wed May 20 2020 02:05:37 GMT+0000 (UTC) 02:07:92
3494.22 none succeeded 1059/1571 N/A N/A Wed May 20 2020 02:05:37 GMT+0000 (UTC) 02:92:20
3494.23 none succeeded 1244/1571 N/A N/A Wed May 20 2020 02:05:37 GMT+0000 (UTC) 02:94:55
3494.24 none succeeded 1250/1571 N/A N/A Wed May 20 2020 02:05:37 GMT+0000 (UTC) 02:95:83
3494.25 none succeeded 1561/1571 N/A N/A Wed May 20 2020 02:05:37 GMT+0000 (UTC) 02:18:89
3494.26 none succeeded 1557/1571 N/A N/A Wed May 20 2020 02:05:37 GMT+0000 (UTC) 02:16:32
3494.27 none succeeded 976/1571 N/A N/A Wed May 20 2020 02:05:37 GMT+0000 (UTC) 01:84:39
3494.28 none succeeded 1342/1571 N/A N/A Wed May 20 2020 02:05:38 GMT+0000 (UTC) 02:97:42
3494.29 none succeeded 1291/1571 N/A N/A Wed May 20 2020 02:05:38 GMT+0000 (UTC) 02:97:33
3494.30 none succeeded 1561/1571 N/A N/A Wed May 20 2020 02:05:38 GMT+0000 (UTC) 02:04:53
3494.31 none succeeded 1559/1571 N/A N/A Wed May 20 2020 02:05:38 GMT+0000 (UTC) 02:02:93
3494.32 none timeout 0/0 N/A N/A Wed May 20 2020 02:05:38 GMT+0000 (UTC) 02:23:92
3494.33 none timeout 0/0 N/A N/A Wed May 20 2020 02:05:38 GMT+0000 (UTC) 02:23:84
3494.34 none succeeded 1564/1571 N/A N/A Wed May 20 2020 02:05:38 GMT+0000 (UTC) 02:03:77
3494.35 none succeeded 1571/1571 N/A N/A Wed May 20 2020 02:05:38 GMT+0000 (UTC) 02:96:77


Need help with Shippable? File an Issue


[ master ] Build FAILED for zephyrproject-rtos/test_results ( results: add more results for v2.3.0-rc1 ) on Shippable.com #builds

Shippable.com <noreply@...>
 

SHIPPABLE BUILD REPORT

62
test_results
Branch : master Sha : feb4984e8f
Builder : Anas Nashif Triggered By : Anas Nashif
Custom Environment Variables:
JOB_TRIGGERED_BY_NAME="create_test_commit"
JOB_TRIGGERED_BY_ID="125148"
# Runtime Status Tests Branch Coverage Sequence Coverage Triggered at Duration
62.1 none succeeded 831/898 N/A N/A Tue May 19 2020 04:06:21 GMT+0000 (UTC) 01:45:07
62.2 none succeeded 1648/1830 N/A N/A Tue May 19 2020 04:06:21 GMT+0000 (UTC) 01:52:25
62.3 none failed 2851/3147 N/A N/A Tue May 19 2020 04:06:21 GMT+0000 (UTC) 04:23:88
62.4 none unstable 5502/5845 N/A N/A Tue May 19 2020 04:06:21 GMT+0000 (UTC) 01:72:25
62.5 none unstable 5888/5928 N/A N/A Tue May 19 2020 04:06:21 GMT+0000 (UTC) 01:81:47


Need help with Shippable? File an Issue


[ master ] Build TIMEOUT for zephyrproject-rtos/ci-test ( bump matrix to 35 See if 35 builders will get this to not timeout. Signed-off-by: Kumar Gala <kumar.gala@linaro.org> ) on Shippable.com #builds

Shippable.com <noreply@...>
 

SHIPPABLE BUILD REPORT

3493
ci-test
Branch : master Sha : fce6c2868f
Builder : Kumar Gala Triggered By : Kumar Gala
Custom Environment Variables:
JOB_TRIGGERED_BY_NAME="daily-verify"
JOB_TRIGGERED_BY_ID="23790"
# Runtime Status Tests Branch Coverage Sequence Coverage Triggered at Duration
3493.1 none succeeded 1271/1561 N/A N/A Tue May 19 2020 02:05:47 GMT+0000 (UTC) 01:84:29
3493.2 none succeeded 992/1561 N/A N/A Tue May 19 2020 02:05:47 GMT+0000 (UTC) 01:80:75
3493.3 none timeout 0/0 N/A N/A Tue May 19 2020 02:05:47 GMT+0000 (UTC) 02:22:08
3493.4 none timeout 0/0 N/A N/A Tue May 19 2020 02:05:47 GMT+0000 (UTC) 02:22:07
3493.5 none succeeded 1554/1561 N/A N/A Tue May 19 2020 02:05:47 GMT+0000 (UTC) 02:97:23
3493.6 none succeeded 1559/1561 N/A N/A Tue May 19 2020 02:05:47 GMT+0000 (UTC) 02:04:57
3493.7 none succeeded 1197/1561 N/A N/A Tue May 19 2020 02:05:47 GMT+0000 (UTC) 02:99:68
3493.8 none succeeded 733/1561 N/A N/A Tue May 19 2020 02:05:47 GMT+0000 (UTC) 01:62:15
3493.9 none succeeded 1316/1561 N/A N/A Tue May 19 2020 02:05:47 GMT+0000 (UTC) 02:94:54
3493.10 none failed 1421/1561 N/A N/A Tue May 19 2020 02:05:47 GMT+0000 (UTC) 02:06:40
3493.11 none succeeded 1381/1561 N/A N/A Tue May 19 2020 02:05:47 GMT+0000 (UTC) 02:02:25
3493.12 none succeeded 1405/1561 N/A N/A Tue May 19 2020 02:05:47 GMT+0000 (UTC) 02:09:49
3493.13 none succeeded 1465/1561 N/A N/A Tue May 19 2020 02:05:47 GMT+0000 (UTC) 02:99:54
3493.14 none succeeded 1189/1561 N/A N/A Tue May 19 2020 02:05:47 GMT+0000 (UTC) 02:00:03
3493.15 none failed 1019/1561 N/A N/A Tue May 19 2020 02:05:47 GMT+0000 (UTC) 01:85:06
3493.16 none succeeded 1289/1561 N/A N/A Tue May 19 2020 02:05:48 GMT+0000 (UTC) 02:01:51
3493.17 none succeeded 1038/1561 N/A N/A Tue May 19 2020 02:05:48 GMT+0000 (UTC) 01:87:24
3493.18 none succeeded 1551/1561 N/A N/A Tue May 19 2020 02:05:48 GMT+0000 (UTC) 02:98:92
3493.19 none succeeded 1061/1561 N/A N/A Tue May 19 2020 02:05:48 GMT+0000 (UTC) 01:79:13
3493.20 none succeeded 1561/1561 N/A N/A Tue May 19 2020 02:05:48 GMT+0000 (UTC) 02:00:72
3493.21 none succeeded 1507/1561 N/A N/A Tue May 19 2020 02:05:48 GMT+0000 (UTC) 02:05:04
3493.22 none succeeded 1061/1561 N/A N/A Tue May 19 2020 02:05:48 GMT+0000 (UTC) 02:92:21
3493.23 none succeeded 1231/1561 N/A N/A Tue May 19 2020 02:05:48 GMT+0000 (UTC) 02:91:39
3493.24 none succeeded 1238/1561 N/A N/A Tue May 19 2020 02:05:48 GMT+0000 (UTC) 02:94:53
3493.25 none succeeded 1551/1561 N/A N/A Tue May 19 2020 02:05:48 GMT+0000 (UTC) 02:15:22
3493.26 none succeeded 1545/1561 N/A N/A Tue May 19 2020 02:05:48 GMT+0000 (UTC) 02:20:24
3493.27 none succeeded 969/1561 N/A N/A Tue May 19 2020 02:05:48 GMT+0000 (UTC) 01:87:13
3493.28 none succeeded 1332/1561 N/A N/A Tue May 19 2020 02:05:49 GMT+0000 (UTC) 02:99:21
3493.29 none succeeded 1283/1561 N/A N/A Tue May 19 2020 02:05:49 GMT+0000 (UTC) 02:93:08
3493.30 none succeeded 1550/1561 N/A N/A Tue May 19 2020 02:05:49 GMT+0000 (UTC) 02:08:74
3493.31 none failed 1538/1561 N/A N/A Tue May 19 2020 02:05:49 GMT+0000 (UTC) 02:03:99
3493.32 none timeout 0/0 N/A N/A Tue May 19 2020 02:05:49 GMT+0000 (UTC) 02:23:70
3493.33 none timeout 0/0 N/A N/A Tue May 19 2020 02:05:49 GMT+0000 (UTC) 02:22:13
3493.34 none succeeded 1553/1560 N/A N/A Tue May 19 2020 02:05:49 GMT+0000 (UTC) 02:03:90
3493.35 none succeeded 1560/1560 N/A N/A Tue May 19 2020 02:05:49 GMT+0000 (UTC) 02:95:22


Need help with Shippable? File an Issue


[ master ] Build FAILED for zephyrproject-rtos/test_results ( results: add more results for v2.3.0-rc1 ) on Shippable.com #builds

Shippable.com <noreply@...>
 

SHIPPABLE BUILD REPORT

61
test_results
Branch : master Sha : feb4984e8f
Builder : Anas Nashif Triggered By : Anas Nashif
Custom Environment Variables:
JOB_TRIGGERED_BY_NAME="create_test_commit"
JOB_TRIGGERED_BY_ID="125148"
# Runtime Status Tests Branch Coverage Sequence Coverage Triggered at Duration
61.1 none succeeded 831/898 N/A N/A Mon May 18 2020 04:07:06 GMT+0000 (UTC) 01:46:47
61.2 none unstable 1647/1830 N/A N/A Mon May 18 2020 04:07:06 GMT+0000 (UTC) 01:52:47
61.3 none failed 2852/3147 N/A N/A Mon May 18 2020 04:07:06 GMT+0000 (UTC) 04:29:62
61.4 none succeeded 5506/5843 N/A N/A Mon May 18 2020 04:07:06 GMT+0000 (UTC) 01:77:23
61.5 none succeeded 5890/5928 N/A N/A Mon May 18 2020 04:07:06 GMT+0000 (UTC) 01:86:76


Need help with Shippable? File an Issue


[ master ] Build TIMEOUT for zephyrproject-rtos/ci-test ( bump matrix to 35 See if 35 builders will get this to not timeout. Signed-off-by: Kumar Gala <kumar.gala@linaro.org> ) on Shippable.com #builds

Shippable.com <noreply@...>
 

SHIPPABLE BUILD REPORT

3492
ci-test
Branch : master Sha : fce6c2868f
Builder : Kumar Gala Triggered By : Kumar Gala
Custom Environment Variables:
JOB_TRIGGERED_BY_NAME="daily-verify"
JOB_TRIGGERED_BY_ID="23790"
# Runtime Status Tests Branch Coverage Sequence Coverage Triggered at Duration
3492.1 none succeeded 1271/1561 N/A N/A Mon May 18 2020 02:05:30 GMT+0000 (UTC) 01:83:64
3492.2 none succeeded 992/1561 N/A N/A Mon May 18 2020 02:05:30 GMT+0000 (UTC) 01:77:28
3492.3 none timeout 0/0 N/A N/A Mon May 18 2020 02:05:31 GMT+0000 (UTC) 02:22:40
3492.4 none timeout 0/0 N/A N/A Mon May 18 2020 02:05:31 GMT+0000 (UTC) 02:22:40
3492.5 none succeeded 1554/1561 N/A N/A Mon May 18 2020 02:05:31 GMT+0000 (UTC) 02:96:68
3492.6 none succeeded 1559/1561 N/A N/A Mon May 18 2020 02:05:31 GMT+0000 (UTC) 02:97:35
3492.7 none succeeded 1195/1561 N/A N/A Mon May 18 2020 02:05:31 GMT+0000 (UTC) 02:99:13
3492.8 none succeeded 735/1561 N/A N/A Mon May 18 2020 02:05:31 GMT+0000 (UTC) 01:62:12
3492.9 none succeeded 1316/1561 N/A N/A Mon May 18 2020 02:05:31 GMT+0000 (UTC) 02:94:34
3492.10 none failed 1419/1561 N/A N/A Mon May 18 2020 02:05:31 GMT+0000 (UTC) 02:06:68
3492.11 none succeeded 1383/1561 N/A N/A Mon May 18 2020 02:05:31 GMT+0000 (UTC) 02:02:10
3492.12 none succeeded 1405/1561 N/A N/A Mon May 18 2020 02:05:31 GMT+0000 (UTC) 02:09:29
3492.13 none succeeded 1463/1561 N/A N/A Mon May 18 2020 02:05:31 GMT+0000 (UTC) 02:03:87
3492.14 none succeeded 1191/1561 N/A N/A Mon May 18 2020 02:05:31 GMT+0000 (UTC) 02:00:28
3492.15 none succeeded 1025/1561 N/A N/A Mon May 18 2020 02:05:31 GMT+0000 (UTC) 01:83:50
3492.16 none succeeded 1289/1561 N/A N/A Mon May 18 2020 02:05:31 GMT+0000 (UTC) 02:96:63
3492.17 none succeeded 1038/1561 N/A N/A Mon May 18 2020 02:05:31 GMT+0000 (UTC) 01:87:19
3492.18 none succeeded 1551/1561 N/A N/A Mon May 18 2020 02:05:31 GMT+0000 (UTC) 02:05:02
3492.19 none succeeded 1061/1561 N/A N/A Mon May 18 2020 02:05:31 GMT+0000 (UTC) 01:77:00
3492.20 none succeeded 1561/1561 N/A N/A Mon May 18 2020 02:05:31 GMT+0000 (UTC) 02:00:92
3492.21 none succeeded 1507/1561 N/A N/A Mon May 18 2020 02:05:31 GMT+0000 (UTC) 02:03:99
3492.22 none succeeded 1061/1561 N/A N/A Mon May 18 2020 02:05:32 GMT+0000 (UTC) 02:90:23
3492.23 none succeeded 1231/1561 N/A N/A Mon May 18 2020 02:05:32 GMT+0000 (UTC) 01:90:92
3492.24 none succeeded 1238/1561 N/A N/A Mon May 18 2020 02:05:32 GMT+0000 (UTC) 02:94:23
3492.25 none succeeded 1551/1561 N/A N/A Mon May 18 2020 02:05:32 GMT+0000 (UTC) 02:14:38
3492.26 none succeeded 1545/1561 N/A N/A Mon May 18 2020 02:05:32 GMT+0000 (UTC) 02:21:39
3492.27 none succeeded 969/1561 N/A N/A Mon May 18 2020 02:05:32 GMT+0000 (UTC) 01:86:84
3492.28 none succeeded 1332/1561 N/A N/A Mon May 18 2020 02:05:32 GMT+0000 (UTC) 02:99:45
3492.29 none succeeded 1283/1561 N/A N/A Mon May 18 2020 02:05:32 GMT+0000 (UTC) 02:93:79
3492.30 none succeeded 1549/1560 N/A N/A Mon May 18 2020 02:05:32 GMT+0000 (UTC) 02:13:95
3492.31 none succeeded 1549/1560 N/A N/A Mon May 18 2020 02:05:32 GMT+0000 (UTC) 02:99:37
3492.32 none timeout 0/0 N/A N/A Mon May 18 2020 02:05:32 GMT+0000 (UTC) 02:20:23
3492.33 none timeout 0/0 N/A N/A Mon May 18 2020 02:05:32 GMT+0000 (UTC) 02:24:63
3492.34 none succeeded 1553/1560 N/A N/A Mon May 18 2020 02:05:32 GMT+0000 (UTC) 02:02:37
3492.35 none succeeded 1560/1560 N/A N/A Mon May 18 2020 02:05:32 GMT+0000 (UTC) 02:95:16


Need help with Shippable? File an Issue


[ master ] Build UNSTABLE for zephyrproject-rtos/test_results ( results: add more results for v2.3.0-rc1 ) on Shippable.com #builds

Shippable.com <noreply@...>
 

SHIPPABLE BUILD REPORT

60
test_results
Branch : master Sha : feb4984e8f
Builder : Anas Nashif Triggered By : Anas Nashif
Custom Environment Variables:
JOB_TRIGGERED_BY_NAME="create_test_commit"
JOB_TRIGGERED_BY_ID="125148"
# Runtime Status Tests Branch Coverage Sequence Coverage Triggered at Duration
60.1 none succeeded 831/898 N/A N/A Sun May 17 2020 04:07:23 GMT+0000 (UTC) 01:49:58
60.2 none unstable 1647/1830 N/A N/A Sun May 17 2020 04:07:23 GMT+0000 (UTC) 01:57:06
60.3 none unstable 2849/3147 N/A N/A Sun May 17 2020 04:07:24 GMT+0000 (UTC) 01:67:16
60.4 none unstable 5509/5848 N/A N/A Sun May 17 2020 04:07:24 GMT+0000 (UTC) 01:77:29
60.5 none unstable 5888/5928 N/A N/A Sun May 17 2020 04:07:24 GMT+0000 (UTC) 01:86:49


Need help with Shippable? File an Issue


[ master ] Build TIMEOUT for zephyrproject-rtos/ci-test ( bump matrix to 35 See if 35 builders will get this to not timeout. Signed-off-by: Kumar Gala <kumar.gala@linaro.org> ) on Shippable.com #builds

Shippable.com <noreply@...>
 

SHIPPABLE BUILD REPORT

3491
ci-test
Branch : master Sha : fce6c2868f
Builder : Kumar Gala Triggered By : Kumar Gala
Custom Environment Variables:
JOB_TRIGGERED_BY_NAME="daily-verify"
JOB_TRIGGERED_BY_ID="23790"
# Runtime Status Tests Branch Coverage Sequence Coverage Triggered at Duration
3491.1 none succeeded 1271/1561 N/A N/A Sun May 17 2020 02:05:43 GMT+0000 (UTC) 01:84:47
3491.2 none succeeded 992/1561 N/A N/A Sun May 17 2020 02:05:43 GMT+0000 (UTC) 01:78:55
3491.3 none timeout 0/0 N/A N/A Sun May 17 2020 02:05:43 GMT+0000 (UTC) 02:24:58
3491.4 none timeout 0/0 N/A N/A Sun May 17 2020 02:05:43 GMT+0000 (UTC) 02:24:57
3491.5 none succeeded 1554/1561 N/A N/A Sun May 17 2020 02:05:44 GMT+0000 (UTC) 02:97:08
3491.6 none succeeded 1559/1561 N/A N/A Sun May 17 2020 02:05:44 GMT+0000 (UTC) 02:02:97
3491.7 none succeeded 1195/1561 N/A N/A Sun May 17 2020 02:05:44 GMT+0000 (UTC) 02:97:31
3491.8 none succeeded 735/1561 N/A N/A Sun May 17 2020 02:05:44 GMT+0000 (UTC) 01:63:51
3491.9 none succeeded 1316/1561 N/A N/A Sun May 17 2020 02:05:44 GMT+0000 (UTC) 02:94:60
3491.10 none failed 1419/1561 N/A N/A Sun May 17 2020 02:05:44 GMT+0000 (UTC) 02:06:31
3491.11 none succeeded 1383/1561 N/A N/A Sun May 17 2020 02:05:44 GMT+0000 (UTC) 02:01:42
3491.12 none succeeded 1405/1561 N/A N/A Sun May 17 2020 02:05:44 GMT+0000 (UTC) 02:11:35
3491.13 none succeeded 1463/1561 N/A N/A Sun May 17 2020 02:05:44 GMT+0000 (UTC) 02:00:25
3491.14 none succeeded 1191/1561 N/A N/A Sun May 17 2020 02:05:44 GMT+0000 (UTC) 02:07:07
3491.15 none succeeded 1025/1561 N/A N/A Sun May 17 2020 02:05:44 GMT+0000 (UTC) 01:84:31
3491.16 none succeeded 1289/1561 N/A N/A Sun May 17 2020 02:05:44 GMT+0000 (UTC) 02:94:52
3491.17 none succeeded 1038/1561 N/A N/A Sun May 17 2020 02:05:44 GMT+0000 (UTC) 01:87:49
3491.18 none succeeded 1551/1561 N/A N/A Sun May 17 2020 02:05:44 GMT+0000 (UTC) 02:98:08
3491.19 none succeeded 1061/1561 N/A N/A Sun May 17 2020 02:05:44 GMT+0000 (UTC) 01:86:65
3491.20 none succeeded 1561/1561 N/A N/A Sun May 17 2020 02:05:45 GMT+0000 (UTC) 02:99:63
3491.21 none succeeded 1507/1561 N/A N/A Sun May 17 2020 02:05:45 GMT+0000 (UTC) 02:05:72
3491.22 none succeeded 1061/1561 N/A N/A Sun May 17 2020 02:05:45 GMT+0000 (UTC) 02:92:03
3491.23 none succeeded 1231/1561 N/A N/A Sun May 17 2020 02:05:45 GMT+0000 (UTC) 02:91:53
3491.24 none succeeded 1238/1561 N/A N/A Sun May 17 2020 02:05:45 GMT+0000 (UTC) 02:94:28
3491.25 none succeeded 1551/1561 N/A N/A Sun May 17 2020 02:05:45 GMT+0000 (UTC) 02:15:94
3491.26 none succeeded 1545/1561 N/A N/A Sun May 17 2020 02:05:45 GMT+0000 (UTC) 02:19:30
3491.27 none succeeded 969/1561 N/A N/A Sun May 17 2020 02:05:45 GMT+0000 (UTC) 01:85:90
3491.28 none succeeded 1332/1561 N/A N/A Sun May 17 2020 02:05:45 GMT+0000 (UTC) 02:99:27
3491.29 none succeeded 1283/1561 N/A N/A Sun May 17 2020 02:05:45 GMT+0000 (UTC) 02:94:16
3491.30 none succeeded 1549/1560 N/A N/A Sun May 17 2020 02:05:45 GMT+0000 (UTC) 02:09:21
3491.31 none succeeded 1549/1560 N/A N/A Sun May 17 2020 02:05:45 GMT+0000 (UTC) 02:00:86
3491.32 none timeout 0/0 N/A N/A Sun May 17 2020 02:05:45 GMT+0000 (UTC) 02:21:68
3491.33 none timeout 0/0 N/A N/A Sun May 17 2020 02:05:45 GMT+0000 (UTC) 02:20:13
3491.34 none succeeded 1553/1560 N/A N/A Sun May 17 2020 02:05:45 GMT+0000 (UTC) 02:02:22
3491.35 none succeeded 1560/1560 N/A N/A Sun May 17 2020 02:05:45 GMT+0000 (UTC) 02:96:44


Need help with Shippable? File an Issue