zephyr/master: daily build zephyr-kernel-1.7.99-170330-de64c83 Failure


donotreply@...
 

zephyr/master: daily build zephyr-kernel-1.7.99-170330-de64c83 Failure



job zephyr-sanity build number 656 failed
see: https://jenkins.zephyrproject.org/job/zephyr-sanity/656/

Generating LALR tables
Platform 'arduino_101_mcuboot' not specified in any arch .ini file and will not be tested
------------------------sanity-out/qemu_x86/tests/net/neighbor/test/qemu.log------------------------
***** BOOTING ZEPHYR OS v1.7.99 - BUILD: Mar 31 2017 09:12:04 *****
ASSERTION FAIL [num_events > 0] @ /w/workspace/zephyr-sanity/kernel/poll.c:177:
zero events
------------------------sanity-out/qemu_x86/tests/net/neighbor/test/qemu.log------------------------
qemu_x86 tests/net/udp/test FAILED: timeout
--------------------------sanity-out/qemu_x86/tests/net/udp/test/qemu.log---------------------------
***** BOOTING ZEPHYR OS v1.7.99 - BUILD: Mar 31 2017 09:12:33 *****
***** CPU exception 6
Current thread ID = 0x001124c0
Faulting segment:address = 0x8:0x110875
eax: 0xfc0000d4, ebx: 0x0, ecx: 0x1124bf, edx: 0x110310
esi: 0x1, edi: 0x0, ebp: 00, esp: 0x10ff
eflags: 0x246
Fatal fault in essential thread! Spinning...
--------------------------sanity-out/qemu_x86/tests/net/udp/test/qemu.log---------------------------
qemu_x86 tests/net/lib/dns_packet/test FAILED: timeout
---------------------sanity-out/qemu_x86/tests/net/lib/dns_packet/test/qemu.log---------------------
***** BOOTING ZEPHYR OS v1.7.99 - BUILD: Mar 31 2017 09:06:17 *****
ASSERTION FAIL [num_events > 0] @ /w/workspace/zephyr-sanity/kernel/poll.c:177:
zero events
---------------------sanity-out/qemu_x86/tests/net/lib/dns_packet/test/qemu.log---------------------
1 of 146 tests passed with 0 warnings in 10960 seconds
Extra environment setting:
CONFIG_ASSERT=y
CONFIG_DEBUG=y
Build step 'Execute shell' marked build as failure


job zephyr-sanity build number 655 failed
see: https://jenkins.zephyrproject.org/job/zephyr-sanity/655/

| 16| 16| 3253| 6336| 5794| 4918| 2525| 2761|
| 32| 32| 4775| 4301| 5633| 6701| 7440| 5680|
| 64| 64| 6290| 6143| 5830| 10174| 10418| 10977|
| 128| 128| 4416| 7161| 7627| 28985| 17874| 16782|
| 256| 256| 12071| 8157| 5634| 21207| 31384| 45438|
| 512| 512| 8803| 11660| 11669| 58161| 43910| 43876|
| 1024| 1024| 12049| 19851| 23957| 84986| 51584| 42743|
| 2048| 2048| 37456| 27786| 30006| 54677| 73706| 68253|
| 4096| 4096| 53313| 54847| 58268| 76829| 74680| 70295|
|-----------------------------------------------------------------------------|
| non-matching sizes (1_TO_N) to higher priority |
|-----------------------------------------------------------------------------|
| size(B) | time/packet (nsec) | KB/sec |
|-----------------------------------------------------------------------------|
| put | get | no buf | small buf| big buf | no buf | small buf| big buf |
|-----------------------------------------------------------------------------|
| 8| 4096| 2108| 1012| 1048| 3795| 7905| 7633|
| 16| 2048| 1143| 1039| 1555| 13998| 15399| 10289|
| 32| 1024| 2533| 2456| 1968| 12633| 13029| 16260|
| 64| 512| 2705| 1743| 1716| 23659| 36718| 37296|
| 128| 256| 5425| 7230| 3485| 23594| 17704| 36728|
| 256| 128| 46423| 16986| 14776| 5514| 15071| 17325|
| 512| 64| 44325| 42298| 31632| 11551| 12104| 16186|
| 1024| 32| 56207| 124770| 41032| 18218| 8207| 24956|
----------------sanity-out/qemu_x86/tests/legacy/benchmark/app_kernel/test/qemu.log-----------------
2 of 36 tests passed with 0 warnings in 274 seconds
Extra environment setting:
CONFIG_DEBUG=y
Build step 'Execute shell' marked build as failure


job zephyr-sanity build number 654 failed
see: https://jenkins.zephyrproject.org/job/zephyr-sanity/654/

| 4096| 4096| 60136| 37672| 37523| 68112| 108727| 109159|
|-----------------------------------------------------------------------------|
| non-matching sizes (1_TO_N) to higher priority |
|-----------------------------------------------------------------------------|
| size(B) | time/packet (nsec) | KB/sec |
|-----------------------------------------------------------------------------|
| put | get | no buf | small buf| big buf | no buf | small buf| big buf |
|-----------------------------------------------------------------------------|
| 8| 4096| 2152| 1888| 1290| 3717| 4237| 6201|
| 16| 2048| 1236| 1261| 1204| 12944| 12688| 13289|
| 32| 1024| 1492| 1583| 1998| 21447| 20214| 16016|
| 64| 512| 1999| 1909| 1866| 32016| 33525| 34297|
| 128| 256| 3503| 3648| 3309| 36540| 35087| 38682|
| 256| 128| 24190| 9661| 7816| 10582| 26498| 32753|
| 512| 64| 27415| 32202| 17850| 18675| 15899| 28683|
| 1024| 32| 50507| 55940| 47217| 20274| 18305| 21687|
-------------sanity-out/qemu_x86_iamcu/tests/legacy/benchmark/app_kernel/test/qemu.log--------------
qemu_x86 tests/net/lib/dns_packet/test FAILED: timeout
---------------------sanity-out/qemu_x86/tests/net/lib/dns_packet/test/qemu.log---------------------
***** BOOTING ZEPHYR OS v1.7.99 - BUILD: Mar 31 2017 05:40:23 *****
ASSERTION FAIL [num_events > 0] @ /w/workspace/zephyr-sanity/kernel/poll.c:177:
zero events
---------------------sanity-out/qemu_x86/tests/net/lib/dns_packet/test/qemu.log---------------------
Generating LALR tables
Platform 'arduino_101_mcuboot' not specified in any arch .ini file and will not be tested
0 of 120 tests passed with 0 warnings in 10900 seconds
Extra environment setting:
CONFIG_ASSERT=y
Build step 'Execute shell' marked build as failure


job zephyr-sanity build number 653 failed
see: https://jenkins.zephyrproject.org/job/zephyr-sanity/653/

| 16| 16| 6898| 6825| 7193| 2319| 2344| 2224|
| 32| 32| 7022| 6992| 7104| 4557| 4576| 4504|
| 64| 64| 7533| 7575| 7543| 8495| 8448| 8484|
| 128| 128| 8653| 8577| 8754| 14792| 14923| 14621|
| 256| 256| 10632| 10386| 10877| 24078| 24648| 23535|
| 512| 512| 12659| 15795| 14798| 40445| 32415| 34599|
| 1024| 1024| 22658| 22917| 22577| 45193| 44682| 45355|
| 2048| 2048| 38420| 38796| 37920| 53305| 52788| 54008|
| 4096| 4096| 70511| 68725| 66735| 58090| 59599| 61377|
|-----------------------------------------------------------------------------|
| non-matching sizes (1_TO_N) to higher priority |
|-----------------------------------------------------------------------------|
| size(B) | time/packet (nsec) | KB/sec |
|-----------------------------------------------------------------------------|
| put | get | no buf | small buf| big buf | no buf | small buf| big buf |
|-----------------------------------------------------------------------------|
| 8| 4096| 2535| 2149| 2288| 3155| 3722| 3496|
| 16| 2048| 2434| 2266| 2345| 6573| 7060| 6823|
| 32| 1024| 2827| 2697| 1739| 11319| 11865| 18401|
| 64| 512| 3804| 3759| 3771| 16824| 17025| 16971|
| 128| 256| 6812| 6766| 6864| 18790| 18918| 18648|
| 256| 128| 44221| 17542| 22105| 5789| 14593| 11581|
| 512| 64| 50966| 39605| 35431| 10045| 12927| 14450|
| 1024| 32| 90300| 114110| 94735| 11339| 8973| 10809|
Generating LALR tables
Platform 'arduino_101_mcuboot' not specified in any arch .ini file and will not be tested
-------------sanity-out/qemu_x86_iamcu/tests/legacy/benchmark/app_kernel/test/qemu.log--------------
0 of 2 tests passed with 0 warnings in 185 seconds
Build step 'Execute shell' marked build as failure