zephyr/master: daily build zephyr-kernel-1.7.99-170223-33746d4 Failure


donotreply@...
 

zephyr/master: daily build zephyr-kernel-1.7.99-170223-33746d4 Failure



job zephyr-sanity build number 516 failed
see: https://jenkins.zephyrproject.org/job/zephyr-sanity/516/

CC kernel/thread_abort.o
CC kernel/timer.o
CC kernel/work_q.o
make[7]: Target `__build' not remade because of errors.
make[6]: *** [ext/lib/crypto/mbedtls] Error 2
make[6]: Target `__build' not remade because of errors.
make[5]: *** [ext/lib/crypto] Error 2
make[5]: Target `__build' not remade because of errors.
make[4]: *** [ext/lib] Error 2
make[4]: Target `__build' not remade because of errors.
make[3]: *** [ext] Error 2
LD kernel/built-in.o
LD drivers/interrupt_controller/built-in.o
LD drivers/built-in.o
AR kernel/lib.a
make[3]: Target `all' not remade because of errors.
make[3]: Leaving directory `/w/workspace/zephyr-sanity/sanity-out/nucleo_f411re/tests/crypto/test_mbedtls/test'
make[2]: *** [sub-make] Error 2
make[2]: Target `all' not remade because of errors.
make[2]: Leaving directory `/w/workspace/zephyr-sanity'
make[1]: *** [all] Error 2
make[1]: Leaving directory `/w/workspace/zephyr-sanity/tests/crypto/test_mbedtls'
Generating LALR tables
-----------------sanity-out/nucleo_f411re/tests/crypto/test_mbedtls/test/build.log------------------
0 of 65 tests passed with 0 warnings in 79 seconds
Extra environment setting:
CONFIG_ASSERT=y
CONFIG_DEBUG=y
Build step 'Execute shell' marked build as failure


job zephyr-sanity build number 515 failed
see: https://jenkins.zephyrproject.org/job/zephyr-sanity/515/

make[5]: *** [ext/lib/crypto] Error 2
make[5]: Target `__build' not remade because of errors.
make[4]: *** [ext/lib] Error 2
make[4]: Target `__build' not remade because of errors.
make[3]: *** [ext] Error 2
make[3]: Target `all' not remade because of errors.
make[3]: Leaving directory `/w/workspace/zephyr-sanity/sanity-out/96b_carbon/tests/crypto/test_mbedtls/test'
make[2]: *** [sub-make] Error 2
make[2]: Target `all' not remade because of errors.
make[2]: Leaving directory `/w/workspace/zephyr-sanity'
make[1]: *** [all] Error 2
make[1]: Leaving directory `/w/workspace/zephyr-sanity/tests/crypto/test_mbedtls'
Generating LALR tables
-------------------sanity-out/96b_carbon/tests/crypto/test_mbedtls/test/build.log-------------------
qemu_x86 tests/net/udp/test FAILED: timeout
--------------------------sanity-out/qemu_x86/tests/net/udp/test/qemu.log---------------------------
***** BOOTING ZEPHYR OS v1.7.99 - BUILD: Feb 24 2017 02:41:41 *****
Timeout, packet not received
Timeout, packet not received
Timeout, packet not received
Timeout, packet not received
Cannot recv buf 0xff53f000, ret -78
Timeout, packet not received
Timeout, packet not received
--------------------------sanity-out/qemu_x86/tests/net/udp/test/qemu.log---------------------------
0 of 65 tests passed with 0 warnings in 112 seconds
Extra environment setting:
CONFIG_DEBUG=y
Build step 'Execute shell' marked build as failure


job zephyr-sanity build number 514 failed
see: https://jenkins.zephyrproject.org/job/zephyr-sanity/514/

CC kernel/pipes.o
CC kernel/sched.o
CC kernel/sem.o
CC arch/arm/core/cortex_m/exc_manage.o
CC kernel/stack.o
CC kernel/sys_clock.o
CC kernel/system_work_q.o
CC kernel/thread.o
CC kernel/thread_abort.o
CC kernel/timer.o
CC kernel/work_q.o
LD kernel/built-in.o
LD arch/arm/core/cortex_m/built-in.o
LD arch/arm/core/built-in.o
LD arch/arm/built-in.o
LD arch/built-in.o
AR kernel/lib.a
make[3]: Target `all' not remade because of errors.
make[3]: Leaving directory `/w/workspace/zephyr-sanity/sanity-out/nucleo_f334r8/samples/drivers/i2c_lsm9ds0/test'
make[2]: *** [sub-make] Error 2
make[2]: Target `all' not remade because of errors.
make[2]: Leaving directory `/w/workspace/zephyr-sanity'
make[1]: *** [all] Error 2
make[1]: Leaving directory `/w/workspace/zephyr-sanity/samples/drivers/i2c_lsm9ds0'
----------------sanity-out/nucleo_f334r8/samples/drivers/i2c_lsm9ds0/test/build.log-----------------
0 of 36 tests passed with 0 warnings in 32 seconds
Extra environment setting:
CONFIG_ASSERT=y
Build step 'Execute shell' marked build as failure


job zephyr-sanity build number 513 failed
see: https://jenkins.zephyrproject.org/job/zephyr-sanity/513/

CC kernel/sys_clock.o
CC kernel/system_work_q.o
AS arch/arm/core/cortex_m/reset.o
CC kernel/thread.o
AS arch/arm/core/cortex_m/nmi_on_reset.o
CC kernel/thread_abort.o
CC arch/arm/core/cortex_m/prep_c.o
CC arch/arm/core/cortex_m/scb.o
CC kernel/timer.o
CC kernel/work_q.o
CC arch/arm/core/cortex_m/nmi.o
LD kernel/built-in.o
CC arch/arm/core/cortex_m/exc_manage.o
LD arch/arm/core/cortex_m/built-in.o
LD arch/arm/core/built-in.o
LD arch/arm/built-in.o
LD arch/built-in.o
AR kernel/lib.a
make[3]: Target `all' not remade because of errors.
make[3]: Leaving directory `/w/workspace/zephyr-sanity/sanity-out/stm32373c_eval/samples/drivers/i2c_lsm9ds0/test'
make[2]: *** [sub-make] Error 2
make[2]: Target `all' not remade because of errors.
make[2]: Leaving directory `/w/workspace/zephyr-sanity'
make[1]: *** [all] Error 2
make[1]: Leaving directory `/w/workspace/zephyr-sanity/samples/drivers/i2c_lsm9ds0'
Generating LALR tables
----------------sanity-out/stm32373c_eval/samples/drivers/i2c_lsm9ds0/test/build.log----------------
0 of 34 tests passed with 0 warnings in 30 seconds
Build step 'Execute shell' marked build as failure