zephyr/master: daily build zephyr-kernel-1.7.99-170406-bf902e6 Failure


donotreply@...
 

zephyr/master: daily build zephyr-kernel-1.7.99-170406-bf902e6 Failure



job zephyr-sanity build number 684 failed
see: https://jenkins.zephyrproject.org/job/zephyr-sanity/684/

--------------------------sanity-out/qemu_x86/tests/net/nbuf/test/qemu.log--------------------------
***** BOOTING ZEPHYR OS v1.7.99 - BUILD: Apr 7 2017 05:10:24 *****
ASSERTION FAIL [num_events > 0] @ /w/workspace/zephyr-sanity/kernel/poll.c:177:
zero events
--------------------------sanity-out/qemu_x86/tests/net/nbuf/test/qemu.log--------------------------
qemu_x86 tests/net/udp/test FAILED: timeout
--------------------------sanity-out/qemu_x86/tests/net/udp/test/qemu.log---------------------------
***** BOOTING ZEPHYR OS v1.7.99 - BUILD: Apr 7 2017 05:10:39 *****
***** CPU exception 5
Current thread ID = 0x001125c0
Faulting segment:address = 0x8:0x110885
eax: 0xa3, ebx: 0x0, ecx: 0x1125bf, edx: 0x110498
esi: 0x1, edi: 0x0, ebp: 00, esp: 0x1129ac
eflags: 0x202
Fatal fault in essential thread! Spinning...
--------------------------sanity-out/qemu_x86/tests/net/udp/test/qemu.log---------------------------
qemu_x86 tests/net/lib/dns_packet/test FAILED: timeout
---------------------sanity-out/qemu_x86/tests/net/lib/dns_packet/test/qemu.log---------------------
***** BOOTING ZEPHYR OS v1.7.99 - BUILD: Apr 7 2017 05:08:23 *****
ASSERTION FAIL [num_events > 0] @ /w/workspace/zephyr-sanity/kernel/poll.c:177:
zero events
---------------------sanity-out/qemu_x86/tests/net/lib/dns_packet/test/qemu.log---------------------
qemu_nios2 tests/legacy/kernel/test_sleep/test WARNING: rom_size +1208, is now 18804 +6.87%
Deltas based on metrics from last release
1 of 144 tests passed with 1 warnings in 10916 seconds
Extra environment setting:
CONFIG_ASSERT=y
CONFIG_DEBUG=y
Build step 'Execute shell' marked build as failure


job zephyr-sanity build number 683 failed
see: https://jenkins.zephyrproject.org/job/zephyr-sanity/683/

| 16| 16| 6777| 6691| 6159| 2360| 2391| 2597|
| 32| 32| 6786| 7872| 6657| 4715| 4065| 4806|
| 64| 64| 7460| 7376| 5792| 8579| 8676| 11049|
| 128| 128| 7812| 7855| 6648| 16385| 16295| 19253|
| 256| 256| 9200| 6067| 6261| 27826| 42195| 40888|
| 512| 512| 11957| 11958| 9765| 42820| 42816| 52432|
| 1024| 1024| 17755| 13015| 17645| 57673| 78678| 58033|
| 2048| 2048| 26438| 28773| 28269| 77464| 71177| 72446|
| 4096| 4096| 27326| 46921| 49927| 149893| 87295| 82039|
|-----------------------------------------------------------------------------|
| non-matching sizes (1_TO_N) to higher priority |
|-----------------------------------------------------------------------------|
| size(B) | time/packet (nsec) | KB/sec |
|-----------------------------------------------------------------------------|
| put | get | no buf | small buf| big buf | no buf | small buf| big buf |
|-----------------------------------------------------------------------------|
| 8| 4096| 2632| 2095| 1808| 3039| 3818| 4424|
| 16| 2048| 1498| 2394| 2223| 10680| 6683| 7197|
| 32| 1024| 2738| 2582| 2681| 11687| 12393| 11935|
| 64| 512| 3440| 3508| 2074| 18604| 18244| 30858|
| 128| 256| 6161| 6117| 4241| 20775| 20925| 30181|
| 256| 128| 32277| 11930| 13872| 7931| 21458| 18454|
| 512| 64| 38216| 24958| 32681| 13397| 20514| 15666|
| 1024| 32| 95590| 76870| 74972| 10712| 13321| 13658|
----------------sanity-out/qemu_x86/tests/legacy/benchmark/app_kernel/test/qemu.log-----------------
0 of 32 tests passed with 0 warnings in 200 seconds
Extra environment setting:
CONFIG_DEBUG=y
Build step 'Execute shell' marked build as failure


job zephyr-sanity build number 682 failed
see: https://jenkins.zephyrproject.org/job/zephyr-sanity/682/

|-----------------------------------------------------------------------------|
| non-matching sizes (1_TO_N) to higher priority |
|-----------------------------------------------------------------------------|
| size(B) | time/packet (nsec) | KB/sec |
|-----------------------------------------------------------------------------|
| put | get | no buf | small buf| big buf | no buf | small buf| big buf |
|-----------------------------------------------------------------------------|
| 8| 4096| 2377| 1233| 1250| 3365| 6488| 6400|
| 16| 2048| 1210| 1143| 1148| 13223| 13998| 13937|
| 32| 1024| 1375| 2571| 1880| 23272| 12446| 17021|
| 64| 512| 1961| 2438| 2102| 32636| 26251| 30447|
| 128| 256| 4690| 3913| 3676| 27292| 32711| 34820|
| 256| 128| 25803| 11430| 8090| 9921| 22397| 31644|
| 512| 64| 80558| 32858| 32290| 6355| 15582| 15856|
| 1024| 32| 119560| 99400| 60412| 8564| 10301| 16950|
Generating LALR tables
Platform 'arduino_101_mcuboot' not specified in any arch .ini file and will not be tested
Platform 'nrf52_blenano2' not specified in any arch .ini file and will not be tested
----------------sanity-out/qemu_x86/tests/legacy/benchmark/app_kernel/test/qemu.log-----------------
qemu_x86 tests/net/lib/dns_packet/test FAILED: timeout
---------------------sanity-out/qemu_x86/tests/net/lib/dns_packet/test/qemu.log---------------------
***** BOOTING ZEPHYR OS v1.7.99 - BUILD: Apr 7 2017 05:42:01 *****
ASSERTION FAIL [num_events > 0] @ /w/workspace/zephyr-sanity/kernel/poll.c:177:
zero events
---------------------sanity-out/qemu_x86/tests/net/lib/dns_packet/test/qemu.log---------------------
0 of 121 tests passed with 0 warnings in 10906 seconds
Extra environment setting:
CONFIG_ASSERT=y
Build step 'Execute shell' marked build as failure


job zephyr-sanity build number 681 failed
see: https://jenkins.zephyrproject.org/job/zephyr-sanity/681/

| 32| 32| 7028| 3597| 6966| 4553| 8896| 4593|
| 64| 64| 7223| 6937| 7461| 8860| 9225| 8577|
| 128| 128| 8170| 8620| 8366| 15667| 14849| 15300|
| 256| 256| 9819| 10736| 11162| 26071| 23845| 22934|
| 512| 512| 14315| 9302| 14301| 35766| 55041| 35801|
| 1024| 1024| 22721| 22911| 22766| 45068| 44694| 44979|
| 2048| 2048| 38640| 39399| 39509| 53002| 51981| 51836|
| 4096| 4096| 71024| 71357| 69615| 57670| 57401| 58837|
|-----------------------------------------------------------------------------|
| non-matching sizes (1_TO_N) to higher priority |
|-----------------------------------------------------------------------------|
| size(B) | time/packet (nsec) | KB/sec |
|-----------------------------------------------------------------------------|
| put | get | no buf | small buf| big buf | no buf | small buf| big buf |
|-----------------------------------------------------------------------------|
| 8| 4096| 2702| 1999| 2467| 2960| 4002| 3242|
| 16| 2048| 2571| 3153| 2498| 6223| 5074| 6405|
| 32| 1024| 2869| 2841| 2449| 11153| 11263| 13066|
| 64| 512| 3848| 3859| 4201| 16632| 16584| 15234|
| 128| 256| 7228| 7824| 7123| 17708| 16359| 17969|
| 256| 128| 75772| 18059| 15298| 3378| 14175| 16734|
| 512| 64| 51838| 39465| 34737| 9876| 12973| 14739|
| 1024| 32| 134615| 103990| 94592| 7606| 9847| 10825|
Generating LALR tables
Platform 'arduino_101_mcuboot' not specified in any arch .ini file and will not be tested
Platform 'nrf52_blenano2' not specified in any arch .ini file and will not be tested
-------------sanity-out/qemu_x86_iamcu/tests/legacy/benchmark/app_kernel/test/qemu.log--------------
0 of 4 tests passed with 0 warnings in 186 seconds
Build step 'Execute shell' marked build as failure