zephyr/master: daily build zephyr-kernel-1.7.99-170412-6702686 Failure


donotreply@...
 

zephyr/master: daily build zephyr-kernel-1.7.99-170412-6702686 Failure



job zephyr-sanity build number 708 failed
see: https://jenkins.zephyrproject.org/job/zephyr-sanity/708/

| non-matching sizes (1_TO_N) to higher priority |
|-----------------------------------------------------------------------------|
| size(B) | time/packet (nsec) | KB/sec |
|-----------------------------------------------------------------------------|
| put | get | no buf | small buf| big buf | no buf | small buf| big buf |
|-----------------------------------------------------------------------------|
| 8| 4096| 1553| 958| 1054| 5151| 8350| 7590|
| 16| 2048| 1055| 938| 997| 15165| 17057| 16048|
| 32| 1024| 1152| 1164| 1142| 27777| 27491| 28021|
| 64| 512| 1879| 6548| 1528| 34060| 9773| 41884|
| 128| 256| 3484| 5186| 5302| 36739| 24681| 24141|
| 256| 128| 49614| 7411| 6184| 5159| 34543| 41397|
| 512| 64| 52278| 24417| 24121| 9793| 20968| 21226|
| 1024| 32| 86982| 47207| 73462| 11772| 21691| 13939|
| 2048| 16| 270455| 158040| 115130| 7572| 12958| 17788|
----------------sanity-out/qemu_x86_iamcu/tests/benchmarks/app_kernel/test/qemu.log-----------------
qemu_x86 tests/net/lib/dns_packet/test FAILED: timeout
---------------------sanity-out/qemu_x86/tests/net/lib/dns_packet/test/qemu.log---------------------
***** BOOTING ZEPHYR OS v1.7.99 - BUILD: Apr 13 2017 07:21:54 *****
ASSERTION FAIL [num_events > 0] @ /w/workspace/zephyr-sanity/kernel/poll.c:177:
zero events
---------------------sanity-out/qemu_x86/tests/net/lib/dns_packet/test/qemu.log---------------------
Generating LALR tables
Platform 'nrf52_blenano2' not specified in any arch .ini file and will not be tested
1 of 175 tests passed with 0 warnings in 11029 seconds
Extra environment setting:
CONFIG_ASSERT=y
CONFIG_DEBUG=y
Build step 'Execute shell' marked build as failure


job zephyr-sanity build number 707 failed
see: https://jenkins.zephyrproject.org/job/zephyr-sanity/707/

|-----------------------------------------------------------------------------|
| non-matching sizes (1_TO_N) to higher priority |
|-----------------------------------------------------------------------------|
| size(B) | time/packet (nsec) | KB/sec |
|-----------------------------------------------------------------------------|
| put | get | no buf | small buf| big buf | no buf | small buf| big buf |
|-----------------------------------------------------------------------------|
| 8| 4096| 1057| 889| 967| 7568| 8998| 8273|
| 16| 2048| 902| 899| 960| 17738| 17797| 16666|
| 32| 1024| 1376| 1072| 1220| 23255| 29850| 26229|
| 64| 512| 1523| 1514| 1764| 42022| 42272| 36281|
| 128| 256| 5592| 5583| 5265| 22889| 22926| 24311|
| 256| 128| 34660| 11265| 11750| 7386| 22725| 21787|
| 512| 64| 25342| 19543| 15215| 20203| 26198| 33651|
| 1024| 32| 85987| 104022| 37540| 11908| 9844| 27277|
| 2048| 16| 290700| 290400| 131740| 7045| 7052| 15545|
| 4096| 8| 592270| 517070| 523010| 6915| 7921| 7831|
|-----------------------------------------------------------------------------|
| non-matching sizes (1_TO_N) to lower priority |
|-----------------------------------------------------------------------------|
| size(B) | time/packet (nsec) | KB/sec |
|-----------------------------------------------------------------------------|
| put | get | no buf | small buf| big buf | no buf | small buf| big buf |
|-----------------------------------------------------------------------------|
----------------sanity-out/qemu_x86_iamcu/tests/benchmarks/app_kernel/test/qemu.log-----------------
0 of 35 tests passed with 0 warnings in 218 seconds
Extra environment setting:
CONFIG_DEBUG=y
Build step 'Execute shell' marked build as failure


job zephyr-sanity build number 706 failed
see: https://jenkins.zephyrproject.org/job/zephyr-sanity/706/

make[2]: Target `all' not remade because of errors.
make[2]: Leaving directory `/w/workspace/zephyr-sanity'
make[1]: *** [all] Error 2
make[1]: Leaving directory `/w/workspace/zephyr-sanity/tests/bluetooth/init'
Generating LALR tables
Platform 'nrf52_blenano2' not specified in any arch .ini file and will not be tested
--------------sanity-out/nrf51_pca10028/tests/bluetooth/init/test_controller/build.log--------------
qemu_x86 tests/net/trickle/test FAILED: timeout
------------------------sanity-out/qemu_x86/tests/net/trickle/test/qemu.log-------------------------
***** BOOTING ZEPHYR OS v1.7.99 - BUILD: Apr 13 2017 09:57:21 *****
ASSERTION FAIL [num_events > 0] @ /w/workspace/zephyr-sanity/kernel/poll.c:177:
zero events
------------------------sanity-out/qemu_x86/tests/net/trickle/test/qemu.log-------------------------
qemu_x86 tests/net/lib/http_header_fields/test FAILED: timeout
-----------------sanity-out/qemu_x86/tests/net/lib/http_header_fields/test/qemu.log-----------------
***** BOOTING ZEPHYR OS v1.7.99 - BUILD: Apr 13 2017 09:57:50 *****
ASSERTION FAIL [num_events > 0] @ /w/workspace/zephyr-sanity/kernel/poll.c:177:
zero events
-----------------sanity-out/qemu_x86/tests/net/lib/http_header_fields/test/qemu.log-----------------
qemu_x86 tests/net/lib/dns_packet/test FAILED: timeout
---------------------sanity-out/qemu_x86/tests/net/lib/dns_packet/test/qemu.log---------------------
***** BOOTING ZEPHYR OS v1.7.99 - BUILD: Apr 13 2017 09:57:51 *****
ASSERTION FAIL [num_events > 0] @ /w/workspace/zephyr-sanity/kernel/poll.c:177:
zero events
---------------------sanity-out/qemu_x86/tests/net/lib/dns_packet/test/qemu.log---------------------
2 of 149 tests passed with 0 warnings in 11235 seconds
Extra environment setting:
CONFIG_ASSERT=y
Build step 'Execute shell' marked build as failure


job zephyr-sanity build number 705 failed
see: https://jenkins.zephyrproject.org/job/zephyr-sanity/705/

|-----------------------------------------------------------------------------|
| non-matching sizes (1_TO_N) to higher priority |
|-----------------------------------------------------------------------------|
| size(B) | time/packet (nsec) | KB/sec |
|-----------------------------------------------------------------------------|
| put | get | no buf | small buf| big buf | no buf | small buf| big buf |
|-----------------------------------------------------------------------------|
| 8| 4096| 2367| 1738| 1771| 3379| 4602| 4517|
| 16| 2048| 1844| 1776| 1651| 8676| 9009| 9691|
| 32| 1024| 2284| 2118| 1271| 14010| 15108| 25177|
| 64| 512| 1889| 1872| 1840| 33880| 34188| 34782|
| 128| 256| 5792| 3311| 3444| 22099| 38659| 37166|
| 256| 128| 39362| 17601| 12411| 6503| 14544| 20626|
| 512| 64| 26515| 37752| 17506| 19309| 13562| 29247|
| 1024| 32| 46572| 66150| 69677| 21987| 15479| 14696|
| 2048| 16| 146160| 174340| 127905| 14012| 11747| 16011|
| 4096| 8| 575450| 534720| 482260| 7117| 7660| 8493|
|-----------------------------------------------------------------------------|
| non-matching sizes (1_TO_N) to lower priority |
|-----------------------------------------------------------------------------|
| size(B) | time/packet (nsec) | KB/sec |
|-----------------------------------------------------------------------------|
| put | get | no buf | small buf| big buf | no buf | small buf| big buf |
|-----------------------------------------------------------------------------|
Generating LALR tables
Platform 'nrf52_blenano2' not specified in any arch .ini file and will not be tested
----------------sanity-out/qemu_x86_iamcu/tests/benchmarks/app_kernel/test/qemu.log-----------------
0 of 6 tests passed with 0 warnings in 194 seconds
Build step 'Execute shell' marked build as failure