zephyr/master: daily build zephyr-kernel-1.7.99-170414-ab1555e Failure


donotreply@...
 

zephyr/master: daily build zephyr-kernel-1.7.99-170414-ab1555e Failure



job zephyr-sanity build number 716 failed
see: https://jenkins.zephyrproject.org/job/zephyr-sanity/716/

make[1]: *** [all] Error 2
make[1]: Leaving directory `/w/workspace/zephyr-sanity/tests/bluetooth/init'
---------------------sanity-out/qemu_x86/tests/bluetooth/init/test_17/build.log---------------------
qemu_x86 tests/net/lib/zoap/test FAILED: timeout
Generating LALR tables
------------------------sanity-out/qemu_x86/tests/net/lib/zoap/test/qemu.log------------------------
***** BOOTING ZEPHYR OS v1.7.99 - BUILD: Apr 15 2017 05:56:40 *****
ASSERTION FAIL [num_events > 0] @ /w/workspace/zephyr-sanity/kernel/poll.c:177:
zero events
------------------------sanity-out/qemu_x86/tests/net/lib/zoap/test/qemu.log------------------------
qemu_x86 tests/net/neighbor/test FAILED: timeout
------------------------sanity-out/qemu_x86/tests/net/neighbor/test/qemu.log------------------------
***** BOOTING ZEPHYR OS v1.7.99 - BUILD: Apr 15 2017 05:56:41 *****
ASSERTION FAIL [num_events > 0] @ /w/workspace/zephyr-sanity/kernel/poll.c:177:
zero events
------------------------sanity-out/qemu_x86/tests/net/neighbor/test/qemu.log------------------------
qemu_x86 tests/net/lib/dns_packet/test FAILED: timeout
---------------------sanity-out/qemu_x86/tests/net/lib/dns_packet/test/qemu.log---------------------
***** BOOTING ZEPHYR OS v1.7.99 - BUILD: Apr 15 2017 05:54:34 *****
ASSERTION FAIL [num_events > 0] @ /w/workspace/zephyr-sanity/kernel/poll.c:177:
zero events
---------------------sanity-out/qemu_x86/tests/net/lib/dns_packet/test/qemu.log---------------------
qemu_nios2 tests/legacy/kernel/test_sleep/test WARNING: rom_size +1160, is now 18756 +6.59%
Deltas based on metrics from last release
1 of 168 tests passed with 1 warnings in 10858 seconds
Extra environment setting:
CONFIG_ASSERT=y
CONFIG_DEBUG=y
Build step 'Execute shell' marked build as failure


job zephyr-sanity build number 715 failed
see: https://jenkins.zephyrproject.org/job/zephyr-sanity/715/

TR =0000 00000000 0000ffff 00008b00 DPL=0 TSS32-busy
GDT= 00100070 00000017
IDT= 00102e70 000007ff
CR0=0000003f CR2=00000000 CR3=00000000 CR4=00000000
DR0=00000000 DR1=00000000 DR2=00000000 DR3=00000000
DR6=ffff0ff0 DR7=00000400
CCS=0000000a CCD=0000003c CCO=CLR
EFER=0000000000000000
FCW=037f FSW=0000 [ST=0] FTW=00 MXCSR=00001f80
FPR0=0000000000000000 0000 FPR1=0000000000000000 0000
FPR2=0000000000000000 0000 FPR3=0000000000000000 0000
FPR4=0000000000000000 0000 FPR5=0000000000000000 0000
FPR6=0000000000000000 0000 FPR7=0000000000000000 0000
XMM00=00000000000000000000000000000000 XMM01=00000000000000000000000000000000
XMM02=00000000000000000000000000000000 XMM03=00000000000000000000000000000000
XMM04=00000000000000000000000000000000 XMM05=00000000000000000000000000000000
XMM06=00000000000000000000000000000000 XMM07=00000000000000000000000000000000
make[3]: *** [run] Aborted (core dumped)
make[3]: Leaving directory `/w/workspace/zephyr-sanity/sanity-out/qemu_x86/tests/legacy/kernel/test_sleep/test'
make[2]: *** [sub-make] Error 2
make[2]: Target `run' not remade because of errors.
make[2]: Leaving directory `/w/workspace/zephyr-sanity'
make[1]: *** [run] Error 2
make[1]: Leaving directory `/w/workspace/zephyr-sanity/tests/legacy/kernel/test_sleep'
------------------sanity-out/qemu_x86/tests/legacy/kernel/test_sleep/test/run.log-------------------
1 of 33 tests passed with 0 warnings in 34 seconds
Extra environment setting:
CONFIG_DEBUG=y
Build step 'Execute shell' marked build as failure


job zephyr-sanity build number 714 failed
see: https://jenkins.zephyrproject.org/job/zephyr-sanity/714/

--------------------sanity-out/qemu_x86/tests/net/lib/mqtt_packet/test/qemu.log---------------------
qemu_x86 tests/net/neighbor/test FAILED: timeout
------------------------sanity-out/qemu_x86/tests/net/neighbor/test/qemu.log------------------------
***** BOOTING ZEPHYR OS v1.7.99 - BUILD: Apr 15 2017 06:33:42 *****
ASSERTION FAIL [num_events > 0] @ /w/workspace/zephyr-sanity/kernel/poll.c:177:
zero events
------------------------sanity-out/qemu_x86/tests/net/neighbor/test/qemu.log------------------------
qemu_x86 tests/net/lib/zoap/test FAILED: timeout
------------------------sanity-out/qemu_x86/tests/net/lib/zoap/test/qemu.log------------------------
***** BOOTING ZEPHYR OS v1.7.99 - BUILD: Apr 15 2017 06:33:51 *****
ASSERTION FAIL [num_events > 0] @ /w/workspace/zephyr-sanity/kernel/poll.c:177:
zero events
------------------------sanity-out/qemu_x86/tests/net/lib/zoap/test/qemu.log------------------------
qemu_x86 tests/net/icmpv6/test FAILED: timeout
-------------------------sanity-out/qemu_x86/tests/net/icmpv6/test/qemu.log-------------------------
***** BOOTING ZEPHYR OS v1.7.99 - BUILD: Apr 15 2017 06:33:53 *****
ASSERTION FAIL [num_events > 0] @ /w/workspace/zephyr-sanity/kernel/poll.c:177:
zero events
-------------------------sanity-out/qemu_x86/tests/net/icmpv6/test/qemu.log-------------------------
qemu_x86 tests/net/lib/dns_packet/test FAILED: timeout
---------------------sanity-out/qemu_x86/tests/net/lib/dns_packet/test/qemu.log---------------------
***** BOOTING ZEPHYR OS v1.7.99 - BUILD: Apr 15 2017 06:33:26 *****
ASSERTION FAIL [num_events > 0] @ /w/workspace/zephyr-sanity/kernel/poll.c:177:
zero events
---------------------sanity-out/qemu_x86/tests/net/lib/dns_packet/test/qemu.log---------------------
0 of 145 tests passed with 0 warnings in 10950 seconds
Extra environment setting:
CONFIG_ASSERT=y
Build step 'Execute shell' marked build as failure


job zephyr-sanity build number 713 failed
see: https://jenkins.zephyrproject.org/job/zephyr-sanity/713/

CC kernel/sem.o
CC kernel/stack.o
CC kernel/sys_clock.o
LD drivers/built-in.o
CC kernel/system_work_q.o
CC kernel/thread.o
CC kernel/thread_abort.o
CC kernel/timer.o
CC kernel/work_q.o
LD kernel/built-in.o
AR kernel/lib.a
AR libzephyr.a
LINK zephyr.lnk
/opt/zephyr-sdk-0.9/sysroots/x86_64-pokysdk-linux/usr/libexec/arm-zephyr-eabi/gcc/arm-zephyr-eabi/6.2.0/real-ld: zephyr_prebuilt.elf section `bss' will not fit in region `SRAM'
/opt/zephyr-sdk-0.9/sysroots/x86_64-pokysdk-linux/usr/libexec/arm-zephyr-eabi/gcc/arm-zephyr-eabi/6.2.0/real-ld: section .intList VMA [0000000020004000,0000000020004083] overlaps section bss VMA [0000000020000630,00000000200055eb]
/opt/zephyr-sdk-0.9/sysroots/x86_64-pokysdk-linux/usr/libexec/arm-zephyr-eabi/gcc/arm-zephyr-eabi/6.2.0/real-ld: region `SRAM' overflowed by 22028 bytes
collect2: error: ld returned 1 exit status
make[3]: *** [zephyr_prebuilt.elf] Error 1
make[3]: Target `all' not remade because of errors.
make[3]: Leaving directory `/w/workspace/zephyr-sanity/sanity-out/bbc_microbit/tests/benchmarks/app_kernel/test'
make[2]: *** [sub-make] Error 2
make[2]: Target `all' not remade because of errors.
make[2]: Leaving directory `/w/workspace/zephyr-sanity'
make[1]: *** [all] Error 2
make[1]: Leaving directory `/w/workspace/zephyr-sanity/tests/benchmarks/app_kernel'
Generating LALR tables
-----------------sanity-out/bbc_microbit/tests/benchmarks/app_kernel/test/build.log-----------------
0 of 6 tests passed with 0 warnings in 13 seconds
Build step 'Execute shell' marked build as failure