zephyr/master: daily build zephyr-kernel-1.7.99-170418-c09b4b8 Failure


donotreply@...
 

zephyr/master: daily build zephyr-kernel-1.7.99-170418-c09b4b8 Failure



job zephyr-sanity build number 732 failed
see: https://jenkins.zephyrproject.org/job/zephyr-sanity/732/

--------------------------sanity-out/qemu_x86/tests/net/nbuf/test/qemu.log--------------------------
***** BOOTING ZEPHYR OS v1.7.99 - BUILD: Apr 19 2017 07:43:14 *****
ASSERTION FAIL [num_events > 0] @ /w/workspace/zephyr-sanity/kernel/poll.c:177:
zero events
Generating LALR tables
--------------------------sanity-out/qemu_x86/tests/net/nbuf/test/qemu.log--------------------------
qemu_x86 tests/net/lib/mqtt_packet/test FAILED: timeout
--------------------sanity-out/qemu_x86/tests/net/lib/mqtt_packet/test/qemu.log---------------------
***** BOOTING ZEPHYR OS v1.7.99 - BUILD: Apr 19 2017 07:43:34 *****
ASSERTION FAIL [num_events > 0] @ /w/workspace/zephyr-sanity/kernel/poll.c:177:
zero events
--------------------sanity-out/qemu_x86/tests/net/lib/mqtt_packet/test/qemu.log---------------------
qemu_x86 tests/net/neighbor/test FAILED: timeout
------------------------sanity-out/qemu_x86/tests/net/neighbor/test/qemu.log------------------------
***** BOOTING ZEPHYR OS v1.7.99 - BUILD: Apr 19 2017 07:43:42 *****
ASSERTION FAIL [num_events > 0] @ /w/workspace/zephyr-sanity/kernel/poll.c:177:
zero events
------------------------sanity-out/qemu_x86/tests/net/neighbor/test/qemu.log------------------------
qemu_x86 tests/net/lib/dns_packet/test FAILED: timeout
---------------------sanity-out/qemu_x86/tests/net/lib/dns_packet/test/qemu.log---------------------
***** BOOTING ZEPHYR OS v1.7.99 - BUILD: Apr 19 2017 07:41:08 *****
ASSERTION FAIL [num_events > 0] @ /w/workspace/zephyr-sanity/kernel/poll.c:177:
zero events
---------------------sanity-out/qemu_x86/tests/net/lib/dns_packet/test/qemu.log---------------------
0 of 162 tests passed with 0 warnings in 10992 seconds
Extra environment setting:
CONFIG_ASSERT=y
CONFIG_DEBUG=y
Build step 'Execute shell' marked build as failure


job zephyr-sanity build number 731 failed
see: https://jenkins.zephyrproject.org/job/zephyr-sanity/731/

TR =0000 00000000 0000ffff 00008b00 DPL=0 TSS32-busy
GDT= 00100070 00000017
IDT= 00102c50 000007ff
CR0=0000003f CR2=00000000 CR3=00000000 CR4=00000000
DR0=00000000 DR1=00000000 DR2=00000000 DR3=00000000
DR6=ffff0ff0 DR7=00000400
CCS=0000000a CCD=0000003c CCO=CLR
EFER=0000000000000000
FCW=037f FSW=0000 [ST=0] FTW=00 MXCSR=00001f80
FPR0=0000000000000000 0000 FPR1=0000000000000000 0000
FPR2=0000000000000000 0000 FPR3=0000000000000000 0000
FPR4=0000000000000000 0000 FPR5=0000000000000000 0000
FPR6=0000000000000000 0000 FPR7=0000000000000000 0000
XMM00=00000000000000000000000000000000 XMM01=00000000000000000000000000000000
XMM02=00000000000000000000000000000000 XMM03=00000000000000000000000000000000
XMM04=00000000000000000000000000000000 XMM05=00000000000000000000000000000000
XMM06=00000000000000000000000000000000 XMM07=00000000000000000000000000000000
make[3]: *** [run] Aborted (core dumped)
make[3]: Leaving directory `/w/workspace/zephyr-sanity/sanity-out/qemu_x86/tests/kernel/test_sleep/test'
make[2]: *** [sub-make] Error 2
make[2]: Target `run' not remade because of errors.
make[2]: Leaving directory `/w/workspace/zephyr-sanity'
make[1]: *** [run] Error 2
make[1]: Leaving directory `/w/workspace/zephyr-sanity/tests/kernel/test_sleep'
----------------------sanity-out/qemu_x86/tests/kernel/test_sleep/test/run.log----------------------
0 of 26 tests passed with 0 warnings in 33 seconds
Extra environment setting:
CONFIG_DEBUG=y
Build step 'Execute shell' marked build as failure


job zephyr-sanity build number 730 failed
see: https://jenkins.zephyrproject.org/job/zephyr-sanity/730/

make[2]: *** [sub-make] Error 2
make[2]: Target `all' not remade because of errors.
make[2]: Leaving directory `/w/workspace/zephyr-sanity'
make[1]: *** [all] Error 2
make[1]: Leaving directory `/w/workspace/zephyr-sanity/tests/bluetooth/init'
------------------sanity-out/qemu_cortex_m3/tests/bluetooth/init/test_21/build.log------------------
Generating LALR tables
qemu_x86 tests/net/lib/mqtt_packet/test FAILED: timeout
--------------------sanity-out/qemu_x86/tests/net/lib/mqtt_packet/test/qemu.log---------------------
***** BOOTING ZEPHYR OS v1.7.99 - BUILD: Apr 19 2017 06:00:09 *****
ASSERTION FAIL [num_events > 0] @ /w/workspace/zephyr-sanity/kernel/poll.c:177:
zero events
--------------------sanity-out/qemu_x86/tests/net/lib/mqtt_packet/test/qemu.log---------------------
qemu_x86 tests/net/nbuf/test FAILED: timeout
--------------------------sanity-out/qemu_x86/tests/net/nbuf/test/qemu.log--------------------------
***** BOOTING ZEPHYR OS v1.7.99 - BUILD: Apr 19 2017 06:00:10 *****
ASSERTION FAIL [num_events > 0] @ /w/workspace/zephyr-sanity/kernel/poll.c:177:
zero events
--------------------------sanity-out/qemu_x86/tests/net/nbuf/test/qemu.log--------------------------
qemu_x86 tests/net/lib/dns_packet/test FAILED: timeout
---------------------sanity-out/qemu_x86/tests/net/lib/dns_packet/test/qemu.log---------------------
***** BOOTING ZEPHYR OS v1.7.99 - BUILD: Apr 19 2017 06:00:11 *****
ASSERTION FAIL [num_events > 0] @ /w/workspace/zephyr-sanity/kernel/poll.c:177:
zero events
---------------------sanity-out/qemu_x86/tests/net/lib/dns_packet/test/qemu.log---------------------
0 of 139 tests passed with 0 warnings in 11066 seconds
Extra environment setting:
CONFIG_ASSERT=y
Build step 'Execute shell' marked build as failure