zephyr/master: daily build zephyr-kernel-1.7.99-170419-0ffb648 Failure


donotreply@...
 

zephyr/master: daily build zephyr-kernel-1.7.99-170419-0ffb648 Failure



job zephyr-sanity build number 736 failed
see: https://jenkins.zephyrproject.org/job/zephyr-sanity/736/

CC src/rand32.o
CC src/timeout_order.o
CC src/clock.o
LD src/built-in.o
AR libzephyr.a
LINK zephyr.lnk
/opt/zephyr-sdk-0.9/sysroots/x86_64-pokysdk-linux/usr/libexec/i586-zephyr-elfiamcu/gcc/i586-zephyr-elfiamcu/6.2.0/real-ld: zephyr_prebuilt.elf section `rodata' will not fit in region `ROM'
/opt/zephyr-sdk-0.9/sysroots/x86_64-pokysdk-linux/usr/libexec/i586-zephyr-elfiamcu/gcc/i586-zephyr-elfiamcu/6.2.0/real-ld: region `ROM' overflowed by 6824 bytes
collect2: error: ld returned 1 exit status
make[3]: *** [zephyr_prebuilt.elf] Error 1
make[3]: Target `all' not remade because of errors.
make[3]: Leaving directory `/w/workspace/zephyr-sanity/sanity-out/quark_d2000_crb/tests/kernel/common/test'
make[2]: *** [sub-make] Error 2
make[2]: Target `all' not remade because of errors.
make[2]: Leaving directory `/w/workspace/zephyr-sanity'
make[1]: *** [all] Error 2
make[1]: Leaving directory `/w/workspace/zephyr-sanity/tests/kernel/common'
-------------------sanity-out/quark_d2000_crb/tests/kernel/common/test/build.log--------------------
qemu_x86 tests/net/lib/dns_packet/test FAILED: timeout
---------------------sanity-out/qemu_x86/tests/net/lib/dns_packet/test/qemu.log---------------------
***** BOOTING ZEPHYR OS v1.7.99 - BUILD: Apr 20 2017 08:15:37 *****
ASSERTION FAIL [num_events > 0] @ /w/workspace/zephyr-sanity/kernel/poll.c:177:
zero events
---------------------sanity-out/qemu_x86/tests/net/lib/dns_packet/test/qemu.log---------------------
0 of 161 tests passed with 0 warnings in 11032 seconds
Extra environment setting:
CONFIG_ASSERT=y
CONFIG_DEBUG=y
Build step 'Execute shell' marked build as failure


job zephyr-sanity build number 735 failed
see: https://jenkins.zephyrproject.org/job/zephyr-sanity/735/

CC kernel/sched.o
CC kernel/sem.o
CC kernel/stack.o
CC kernel/sys_clock.o
CC kernel/system_work_q.o
CC kernel/thread.o
CC kernel/thread_abort.o
CC kernel/timer.o
CC kernel/work_q.o
LD kernel/built-in.o
AR kernel/lib.a
AR libzephyr.a
LINK zephyr.lnk
/opt/zephyr-sdk-0.9/sysroots/x86_64-pokysdk-linux/usr/libexec/i586-zephyr-elfiamcu/gcc/i586-zephyr-elfiamcu/6.2.0/real-ld: zephyr_prebuilt.elf section `rodata' will not fit in region `ROM'
/opt/zephyr-sdk-0.9/sysroots/x86_64-pokysdk-linux/usr/libexec/i586-zephyr-elfiamcu/gcc/i586-zephyr-elfiamcu/6.2.0/real-ld: region `ROM' overflowed by 1448 bytes
collect2: error: ld returned 1 exit status
make[3]: *** [zephyr_prebuilt.elf] Error 1
make[3]: Target `all' not remade because of errors.
make[3]: Leaving directory `/w/workspace/zephyr-sanity/sanity-out/quark_d2000_crb/tests/kernel/common/test'
make[2]: *** [sub-make] Error 2
make[2]: Target `all' not remade because of errors.
make[2]: Leaving directory `/w/workspace/zephyr-sanity'
make[1]: *** [all] Error 2
make[1]: Leaving directory `/w/workspace/zephyr-sanity/tests/kernel/common'
-------------------sanity-out/quark_d2000_crb/tests/kernel/common/test/build.log--------------------
1 of 27 tests passed with 0 warnings in 42 seconds
Extra environment setting:
CONFIG_DEBUG=y
Build step 'Execute shell' marked build as failure


job zephyr-sanity build number 734 failed
see: https://jenkins.zephyrproject.org/job/zephyr-sanity/734/

-----------------sanity-out/qemu_x86/tests/net/lib/http_header_fields/test/qemu.log-----------------
qemu_x86 tests/net/lib/mqtt_packet/test FAILED: timeout
--------------------sanity-out/qemu_x86/tests/net/lib/mqtt_packet/test/qemu.log---------------------
***** BOOTING ZEPHYR OS v1.7.99 - BUILD: Apr 20 2017 12:20:12 *****
ASSERTION FAIL [num_events > 0] @ /w/workspace/zephyr-sanity/kernel/poll.c:177:
zero events
--------------------sanity-out/qemu_x86/tests/net/lib/mqtt_packet/test/qemu.log---------------------
qemu_x86 tests/net/trickle/test FAILED: timeout
------------------------sanity-out/qemu_x86/tests/net/trickle/test/qemu.log-------------------------
***** BOOTING ZEPHYR OS v1.7.99 - BUILD: Apr 20 2017 12:20:13 *****
ASSERTION FAIL [num_events > 0] @ /w/workspace/zephyr-sanity/kernel/poll.c:177:
zero events
------------------------sanity-out/qemu_x86/tests/net/trickle/test/qemu.log-------------------------
qemu_x86 tests/net/utils/test FAILED: timeout
-------------------------sanity-out/qemu_x86/tests/net/utils/test/qemu.log--------------------------
***** BOOTING ZEPHYR OS v1.7.99 - BUILD: Apr 20 2017 12:20:46 *****
ASSERTION FAIL [num_events > 0] @ /w/workspace/zephyr-sanity/kernel/poll.c:177:
zero events
-------------------------sanity-out/qemu_x86/tests/net/utils/test/qemu.log--------------------------
qemu_x86 tests/net/lib/dns_packet/test FAILED: timeout
---------------------sanity-out/qemu_x86/tests/net/lib/dns_packet/test/qemu.log---------------------
***** BOOTING ZEPHYR OS v1.7.99 - BUILD: Apr 20 2017 12:16:37 *****
ASSERTION FAIL [num_events > 0] @ /w/workspace/zephyr-sanity/kernel/poll.c:177:
zero events
---------------------sanity-out/qemu_x86/tests/net/lib/dns_packet/test/qemu.log---------------------
0 of 138 tests passed with 0 warnings in 10890 seconds
Extra environment setting:
CONFIG_ASSERT=y
Build step 'Execute shell' marked build as failure


job zephyr-sanity build number 733 failed
see: https://jenkins.zephyrproject.org/job/zephyr-sanity/733/

qemu_x86_iamcu tests/benchmarks/sys_kernel/test PASSED
qemu_cortex_m3 tests/benchmarks/app_kernel/test PASSED
qemu_x86_iamcu tests/benchmarks/app_kernel/test PASSED
6 of 9 tests passed with 0 warnings in 2700 seconds
Invalid sanity, let's retry #2
sanitycheck --inline-logs +scripts/sanity_chk/sanity_daily.args --only-failed
Generating LALR tables
Cleaning output directory /w/workspace/zephyr-sanity/sanity-out
Selecting all possible platforms per test case
Building testcase defconfigs...
3 tests selected, 16061 tests discarded due to filters
qemu_riscv32 tests/kernel/timer/timer_monotonic/test FAILED: failed
--------------sanity-out/qemu_riscv32/tests/kernel/timer/timer_monotonic/test/qemu.log--------------
***** BOOTING ZEPHYR OS v1.7.99 - BUILD: Apr 20 2017 06:02:06 *****
sys_clock_us_per_tick = 10000
sys_clock_hw_cycles_per_tick = 100000
sys_clock_hw_cycles_per_sec = 10000000
tc_start() - test monotonic timer
Cycle results appear to be monotonic
Testing system tick frequency
delta: 13094612 expected: 10000000 130%
Clock calibration is way off!
===================================================================
PROJECT EXECUTION FAILED
--------------sanity-out/qemu_riscv32/tests/kernel/timer/timer_monotonic/test/qemu.log--------------
qemu_x86_iamcu tests/kernel/timer/timer_monotonic/test PASSED
qemu_x86 tests/kernel/timer/timer_monotonic/test PASSED
2 of 3 tests passed with 0 warnings in 12 seconds
Build step 'Execute shell' marked build as failure