zephyr/master: daily build zephyr-kernel-1.7.99-170420-37352c8 Failure


donotreply@...
 

zephyr/master: daily build zephyr-kernel-1.7.99-170420-37352c8 Failure



job zephyr-sanity build number 740 failed
see: https://jenkins.zephyrproject.org/job/zephyr-sanity/740/

CC kernel/timer.o
make[5]: *** [subsys/bluetooth/host] Error 2
make[5]: Target `__build' not remade because of errors.
make[4]: *** [subsys/bluetooth] Error 2
make[4]: Target `__build' not remade because of errors.
make[3]: *** [subsys] Error 2
CC kernel/work_q.o
LD kernel/built-in.o
AR kernel/lib.a
make[3]: Target `all' not remade because of errors.
make[3]: Leaving directory `/w/workspace/zephyr-sanity/sanity-out/qemu_cortex_m3/tests/bluetooth/init/test_21'
make[2]: *** [sub-make] Error 2
make[2]: Target `all' not remade because of errors.
make[2]: Leaving directory `/w/workspace/zephyr-sanity'
make[1]: *** [all] Error 2
make[1]: Leaving directory `/w/workspace/zephyr-sanity/tests/bluetooth/init'
Generating LALR tables
------------------sanity-out/qemu_cortex_m3/tests/bluetooth/init/test_21/build.log------------------
qemu_x86 tests/net/lib/dns_packet/test FAILED: timeout
---------------------sanity-out/qemu_x86/tests/net/lib/dns_packet/test/qemu.log---------------------
***** BOOTING ZEPHYR OS v1.7.99 - BUILD: Apr 21 2017 09:22:34 *****
ASSERTION FAIL [num_events > 0] @ /w/workspace/zephyr-sanity/kernel/poll.c:177:
zero events
---------------------sanity-out/qemu_x86/tests/net/lib/dns_packet/test/qemu.log---------------------
0 of 163 tests passed with 0 warnings in 11233 seconds
Extra environment setting:
CONFIG_ASSERT=y
CONFIG_DEBUG=y
Build step 'Execute shell' marked build as failure


job zephyr-sanity build number 739 failed
see: https://jenkins.zephyrproject.org/job/zephyr-sanity/739/

at hudson.remoting.RemoteInvocationHandler.invoke(RemoteInvocationHandler.java:249)
... 8 more
[PostBuildScript] - Execution post build scripts.
ERROR: Build step failed with exception
java.lang.NullPointerException: no such build node: ubuntu1404-basebuild-8c-8g-4500
at hudson.tasks.CommandInterpreter.perform(CommandInterpreter.java:72)
at hudson.tasks.CommandInterpreter.perform(CommandInterpreter.java:64)
at org.jenkinsci.plugins.postbuildscript.PostBuildScript.processBuildSteps(PostBuildScript.java:204)
at org.jenkinsci.plugins.postbuildscript.PostBuildScript.processScripts(PostBuildScript.java:143)
at org.jenkinsci.plugins.postbuildscript.PostBuildScript._perform(PostBuildScript.java:105)
at org.jenkinsci.plugins.postbuildscript.PostBuildScript.perform(PostBuildScript.java:85)
at hudson.tasks.BuildStepMonitor$1.perform(BuildStepMonitor.java:20)
at hudson.model.AbstractBuild$AbstractBuildExecution.perform(AbstractBuild.java:779)
at hudson.model.AbstractBuild$AbstractBuildExecution.performAllBuildSteps(AbstractBuild.java:720)
at hudson.model.Build$BuildExecution.post2(Build.java:185)
at hudson.model.AbstractBuild$AbstractBuildExecution.post(AbstractBuild.java:665)
at hudson.model.Run.execute(Run.java:1766)
at hudson.model.FreeStyleBuild.run(FreeStyleBuild.java:43)
at hudson.model.ResourceController.execute(ResourceController.java:98)
at hudson.model.Executor.run(Executor.java:410)
Build step 'Execute a set of scripts' marked build as failure
Notifying upstream projects of job completion
Notifying upstream of completion: zephyr-master-daily #255
[Join] Pending does not contain zephyr-sanity
ERROR: Step ‘Delete workspace when build is done’ failed: no workspace for zephyr-sanity #739
Warning: you have no plugins providing access control for builds, so falling back to legacy behavior of permitting any downstream builds to be triggered
Notifying upstream build zephyr-master-daily #255 of job completion
Triggering a new build of zephyr-report-daily
Finished: FAILURE


job zephyr-sanity build number 738 failed
see: https://jenkins.zephyrproject.org/job/zephyr-sanity/738/

--------------------sanity-out/arduino_101/tests/bluetooth/shell/test/build.log---------------------
qemu_x86 tests/net/lib/mqtt_packet/test FAILED: timeout
--------------------sanity-out/qemu_x86/tests/net/lib/mqtt_packet/test/qemu.log---------------------
***** BOOTING ZEPHYR OS v1.7.99 - BUILD: Apr 21 2017 14:42:44 *****
ASSERTION FAIL [num_events > 0] @ /w/workspace/zephyr-sanity/kernel/poll.c:177:
zero events
--------------------sanity-out/qemu_x86/tests/net/lib/mqtt_packet/test/qemu.log---------------------
qemu_x86 tests/net/trickle/test FAILED: timeout
------------------------sanity-out/qemu_x86/tests/net/trickle/test/qemu.log-------------------------
***** BOOTING ZEPHYR OS v1.7.99 - BUILD: Apr 21 2017 14:42:41 *****
ASSERTION FAIL [num_events > 0] @ /w/workspace/zephyr-sanity/kernel/poll.c:177:
zero events
------------------------sanity-out/qemu_x86/tests/net/trickle/test/qemu.log-------------------------
qemu_x86 tests/net/neighbor/test FAILED: timeout
------------------------sanity-out/qemu_x86/tests/net/neighbor/test/qemu.log------------------------
***** BOOTING ZEPHYR OS v1.7.99 - BUILD: Apr 21 2017 14:43:27 *****
ASSERTION FAIL [num_events > 0] @ /w/workspace/zephyr-sanity/kernel/poll.c:177:
zero events
------------------------sanity-out/qemu_x86/tests/net/neighbor/test/qemu.log------------------------
qemu_x86 tests/net/lib/dns_packet/test FAILED: timeout
---------------------sanity-out/qemu_x86/tests/net/lib/dns_packet/test/qemu.log---------------------
***** BOOTING ZEPHYR OS v1.7.99 - BUILD: Apr 21 2017 14:35:05 *****
ASSERTION FAIL [num_events > 0] @ /w/workspace/zephyr-sanity/kernel/poll.c:177:
zero events
---------------------sanity-out/qemu_x86/tests/net/lib/dns_packet/test/qemu.log---------------------
0 of 143 tests passed with 0 warnings in 11104 seconds
Extra environment setting:
CONFIG_ASSERT=y
Build step 'Execute shell' marked build as failure


job zephyr-sanity build number 737 failed
see: https://jenkins.zephyrproject.org/job/zephyr-sanity/737/

CC kernel/mem_pool.o
LD drivers/timer/built-in.o
CC kernel/msg_q.o
LD drivers/pci/built-in.o
LD drivers/built-in.o
CC kernel/mutex.o
CC kernel/pipes.o
CC kernel/queue.o
CC kernel/sched.o
CC kernel/sem.o
CC kernel/stack.o
CC kernel/sys_clock.o
CC kernel/system_work_q.o
CC kernel/thread.o
CC kernel/thread_abort.o
CC kernel/timer.o
CC kernel/work_q.o
LD kernel/built-in.o
AR kernel/lib.a
make[3]: Target `all' not remade because of errors.
make[3]: Leaving directory `/w/workspace/zephyr-sanity/sanity-out/galileo/tests/kernel/test_build/test_newlib'
make[2]: *** [sub-make] Error 2
make[2]: Target `all' not remade because of errors.
make[2]: Leaving directory `/w/workspace/zephyr-sanity'
make[1]: *** [all] Error 2
make[1]: Leaving directory `/w/workspace/zephyr-sanity/tests/kernel/test_build'
------------------sanity-out/galileo/tests/kernel/test_build/test_newlib/build.log------------------
0 of 1 tests passed with 0 warnings in 3 seconds
Build step 'Execute shell' marked build as failure